You are viewing a plain text version of this content. The canonical link for it is here.
Posted to builds@cassandra.apache.org by Apache Jenkins Server <je...@builds.apache.org> on 2023/06/06 17:35:45 UTC

Build complete: Cassandra-trunk #1590 [UNSTABLE] a2dc44f0725b02294071e67d0cab57a7629f25a1

-------------------------------------------------------------------------------
Build Cassandra-trunk #1590 Still Unstable
URL: https://ci-cassandra.apache.org/job/Cassandra-trunk/1590/
-------------------------------------------------------------------------------
Changes:
[Stefan Miklosovic] Remove dependency on pytz library for setting CQLSH timezones on Python


-------------------------------------------------------------------------------
Failed Tests:
10 tests failed.
FAILED:  dtest-novnode.cqlsh_tests.test_cqlsh_copy.TestCqlshCopy.test_bulk_round_trip_blogposts
FAILED:  dtest-novnode.materialized_views_test.TestMaterializedViewsConsistency.test_multi_partition_consistent_reads_after_write
FAILED:  dtest-offheap.replace_address_test.TestReplaceAddress.test_fail_without_replace
FAILED:  dtest.disk_balance_test.TestDiskBalance.test_disk_balance_after_joining_ring_stcs
FAILED:  dtest.cqlsh_tests.test_cqlsh_copy.TestCqlshCopy.test_bulk_round_trip_blogposts
FAILED:  dtest.repair_tests.repair_test.TestRepair.test_dc_parallel_repair
FAILED:  org.apache.cassandra.distributed.upgrade.MixedModeAvailabilityV3XAllOneTest.testAvailabilityCoordinatorUpgraded-.jdk11
FAILED:  org.apache.cassandra.transport.DriverBurnTest.measureLargeV4WithCompression-.jdk17
FAILED:  org.apache.cassandra.cql3.ViewComplexLivenessTest.testStrictLivenessTombstone[0]-cdc.jdk1.8
FAILED:  org.apache.cassandra.distributed.upgrade.MixedModeAvailabilityV30AllOneTest.testAvailabilityCoordinatorUpgraded-.jdk11

-------------------------------------------------------------------------------
For complete test report and logs see https://nightlies.apache.org/cassandra/Cassandra-trunk/1590/