You are viewing a plain text version of this content. The canonical link for it is here.
Posted to issues@tez.apache.org by Apache Jenkins Server <je...@builds.apache.org> on 2015/03/31 17:40:43 UTC
Failed: TEZ-2226 PreCommit Build #372
Jira: https://issues.apache.org/jira/browse/TEZ-2226
Build: https://builds.apache.org/job/PreCommit-TEZ-Build/372/
###################################################################################
########################## LAST 60 LINES OF THE CONSOLE ###########################
[...truncated 2192 lines...]
{color:red}-1 overall{color}. Here are the results of testing the latest attachment
http://issues.apache.org/jira/secure/attachment/12708442/TEZ-2226.3.patch
against master revision 3bfe003.
{color:green}+1 @author{color}. The patch does not contain any @author tags.
{color:red}-1 tests included{color}. The patch doesn't appear to include any new or modified tests.
Please justify why no new tests are needed for this patch.
Also please list what manual steps were performed to verify this patch.
{color:green}+1 javac{color}. The applied patch does not increase the total number of javac compiler warnings.
{color:green}+1 javadoc{color}. There were no new javadoc warning messages.
{color:green}+1 findbugs{color}. The patch does not introduce any new Findbugs (version 2.0.3) warnings.
{color:green}+1 release audit{color}. The applied patch does not increase the total number of release audit warnings.
{color:red}-1 core tests{color}. The patch failed these unit tests in :
org.apache.tez.runtime.library.common.shuffle.impl.TestShuffleInputEventHandlerImpl
org.apache.tez.runtime.library.common.shuffle.TestFetcher
Test results: https://builds.apache.org/job/PreCommit-TEZ-Build/372//testReport/
Console output: https://builds.apache.org/job/PreCommit-TEZ-Build/372//console
This message is automatically generated.
======================================================================
======================================================================
Adding comment to Jira.
======================================================================
======================================================================
Comment added.
53e3dd8bd982aae4a9ea5a94df36a9958ca84a58 logged out
======================================================================
======================================================================
Finished build.
======================================================================
======================================================================
Build step 'Execute shell' marked build as failure
Archiving artifacts
Sending artifact delta relative to PreCommit-TEZ-Build #371
Archived 44 artifacts
Archive block size is 32768
Received 2 blocks and 2634702 bytes
Compression is 2.4%
Took 0.82 sec
[description-setter] Could not determine description.
Recording test results
Email was triggered for: Failure
Sending email for trigger: Failure
###################################################################################
############################## FAILED TESTS (if any) ##############################
3 tests failed.
REGRESSION: org.apache.tez.runtime.library.common.shuffle.TestFetcher.testSetupLocalDiskFetch
Error Message:
test timed out after 3000 milliseconds
Stack Trace:
java.lang.Exception: test timed out after 3000 milliseconds
at java.net.PlainDatagramSocketImpl.receive0(Native Method)
at java.net.AbstractPlainDatagramSocketImpl.receive(AbstractPlainDatagramSocketImpl.java:145)
at java.net.DatagramSocket.receive(DatagramSocket.java:786)
at com.sun.jndi.dns.DnsClient.doUdpQuery(DnsClient.java:416)
at com.sun.jndi.dns.DnsClient.query(DnsClient.java:210)
at com.sun.jndi.dns.Resolver.query(Resolver.java:81)
at com.sun.jndi.dns.DnsContext.c_getAttributes(DnsContext.java:430)
at com.sun.jndi.toolkit.ctx.ComponentDirContext.p_getAttributes(ComponentDirContext.java:231)
at com.sun.jndi.toolkit.ctx.PartialCompositeDirContext.getAttributes(PartialCompositeDirContext.java:139)
at com.sun.jndi.toolkit.url.GenericURLDirContext.getAttributes(GenericURLDirContext.java:103)
at sun.security.krb5.KrbServiceLocator.getKerberosService(KrbServiceLocator.java:87)
at sun.security.krb5.Config.checkRealm(Config.java:1295)
at sun.security.krb5.Config.getRealmFromDNS(Config.java:1268)
at sun.security.krb5.Config.getDefaultRealm(Config.java:1162)
at sun.reflect.NativeMethodAccessorImpl.invoke0(Native Method)
at sun.reflect.NativeMethodAccessorImpl.invoke(NativeMethodAccessorImpl.java:57)
at sun.reflect.DelegatingMethodAccessorImpl.invoke(DelegatingMethodAccessorImpl.java:43)
at java.lang.reflect.Method.invoke(Method.java:606)
at org.apache.hadoop.security.authentication.util.KerberosUtil.getDefaultRealm(KerberosUtil.java:84)
at org.apache.hadoop.security.authentication.util.KerberosName.<clinit>(KerberosName.java:86)
at org.apache.hadoop.security.UserGroupInformation.initialize(UserGroupInformation.java:261)
at org.apache.hadoop.security.UserGroupInformation.ensureInitialized(UserGroupInformation.java:248)
at org.apache.hadoop.security.UserGroupInformation.loginUserFromSubject(UserGroupInformation.java:763)
at org.apache.hadoop.security.UserGroupInformation.getLoginUser(UserGroupInformation.java:748)
at org.apache.hadoop.security.UserGroupInformation.getCurrentUser(UserGroupInformation.java:621)
at org.apache.hadoop.fs.FileSystem$Cache$Key.<init>(FileSystem.java:2753)
at org.apache.hadoop.fs.FileSystem$Cache$Key.<init>(FileSystem.java:2745)
at org.apache.hadoop.fs.FileSystem$Cache.get(FileSystem.java:2611)
at org.apache.hadoop.fs.FileSystem.get(FileSystem.java:370)
at org.apache.hadoop.fs.FileSystem.getLocal(FileSystem.java:341)
at org.apache.tez.runtime.library.common.shuffle.LocalDiskFetchedInput.<init>(LocalDiskFetchedInput.java:50)
at org.apache.tez.runtime.library.common.shuffle.Fetcher.doLocalDiskFetch(Fetcher.java:538)
at org.apache.tez.runtime.library.common.shuffle.Fetcher.setupLocalDiskFetch(Fetcher.java:517)
at org.apache.tez.runtime.library.common.shuffle.Fetcher$$EnhancerByMockitoWithCGLIB$$9d865341.CGLIB$setupLocalDiskFetch$3(<generated>)
at org.apache.tez.runtime.library.common.shuffle.Fetcher$$EnhancerByMockitoWithCGLIB$$9d865341$$FastClassByMockitoWithCGLIB$$17f2a413.invoke(<generated>)
at org.mockito.cglib.proxy.MethodProxy.invokeSuper(MethodProxy.java:216)
at org.mockito.internal.creation.AbstractMockitoMethodProxy.invokeSuper(AbstractMockitoMethodProxy.java:10)
at org.mockito.internal.invocation.realmethod.CGLIBProxyRealMethod.invoke(CGLIBProxyRealMethod.java:22)
at org.mockito.internal.invocation.realmethod.FilteredCGLIBProxyRealMethod.invoke(FilteredCGLIBProxyRealMethod.java:27)
at org.mockito.internal.invocation.InvocationImpl.callRealMethod(InvocationImpl.java:112)
at org.mockito.internal.stubbing.answers.CallsRealMethods.answer(CallsRealMethods.java:36)
at org.mockito.internal.handler.MockHandlerImpl.handle(MockHandlerImpl.java:93)
at org.mockito.internal.handler.NullResultGuardian.handle(NullResultGuardian.java:29)
at org.mockito.internal.handler.InvocationNotifierHandler.handle(InvocationNotifierHandler.java:38)
at org.mockito.internal.creation.MethodInterceptorFilter.intercept(MethodInterceptorFilter.java:61)
at org.apache.tez.runtime.library.common.shuffle.Fetcher$$EnhancerByMockitoWithCGLIB$$9d865341.setupLocalDiskFetch(<generated>)
at org.apache.tez.runtime.library.common.shuffle.Fetcher.callInternal(Fetcher.java:190)
at org.apache.tez.runtime.library.common.shuffle.Fetcher$$EnhancerByMockitoWithCGLIB$$9d865341.CGLIB$callInternal$1(<generated>)
at org.apache.tez.runtime.library.common.shuffle.Fetcher$$EnhancerByMockitoWithCGLIB$$9d865341$$FastClassByMockitoWithCGLIB$$17f2a413.invoke(<generated>)
at org.mockito.cglib.proxy.MethodProxy.invokeSuper(MethodProxy.java:216)
at org.mockito.internal.creation.AbstractMockitoMethodProxy.invokeSuper(AbstractMockitoMethodProxy.java:10)
at org.mockito.internal.invocation.realmethod.CGLIBProxyRealMethod.invoke(CGLIBProxyRealMethod.java:22)
at org.mockito.internal.invocation.realmethod.FilteredCGLIBProxyRealMethod.invoke(FilteredCGLIBProxyRealMethod.java:27)
at org.mockito.internal.invocation.InvocationImpl.callRealMethod(InvocationImpl.java:112)
at org.mockito.internal.stubbing.answers.CallsRealMethods.answer(CallsRealMethods.java:36)
at org.mockito.internal.handler.MockHandlerImpl.handle(MockHandlerImpl.java:93)
at org.mockito.internal.handler.NullResultGuardian.handle(NullResultGuardian.java:29)
at org.mockito.internal.handler.InvocationNotifierHandler.handle(InvocationNotifierHandler.java:38)
at org.mockito.internal.creation.MethodInterceptorFilter.intercept(MethodInterceptorFilter.java:61)
at org.apache.tez.runtime.library.common.shuffle.Fetcher$$EnhancerByMockitoWithCGLIB$$9d865341.callInternal(<generated>)
at org.apache.tez.runtime.library.common.shuffle.Fetcher.callInternal(Fetcher.java:72)
at org.apache.tez.common.CallableWithNdc.call(CallableWithNdc.java:36)
at org.apache.tez.runtime.library.common.shuffle.TestFetcher.testSetupLocalDiskFetch(TestFetcher.java:152)
REGRESSION: org.apache.tez.runtime.library.common.shuffle.impl.TestShuffleInputEventHandlerImpl.testPipelinedShuffleEvents_WithOutOfOrderAttempts
Error Message:
test timed out after 5000 milliseconds
Stack Trace:
java.lang.Exception: test timed out after 5000 milliseconds
at java.net.PlainDatagramSocketImpl.receive0(Native Method)
at java.net.AbstractPlainDatagramSocketImpl.receive(AbstractPlainDatagramSocketImpl.java:145)
at java.net.DatagramSocket.receive(DatagramSocket.java:786)
at com.sun.jndi.dns.DnsClient.doUdpQuery(DnsClient.java:416)
at com.sun.jndi.dns.DnsClient.query(DnsClient.java:210)
at com.sun.jndi.dns.Resolver.query(Resolver.java:81)
at com.sun.jndi.dns.DnsContext.c_getAttributes(DnsContext.java:430)
at com.sun.jndi.toolkit.ctx.ComponentDirContext.p_getAttributes(ComponentDirContext.java:231)
at com.sun.jndi.toolkit.ctx.PartialCompositeDirContext.getAttributes(PartialCompositeDirContext.java:139)
at com.sun.jndi.toolkit.url.GenericURLDirContext.getAttributes(GenericURLDirContext.java:103)
at sun.security.krb5.KrbServiceLocator.getKerberosService(KrbServiceLocator.java:87)
at sun.security.krb5.Config.checkRealm(Config.java:1295)
at sun.security.krb5.Config.getRealmFromDNS(Config.java:1268)
at sun.security.krb5.Config.getDefaultRealm(Config.java:1162)
at sun.reflect.NativeMethodAccessorImpl.invoke0(Native Method)
at sun.reflect.NativeMethodAccessorImpl.invoke(NativeMethodAccessorImpl.java:57)
at sun.reflect.DelegatingMethodAccessorImpl.invoke(DelegatingMethodAccessorImpl.java:43)
at java.lang.reflect.Method.invoke(Method.java:606)
at org.apache.hadoop.security.authentication.util.KerberosUtil.getDefaultRealm(KerberosUtil.java:84)
at org.apache.hadoop.security.authentication.util.KerberosName.<clinit>(KerberosName.java:86)
at org.apache.hadoop.security.UserGroupInformation.initialize(UserGroupInformation.java:261)
at org.apache.hadoop.security.UserGroupInformation.ensureInitialized(UserGroupInformation.java:248)
at org.apache.hadoop.security.UserGroupInformation.loginUserFromSubject(UserGroupInformation.java:763)
at org.apache.hadoop.security.UserGroupInformation.getLoginUser(UserGroupInformation.java:748)
at org.apache.hadoop.security.UserGroupInformation.getCurrentUser(UserGroupInformation.java:621)
at org.apache.hadoop.fs.FileSystem$Cache$Key.<init>(FileSystem.java:2753)
at org.apache.hadoop.fs.FileSystem$Cache$Key.<init>(FileSystem.java:2745)
at org.apache.hadoop.fs.FileSystem$Cache.get(FileSystem.java:2611)
at org.apache.hadoop.fs.FileSystem.get(FileSystem.java:370)
at org.apache.hadoop.fs.FileSystem.getLocal(FileSystem.java:341)
at org.apache.tez.runtime.library.common.shuffle.impl.ShuffleManager.<init>(ShuffleManager.java:245)
at org.apache.tez.runtime.library.common.shuffle.impl.TestShuffleInputEventHandlerImpl.createShuffleManager(TestShuffleInputEventHandlerImpl.java:180)
at org.apache.tez.runtime.library.common.shuffle.impl.TestShuffleInputEventHandlerImpl.testPipelinedShuffleEvents_WithOutOfOrderAttempts(TestShuffleInputEventHandlerImpl.java:233)
REGRESSION: org.apache.tez.runtime.library.common.shuffle.impl.TestShuffleInputEventHandlerImpl.testPipelinedShuffleEvents_WithEmptyPartitions
Error Message:
test timed out after 5000 milliseconds
Stack Trace:
java.lang.Exception: test timed out after 5000 milliseconds
at org.apache.hadoop.security.UserGroupInformation.getCurrentUser(UserGroupInformation.java:618)
at org.apache.hadoop.fs.FileSystem$Cache$Key.<init>(FileSystem.java:2753)
at org.apache.hadoop.fs.FileSystem$Cache$Key.<init>(FileSystem.java:2745)
at org.apache.hadoop.fs.FileSystem$Cache.get(FileSystem.java:2611)
at org.apache.hadoop.fs.FileSystem.get(FileSystem.java:370)
at org.apache.hadoop.fs.FileSystem.getLocal(FileSystem.java:341)
at org.apache.tez.runtime.library.common.shuffle.impl.ShuffleManager.<init>(ShuffleManager.java:245)
at org.apache.tez.runtime.library.common.shuffle.impl.TestShuffleInputEventHandlerImpl.createShuffleManager(TestShuffleInputEventHandlerImpl.java:180)
at org.apache.tez.runtime.library.common.shuffle.impl.TestShuffleInputEventHandlerImpl.testPipelinedShuffleEvents_WithEmptyPartitions(TestShuffleInputEventHandlerImpl.java:262)
Success: TEZ-2192 PreCommit Build #373
Posted by Apache Jenkins Server <je...@builds.apache.org>.
Jira: https://issues.apache.org/jira/browse/TEZ-2192
Build: https://builds.apache.org/job/PreCommit-TEZ-Build/373/
###################################################################################
########################## LAST 60 LINES OF THE CONSOLE ###########################
[...truncated 2758 lines...]
[INFO] Final Memory: 71M/967M
[INFO] ------------------------------------------------------------------------
{color:green}+1 overall{color}. Here are the results of testing the latest attachment
http://issues.apache.org/jira/secure/attachment/12708484/TEZ-2192.1.patch
against master revision 3bfe003.
{color:green}+1 @author{color}. The patch does not contain any @author tags.
{color:green}+1 tests included{color}. The patch appears to include 2 new or modified test files.
{color:green}+1 javac{color}. The applied patch does not increase the total number of javac compiler warnings.
{color:green}+1 javadoc{color}. There were no new javadoc warning messages.
{color:green}+1 findbugs{color}. The patch does not introduce any new Findbugs (version 2.0.3) warnings.
{color:green}+1 release audit{color}. The applied patch does not increase the total number of release audit warnings.
{color:green}+1 core tests{color}. The patch passed unit tests in .
Test results: https://builds.apache.org/job/PreCommit-TEZ-Build/373//testReport/
Console output: https://builds.apache.org/job/PreCommit-TEZ-Build/373//console
This message is automatically generated.
======================================================================
======================================================================
Adding comment to Jira.
======================================================================
======================================================================
Comment added.
adced8ca8c1f43aab6d5133225b359d397140cc5 logged out
======================================================================
======================================================================
Finished build.
======================================================================
======================================================================
Archiving artifacts
Sending artifact delta relative to PreCommit-TEZ-Build #371
Archived 69 artifacts
Archive block size is 32768
Received 0 blocks and 7218226 bytes
Compression is 0.0%
Took 2.8 sec
Description set: TEZ-2192
Recording test results
Email was triggered for: Success
Sending email for trigger: Success
###################################################################################
############################## FAILED TESTS (if any) ##############################
All tests passed