You are viewing a plain text version of this content. The canonical link for it is here.
Posted to dev@kafka.apache.org by Apache Jenkins Server <je...@builds.apache.org> on 2023/11/29 09:52:52 UTC
Build failed in Jenkins: Kafka » Kafka Branch Builder » trunk #2427
See <https://ci-builds.apache.org/job/Kafka/job/kafka/job/trunk/2427/display/redirect>
Changes:
------------------------------------------
[...truncated 433105 lines...]
Gradle Test Run :core:test > Gradle Test Executor 92 > ZkConfigMigrationClientTest > testWriteNewTopicConfigs() STARTED
Gradle Test Run :core:test > Gradle Test Executor 92 > ZkConfigMigrationClientTest > testWriteNewTopicConfigs() PASSED
Gradle Test Run :core:test > Gradle Test Executor 92 > ZkConfigMigrationClientTest > testDelegationTokens() STARTED
Gradle Test Run :core:test > Gradle Test Executor 92 > ZkConfigMigrationClientTest > testDelegationTokens() PASSED
Gradle Test Run :core:test > Gradle Test Executor 92 > ZkConfigMigrationClientTest > testWriteNewClientQuotas() STARTED
Gradle Test Run :core:test > Gradle Test Executor 92 > ZkConfigMigrationClientTest > testWriteNewClientQuotas() PASSED
Gradle Test Run :core:test > Gradle Test Executor 92 > ZkConfigMigrationClientTest > testWriteExistingTopicConfigs() STARTED
Gradle Test Run :core:test > Gradle Test Executor 92 > ZkConfigMigrationClientTest > testWriteExistingTopicConfigs() PASSED
Gradle Test Run :core:test > Gradle Test Executor 92 > ZkConfigMigrationClientTest > testWriteExistingClientQuotas() STARTED
Gradle Test Run :core:test > Gradle Test Executor 92 > ZkConfigMigrationClientTest > testWriteExistingClientQuotas() PASSED
Gradle Test Run :core:test > Gradle Test Executor 92 > ZkConfigMigrationClientTest > testScramAndQuotaChangesInSnapshot() STARTED
Gradle Test Run :core:test > Gradle Test Executor 92 > ZkConfigMigrationClientTest > testScramAndQuotaChangesInSnapshot() PASSED
Gradle Test Run :core:test > Gradle Test Executor 92 > VerificationGuardTest > testEqualsAndHashCode() STARTED
Gradle Test Run :core:test > Gradle Test Executor 92 > VerificationGuardTest > testEqualsAndHashCode() PASSED
Gradle Test Run :core:test > Gradle Test Executor 92 > VerificationGuardTest > testVerify() STARTED
Gradle Test Run :core:test > Gradle Test Executor 92 > VerificationGuardTest > testVerify() PASSED
Gradle Test Run :core:test > Gradle Test Executor 101 > FetchFromFollowerIntegrationTest > testRackAwareRangeAssignor(String) > testRackAwareRangeAssignor(String).quorum=zk STARTED
Gradle Test Run :core:test > Gradle Test Executor 101 > FetchFromFollowerIntegrationTest > testRackAwareRangeAssignor(String) > testRackAwareRangeAssignor(String).quorum=zk PASSED
Gradle Test Run :core:test > Gradle Test Executor 101 > FetchFromFollowerIntegrationTest > testRackAwareRangeAssignor(String) > testRackAwareRangeAssignor(String).quorum=kraft STARTED
Gradle Test Run :core:test > Gradle Test Executor 92 > ZkMigrationIntegrationTest > testMigrateTopicDeletions(ClusterInstance) > [3] Type=ZK, MetadataVersion=3.6-IV2, Security=PLAINTEXT SKIPPED
Gradle Test Run :core:test > Gradle Test Executor 92 > ZkMigrationIntegrationTest > testMigrateTopicDeletions(ClusterInstance) > [4] Type=ZK, MetadataVersion=3.7-IV0, Security=PLAINTEXT STARTED
Gradle Test Run :core:test > Gradle Test Executor 101 > FetchFromFollowerIntegrationTest > testRackAwareRangeAssignor(String) > testRackAwareRangeAssignor(String).quorum=kraft PASSED
Gradle Test Run :core:test > Gradle Test Executor 101 > SaslPlainPlaintextConsumerTest > testCoordinatorFailover(String, String) > testCoordinatorFailover(String, String).quorum=zk.groupProtocol=generic STARTED
Gradle Test Run :core:test > Gradle Test Executor 101 > SaslPlainPlaintextConsumerTest > testCoordinatorFailover(String, String) > testCoordinatorFailover(String, String).quorum=zk.groupProtocol=generic PASSED
Gradle Test Run :core:test > Gradle Test Executor 101 > SaslPlainPlaintextConsumerTest > testCoordinatorFailover(String, String) > testCoordinatorFailover(String, String).quorum=kraft.groupProtocol=generic STARTED
Gradle Test Run :core:test > Gradle Test Executor 101 > SaslPlainPlaintextConsumerTest > testCoordinatorFailover(String, String) > testCoordinatorFailover(String, String).quorum=kraft.groupProtocol=generic PASSED
Gradle Test Run :core:test > Gradle Test Executor 101 > SaslPlainPlaintextConsumerTest > testCoordinatorFailover(String, String) > testCoordinatorFailover(String, String).quorum=kraft+kip848.groupProtocol=generic STARTED
Gradle Test Run :core:test > Gradle Test Executor 101 > SaslPlainPlaintextConsumerTest > testCoordinatorFailover(String, String) > testCoordinatorFailover(String, String).quorum=kraft+kip848.groupProtocol=generic PASSED
5305 tests completed, 2 failed, 15 skipped
There were failing tests. See the report at: file:///home/jenkins/workspace/Kafka_kafka_trunk/core/build/reports/tests/test/index.html
Gradle Test Run :core:test > Gradle Test Executor 92 > ZkMigrationIntegrationTest > testMigrateTopicDeletions(ClusterInstance) > [4] Type=ZK, MetadataVersion=3.7-IV0, Security=PLAINTEXT SKIPPED
Gradle Test Run :core:test > Gradle Test Executor 92 > ZkMigrationIntegrationTest > testMigrateTopicDeletions(ClusterInstance) > [5] Type=ZK, MetadataVersion=3.7-IV1, Security=PLAINTEXT STARTED
Deprecated Gradle features were used in this build, making it incompatible with Gradle 9.0.
You can use '--warning-mode all' to show the individual deprecation warnings and determine if they come from your own scripts or plugins.
For more on this, please refer to https://docs.gradle.org/8.3/userguide/command_line_interface.html#sec:command_line_warnings in the Gradle documentation.
BUILD SUCCESSFUL in 4h 6m
311 actionable tasks: 115 executed, 196 up-to-date
Publishing build scan...
https://ge.apache.org/s/ndzem7phwthlw
See the profiling report at: file:///home/jenkins/workspace/Kafka_kafka_trunk/build/reports/profile/profile-2023-11-29-05-25-39.html
A fine-grained performance profile is available: use the --scan option.
[Pipeline] junit
Recording test results
Gradle Test Run :core:test > Gradle Test Executor 92 > ZkMigrationIntegrationTest > testMigrateTopicDeletions(ClusterInstance) > [5] Type=ZK, MetadataVersion=3.7-IV1, Security=PLAINTEXT SKIPPED
Gradle Test Run :core:test > Gradle Test Executor 92 > ZkMigrationIntegrationTest > testDualWriteScram(ClusterInstance) > [1] Type=ZK, Name=testDualWriteScram, MetadataVersion=3.5-IV2, Security=PLAINTEXT STARTED
Gradle Test Run :core:test > Gradle Test Executor 92 > ZkMigrationIntegrationTest > testDualWriteScram(ClusterInstance) > [1] Type=ZK, Name=testDualWriteScram, MetadataVersion=3.5-IV2, Security=PLAINTEXT PASSED
Gradle Test Run :core:test > Gradle Test Executor 92 > ZkMigrationIntegrationTest > testNewAndChangedTopicsInDualWrite(ClusterInstance) > [1] Type=ZK, Name=testNewAndChangedTopicsInDualWrite, MetadataVersion=3.4-IV0, Security=PLAINTEXT STARTED
Gradle Test Run :core:test > Gradle Test Executor 92 > ZkMigrationIntegrationTest > testNewAndChangedTopicsInDualWrite(ClusterInstance) > [1] Type=ZK, Name=testNewAndChangedTopicsInDualWrite, MetadataVersion=3.4-IV0, Security=PLAINTEXT PASSED
Gradle Test Run :core:test > Gradle Test Executor 92 > ZkMigrationIntegrationTest > testDualWriteQuotaAndScram(ClusterInstance) > [1] Type=ZK, Name=testDualWriteQuotaAndScram, MetadataVersion=3.5-IV2, Security=PLAINTEXT STARTED
[Checks API] No suitable checks publisher found.
[Pipeline] echo
Skipping Kafka Streams archetype test for Java 11
[Pipeline] }
[Pipeline] // withEnv
[Pipeline] }
[Pipeline] // withEnv
[Pipeline] }
[Pipeline] // withEnv
[Pipeline] }
[Pipeline] // node
[Pipeline] }
[Pipeline] // timestamps
[Pipeline] }
[Pipeline] // timeout
[Pipeline] }
[Pipeline] // stage
[Pipeline] }
Gradle Test Run :core:test > Gradle Test Executor 92 > ZkMigrationIntegrationTest > testDualWriteQuotaAndScram(ClusterInstance) > [1] Type=ZK, Name=testDualWriteQuotaAndScram, MetadataVersion=3.5-IV2, Security=PLAINTEXT PASSED
Gradle Test Run :core:test > Gradle Test Executor 92 > ZkMigrationIntegrationTest > testMigrate(ClusterInstance) > [1] Type=ZK, Name=testMigrate, MetadataVersion=3.4-IV0, Security=PLAINTEXT STARTED
Gradle Test Run :core:test > Gradle Test Executor 92 > ZkMigrationIntegrationTest > testMigrate(ClusterInstance) > [1] Type=ZK, Name=testMigrate, MetadataVersion=3.4-IV0, Security=PLAINTEXT PASSED
Gradle Test Run :core:test > Gradle Test Executor 92 > ZkMigrationIntegrationTest > testMigrateAcls(ClusterInstance) > [1] Type=ZK, Name=testMigrateAcls, MetadataVersion=3.4-IV0, Security=PLAINTEXT STARTED
Gradle Test Run :core:test > Gradle Test Executor 92 > ZkMigrationIntegrationTest > testMigrateAcls(ClusterInstance) > [1] Type=ZK, Name=testMigrateAcls, MetadataVersion=3.4-IV0, Security=PLAINTEXT PASSED
Gradle Test Run :core:test > Gradle Test Executor 92 > ZkMigrationIntegrationTest > testStartZkBrokerWithAuthorizer(ClusterInstance) > [1] Type=ZK, Name=testStartZkBrokerWithAuthorizer, MetadataVersion=3.4-IV0, Security=PLAINTEXT STARTED
Gradle Test Run :core:test > Gradle Test Executor 92 > ZkMigrationIntegrationTest > testStartZkBrokerWithAuthorizer(ClusterInstance) > [1] Type=ZK, Name=testStartZkBrokerWithAuthorizer, MetadataVersion=3.4-IV0, Security=PLAINTEXT PASSED
Gradle Test Run :core:test > Gradle Test Executor 92 > ZkMigrationIntegrationTest > testDualWrite(ClusterInstance) > [1] Type=ZK, MetadataVersion=3.4-IV0, Security=PLAINTEXT STARTED
Gradle Test Run :core:test > Gradle Test Executor 92 > ZkMigrationIntegrationTest > testDualWrite(ClusterInstance) > [1] Type=ZK, MetadataVersion=3.4-IV0, Security=PLAINTEXT PASSED
Gradle Test Run :core:test > Gradle Test Executor 92 > ZkMigrationIntegrationTest > testDualWrite(ClusterInstance) > [2] Type=ZK, MetadataVersion=3.5-IV2, Security=PLAINTEXT STARTED
Gradle Test Run :core:test > Gradle Test Executor 92 > ZkMigrationIntegrationTest > testDualWrite(ClusterInstance) > [2] Type=ZK, MetadataVersion=3.5-IV2, Security=PLAINTEXT PASSED
Gradle Test Run :core:test > Gradle Test Executor 92 > ZkMigrationIntegrationTest > testDualWrite(ClusterInstance) > [3] Type=ZK, MetadataVersion=3.6-IV2, Security=PLAINTEXT STARTED
Gradle Test Run :core:test > Gradle Test Executor 92 > ZkMigrationIntegrationTest > testDualWrite(ClusterInstance) > [3] Type=ZK, MetadataVersion=3.6-IV2, Security=PLAINTEXT PASSED
Gradle Test Run :core:test > Gradle Test Executor 92 > ZkMigrationIntegrationTest > testDualWrite(ClusterInstance) > [4] Type=ZK, MetadataVersion=3.7-IV0, Security=PLAINTEXT STARTED
Gradle Test Run :core:test > Gradle Test Executor 92 > ZkMigrationIntegrationTest > testDualWrite(ClusterInstance) > [4] Type=ZK, MetadataVersion=3.7-IV0, Security=PLAINTEXT PASSED
Gradle Test Run :core:test > Gradle Test Executor 92 > ZkMigrationIntegrationTest > testDualWrite(ClusterInstance) > [5] Type=ZK, MetadataVersion=3.7-IV1, Security=PLAINTEXT STARTED
Gradle Test Run :core:test > Gradle Test Executor 92 > ZkMigrationIntegrationTest > testDualWrite(ClusterInstance) > [5] Type=ZK, MetadataVersion=3.7-IV1, Security=PLAINTEXT PASSED
Gradle Test Run :core:test > Gradle Test Executor 92 > ZkConfigMigrationClientTest > testScram() STARTED
Gradle Test Run :core:test > Gradle Test Executor 92 > ZkConfigMigrationClientTest > testScram() PASSED
Gradle Test Run :core:test > Gradle Test Executor 92 > ZkConfigMigrationClientTest > testMigrationBrokerConfigs() STARTED
Gradle Test Run :core:test > Gradle Test Executor 92 > ZkConfigMigrationClientTest > testMigrationBrokerConfigs() PASSED
Gradle Test Run :core:test > Gradle Test Executor 92 > ZkConfigMigrationClientTest > testMigrateClientQuotas() STARTED
Gradle Test Run :core:test > Gradle Test Executor 92 > ZkConfigMigrationClientTest > testMigrateClientQuotas() PASSED
Gradle Test Run :core:test > Gradle Test Executor 92 > ZkConfigMigrationClientTest > testWriteNewTopicConfigs() STARTED
Gradle Test Run :core:test > Gradle Test Executor 92 > ZkConfigMigrationClientTest > testWriteNewTopicConfigs() PASSED
Gradle Test Run :core:test > Gradle Test Executor 92 > ZkConfigMigrationClientTest > testDelegationTokens() STARTED
Gradle Test Run :core:test > Gradle Test Executor 92 > ZkConfigMigrationClientTest > testDelegationTokens() PASSED
Gradle Test Run :core:test > Gradle Test Executor 92 > ZkConfigMigrationClientTest > testWriteNewClientQuotas() STARTED
Gradle Test Run :core:test > Gradle Test Executor 92 > ZkConfigMigrationClientTest > testWriteNewClientQuotas() PASSED
Gradle Test Run :core:test > Gradle Test Executor 92 > ZkConfigMigrationClientTest > testWriteExistingTopicConfigs() STARTED
Gradle Test Run :core:test > Gradle Test Executor 92 > ZkConfigMigrationClientTest > testWriteExistingTopicConfigs() PASSED
Gradle Test Run :core:test > Gradle Test Executor 92 > ZkConfigMigrationClientTest > testWriteExistingClientQuotas() STARTED
Gradle Test Run :core:test > Gradle Test Executor 92 > ZkConfigMigrationClientTest > testWriteExistingClientQuotas() PASSED
Gradle Test Run :core:test > Gradle Test Executor 92 > ZkConfigMigrationClientTest > testScramAndQuotaChangesInSnapshot() STARTED
Gradle Test Run :core:test > Gradle Test Executor 92 > ZkConfigMigrationClientTest > testScramAndQuotaChangesInSnapshot() PASSED
Gradle Test Run :core:test > Gradle Test Executor 92 > VerificationGuardTest > testEqualsAndHashCode() STARTED
Gradle Test Run :core:test > Gradle Test Executor 92 > VerificationGuardTest > testEqualsAndHashCode() PASSED
Gradle Test Run :core:test > Gradle Test Executor 92 > VerificationGuardTest > testVerify() STARTED
Gradle Test Run :core:test > Gradle Test Executor 92 > VerificationGuardTest > testVerify() PASSED
Gradle Test Run :core:test > Gradle Test Executor 101 > FetchFromFollowerIntegrationTest > testRackAwareRangeAssignor(String) > testRackAwareRangeAssignor(String).quorum=zk STARTED
Gradle Test Run :core:test > Gradle Test Executor 101 > FetchFromFollowerIntegrationTest > testRackAwareRangeAssignor(String) > testRackAwareRangeAssignor(String).quorum=zk PASSED
Gradle Test Run :core:test > Gradle Test Executor 101 > FetchFromFollowerIntegrationTest > testRackAwareRangeAssignor(String) > testRackAwareRangeAssignor(String).quorum=kraft STARTED
Gradle Test Run :core:test > Gradle Test Executor 101 > FetchFromFollowerIntegrationTest > testRackAwareRangeAssignor(String) > testRackAwareRangeAssignor(String).quorum=kraft PASSED
5302 tests completed, 2 failed, 15 skipped
There were failing tests. See the report at: file:///home/jenkins/jenkins-agent/workspace/Kafka_kafka_trunk/core/build/reports/tests/test/index.html
Deprecated Gradle features were used in this build, making it incompatible with Gradle 9.0.
You can use '--warning-mode all' to show the individual deprecation warnings and determine if they come from your own scripts or plugins.
For more on this, please refer to https://docs.gradle.org/8.3/userguide/command_line_interface.html#sec:command_line_warnings in the Gradle documentation.
BUILD SUCCESSFUL in 4h 10m 49s
311 actionable tasks: 115 executed, 196 up-to-date
Publishing build scan...
https://ge.apache.org/s/cm6jjq5jolnrk
See the profiling report at: file:///home/jenkins/jenkins-agent/workspace/Kafka_kafka_trunk/build/reports/profile/profile-2023-11-29-05-24-51.html
A fine-grained performance profile is available: use the --scan option.
[Pipeline] junit
Recording test results
[Checks API] No suitable checks publisher found.
[Pipeline] echo
Skipping Kafka Streams archetype test for Java 17
[Pipeline] }
[Pipeline] // withEnv
[Pipeline] }
[Pipeline] // withEnv
[Pipeline] }
[Pipeline] // withEnv
[Pipeline] }
[Pipeline] // node
[Pipeline] }
[Pipeline] // timestamps
[Pipeline] }
[Pipeline] // timeout
[Pipeline] }
[Pipeline] // stage
[Pipeline] }
[Pipeline] // parallel
[Pipeline] }
[Pipeline] // stage
[Pipeline] stage
[Pipeline] { (Declarative: Post Actions)
[Pipeline] script
[Pipeline] {
[Pipeline] node
Still waiting to schedule task
Waiting for next available executor on ‘ubuntu’
Running on builds39 in /home/jenkins/workspace/Kafka_kafka_trunk
[Pipeline] {
[Pipeline] step
Jenkins build is still unstable: Kafka » Kafka Branch Builder » trunk #2430
Posted by Apache Jenkins Server <je...@builds.apache.org>.
See <https://ci-builds.apache.org/job/Kafka/job/kafka/job/trunk/2430/display/redirect>
Jenkins build is unstable: Kafka » Kafka Branch Builder » trunk #2429
Posted by Apache Jenkins Server <je...@builds.apache.org>.
See <https://ci-builds.apache.org/job/Kafka/job/kafka/job/trunk/2429/display/redirect>
Build failed in Jenkins: Kafka » Kafka Branch Builder » trunk #2428
Posted by Apache Jenkins Server <je...@builds.apache.org>.
See <https://ci-builds.apache.org/job/Kafka/job/kafka/job/trunk/2428/display/redirect>
Changes:
------------------------------------------
[...truncated 424064 lines...]
Gradle Test Run :connect:runtime:test > Gradle Test Executor 47 > org.apache.kafka.connect.util.TopicAdminTest > describeTopicConfigShouldReturnEmptyMapWhenUnsupportedVersionFailure STARTED
Gradle Test Run :connect:runtime:test > Gradle Test Executor 47 > org.apache.kafka.connect.util.TopicAdminTest > describeTopicConfigShouldReturnEmptyMapWhenUnsupportedVersionFailure PASSED
Gradle Test Run :connect:runtime:test > Gradle Test Executor 47 > org.apache.kafka.connect.util.TopicAdminTest > shouldRetryWhenTopicCreateThrowsWrappedTimeoutException STARTED
Gradle Test Run :connect:runtime:test > Gradle Test Executor 47 > org.apache.kafka.connect.util.TopicAdminTest > shouldRetryWhenTopicCreateThrowsWrappedTimeoutException PASSED
Gradle Test Run :connect:runtime:test > Gradle Test Executor 47 > org.apache.kafka.connect.util.TopicAdminTest > describeTopicConfigShouldReturnTopicConfigWhenTopicExists STARTED
Gradle Test Run :connect:runtime:test > Gradle Test Executor 47 > org.apache.kafka.connect.util.TopicAdminTest > describeTopicConfigShouldReturnTopicConfigWhenTopicExists PASSED
Gradle Test Run :connect:runtime:test > Gradle Test Executor 47 > org.apache.kafka.connect.util.TopicAdminTest > retryEndOffsetsShouldRetryWhenTopicNotFound STARTED
Gradle Test Run :connect:runtime:test > Gradle Test Executor 47 > org.apache.kafka.connect.util.TopicAdminTest > retryEndOffsetsShouldRetryWhenTopicNotFound PASSED
Gradle Test Run :connect:runtime:test > Gradle Test Executor 47 > org.apache.kafka.connect.util.TopicAdminTest > createShouldReturnFalseWhenSuppliedNullTopicDescription STARTED
Gradle Test Run :connect:runtime:test > Gradle Test Executor 47 > org.apache.kafka.connect.util.TopicAdminTest > createShouldReturnFalseWhenSuppliedNullTopicDescription PASSED
Gradle Test Run :connect:runtime:test > Gradle Test Executor 47 > org.apache.kafka.connect.util.TopicAdminTest > describeShouldReturnEmptyWhenTopicDoesNotExist STARTED
Gradle Test Run :connect:runtime:test > Gradle Test Executor 47 > org.apache.kafka.connect.util.TopicAdminTest > describeShouldReturnEmptyWhenTopicDoesNotExist PASSED
Gradle Test Run :connect:runtime:test > Gradle Test Executor 47 > org.apache.kafka.connect.util.TopicAdminTest > verifyingTopicCleanupPolicyShouldReturnFalseWhenTopicAuthorizationError STARTED
Gradle Test Run :connect:runtime:test > Gradle Test Executor 47 > org.apache.kafka.connect.util.TopicAdminTest > verifyingTopicCleanupPolicyShouldReturnFalseWhenTopicAuthorizationError PASSED
Gradle Test Run :connect:runtime:test > Gradle Test Executor 47 > org.apache.kafka.connect.util.TopicAdminTest > describeTopicConfigShouldReturnEmptyMapWhenNoTopicsAreSpecified STARTED
Gradle Test Run :connect:runtime:test > Gradle Test Executor 47 > org.apache.kafka.connect.util.TopicAdminTest > describeTopicConfigShouldReturnEmptyMapWhenNoTopicsAreSpecified PASSED
Gradle Test Run :connect:runtime:test > Gradle Test Executor 47 > org.apache.kafka.connect.util.TopicAdminTest > shouldRetryCreateTopicWhenAvailableBrokersAreNotEnoughForReplicationFactor STARTED
Gradle Test Run :connect:runtime:test > Gradle Test Executor 47 > org.apache.kafka.connect.util.TopicAdminTest > shouldRetryCreateTopicWhenAvailableBrokersAreNotEnoughForReplicationFactor PASSED
Gradle Test Run :connect:runtime:test > Gradle Test Executor 47 > org.apache.kafka.connect.util.TopicAdminTest > throwsWithApiVersionMismatchOnDescribe STARTED
Gradle Test Run :connect:runtime:test > Gradle Test Executor 47 > org.apache.kafka.connect.util.TopicAdminTest > throwsWithApiVersionMismatchOnDescribe PASSED
Gradle Test Run :connect:runtime:test > Gradle Test Executor 47 > org.apache.kafka.connect.util.TopicAdminTest > returnEmptyWithApiVersionMismatchOnCreate STARTED
Gradle Test Run :connect:runtime:test > Gradle Test Executor 47 > org.apache.kafka.connect.util.TopicAdminTest > returnEmptyWithApiVersionMismatchOnCreate PASSED
Gradle Test Run :connect:runtime:test > Gradle Test Executor 47 > org.apache.kafka.connect.util.TopicAdminTest > endOffsetsShouldFailWhenAnyTopicPartitionHasError STARTED
Gradle Test Run :connect:runtime:test > Gradle Test Executor 47 > org.apache.kafka.connect.util.TopicAdminTest > endOffsetsShouldFailWhenAnyTopicPartitionHasError PASSED
Gradle Test Run :connect:runtime:test > Gradle Test Executor 47 > org.apache.kafka.connect.util.TopicAdminTest > endOffsetsShouldReturnEmptyMapWhenPartitionsSetIsNull STARTED
Gradle Test Run :connect:runtime:test > Gradle Test Executor 47 > org.apache.kafka.connect.util.TopicAdminTest > endOffsetsShouldReturnEmptyMapWhenPartitionsSetIsNull PASSED
Gradle Test Run :connect:runtime:test > Gradle Test Executor 47 > org.apache.kafka.connect.util.TopicAdminTest > shouldCreateTopicWithPartitionsWhenItDoesNotExist STARTED
Gradle Test Run :connect:runtime:test > Gradle Test Executor 47 > org.apache.kafka.connect.util.TopicAdminTest > shouldCreateTopicWithPartitionsWhenItDoesNotExist PASSED
Gradle Test Run :connect:runtime:test > Gradle Test Executor 47 > org.apache.kafka.connect.util.TopicAdminTest > endOffsetsShouldFailWithTimeoutExceptionWhenTimeoutErrorOccurs STARTED
Gradle Test Run :connect:runtime:test > Gradle Test Executor 47 > org.apache.kafka.connect.util.TopicAdminTest > endOffsetsShouldFailWithTimeoutExceptionWhenTimeoutErrorOccurs PASSED
Gradle Test Run :connect:runtime:test > Gradle Test Executor 47 > org.apache.kafka.connect.util.TopicAdminTest > throwsWithTopicAuthorizationFailureOnDescribe STARTED
Gradle Test Run :connect:runtime:test > Gradle Test Executor 47 > org.apache.kafka.connect.util.TopicAdminTest > throwsWithTopicAuthorizationFailureOnDescribe PASSED
Gradle Test Run :connect:runtime:test > Gradle Test Executor 47 > org.apache.kafka.connect.util.TopicAdminTest > verifyingGettingTopicCleanupPolicies STARTED
Gradle Test Run :connect:runtime:test > Gradle Test Executor 47 > org.apache.kafka.connect.util.TopicAdminTest > verifyingGettingTopicCleanupPolicies PASSED
Gradle Test Run :connect:runtime:test > Gradle Test Executor 47 > org.apache.kafka.connect.util.TopicAdminTest > throwsWithClusterAuthorizationFailureOnDescribe STARTED
Gradle Test Run :connect:runtime:test > Gradle Test Executor 47 > org.apache.kafka.connect.util.TopicAdminTest > throwsWithClusterAuthorizationFailureOnDescribe PASSED
Gradle Test Run :connect:runtime:test > Gradle Test Executor 47 > org.apache.kafka.connect.util.TopicAdminTest > endOffsetsShouldReturnOffsetsForOnePartition STARTED
Gradle Test Run :connect:runtime:test > Gradle Test Executor 47 > org.apache.kafka.connect.util.TopicAdminTest > endOffsetsShouldReturnOffsetsForOnePartition PASSED
Gradle Test Run :connect:runtime:test > Gradle Test Executor 47 > org.apache.kafka.connect.util.TopicAdminTest > shouldCreateOneTopicWhenProvidedMultipleDefinitionsWithSameTopicName STARTED
Gradle Test Run :connect:runtime:test > Gradle Test Executor 47 > org.apache.kafka.connect.util.TopicAdminTest > shouldCreateOneTopicWhenProvidedMultipleDefinitionsWithSameTopicName PASSED
Gradle Test Run :connect:runtime:test > Gradle Test Executor 47 > org.apache.kafka.connect.util.TopicAdminTest > describeTopicConfigShouldReturnEmptyMapWhenClusterAuthorizationFailure STARTED
Gradle Test Run :connect:runtime:test > Gradle Test Executor 47 > org.apache.kafka.connect.util.TopicAdminTest > describeTopicConfigShouldReturnEmptyMapWhenClusterAuthorizationFailure PASSED
Gradle Test Run :connect:runtime:test > Gradle Test Executor 47 > org.apache.kafka.connect.util.TopicAdminTest > returnEmptyWithClusterAuthorizationFailureOnCreate STARTED
Gradle Test Run :connect:runtime:test > Gradle Test Executor 47 > org.apache.kafka.connect.util.TopicAdminTest > returnEmptyWithClusterAuthorizationFailureOnCreate PASSED
Gradle Test Run :connect:runtime:test > Gradle Test Executor 47 > org.apache.kafka.connect.util.TopicAdminTest > shouldCreateTopicWithDefaultPartitionsAndReplicationFactorWhenItDoesNotExist STARTED
Gradle Test Run :connect:runtime:test > Gradle Test Executor 47 > org.apache.kafka.connect.util.TopicAdminTest > shouldCreateTopicWithDefaultPartitionsAndReplicationFactorWhenItDoesNotExist PASSED
Gradle Test Run :connect:runtime:test > Gradle Test Executor 47 > org.apache.kafka.connect.util.TopicAdminTest > describeShouldReturnTopicDescriptionWhenTopicExists STARTED
Gradle Test Run :connect:runtime:test > Gradle Test Executor 47 > org.apache.kafka.connect.util.TopicAdminTest > describeShouldReturnTopicDescriptionWhenTopicExists PASSED
Gradle Test Run :connect:runtime:test > Gradle Test Executor 47 > org.apache.kafka.connect.util.TopicAdminTest > describeTopicConfigShouldReturnMapWithNullValueWhenTopicDoesNotExist STARTED
Gradle Test Run :connect:runtime:test > Gradle Test Executor 47 > org.apache.kafka.connect.util.TopicAdminTest > describeTopicConfigShouldReturnMapWithNullValueWhenTopicDoesNotExist PASSED
Gradle Test Run :connect:runtime:test > Gradle Test Executor 47 > org.apache.kafka.connect.util.TopicAdminTest > retryEndOffsetsShouldWrapNonRetriableExceptionsWithConnectException STARTED
Gradle Test Run :connect:runtime:test > Gradle Test Executor 47 > org.apache.kafka.connect.util.TopicAdminTest > retryEndOffsetsShouldWrapNonRetriableExceptionsWithConnectException PASSED
Gradle Test Run :connect:runtime:test > Gradle Test Executor 47 > org.apache.kafka.connect.util.TopicAdminTest > verifyingTopicCleanupPolicyShouldFailWhenTopicHasDeletePolicy STARTED
Gradle Test Run :connect:runtime:test > Gradle Test Executor 47 > org.apache.kafka.connect.util.TopicAdminTest > verifyingTopicCleanupPolicyShouldFailWhenTopicHasDeletePolicy PASSED
Gradle Test Run :connect:runtime:test > Gradle Test Executor 47 > org.apache.kafka.connect.util.TopicAdminTest > shouldCreateTopicWithReplicationFactorWhenItDoesNotExist STARTED
Gradle Test Run :connect:runtime:test > Gradle Test Executor 47 > org.apache.kafka.connect.util.TopicAdminTest > shouldCreateTopicWithReplicationFactorWhenItDoesNotExist PASSED
Gradle Test Run :connect:runtime:test > Gradle Test Executor 47 > org.apache.kafka.connect.util.TopicAdminTest > retryEndOffsetsShouldRethrowUnknownVersionException STARTED
Gradle Test Run :connect:runtime:test > Gradle Test Executor 47 > org.apache.kafka.connect.util.TopicAdminTest > retryEndOffsetsShouldRethrowUnknownVersionException PASSED
Gradle Test Run :connect:runtime:test > Gradle Test Executor 47 > org.apache.kafka.connect.util.TopicAdminTest > endOffsetsShouldFailWithUnsupportedVersionWhenVersionUnsupportedErrorOccurs STARTED
Gradle Test Run :connect:runtime:test > Gradle Test Executor 47 > org.apache.kafka.connect.util.TopicAdminTest > endOffsetsShouldFailWithUnsupportedVersionWhenVersionUnsupportedErrorOccurs PASSED
Gradle Test Run :connect:runtime:test > Gradle Test Executor 47 > org.apache.kafka.connect.util.TopicAdminTest > returnEmptyWithTopicAuthorizationFailureOnCreate STARTED
Gradle Test Run :connect:runtime:test > Gradle Test Executor 47 > org.apache.kafka.connect.util.TopicAdminTest > returnEmptyWithTopicAuthorizationFailureOnCreate PASSED
Gradle Test Run :connect:runtime:test > Gradle Test Executor 47 > org.apache.kafka.connect.util.TopicAdminTest > endOffsetsShouldReturnOffsetsForMultiplePartitions STARTED
Gradle Test Run :connect:runtime:test > Gradle Test Executor 47 > org.apache.kafka.connect.util.TopicAdminTest > endOffsetsShouldReturnOffsetsForMultiplePartitions PASSED
Gradle Test Run :connect:runtime:test > Gradle Test Executor 47 > org.apache.kafka.connect.util.TopicAdminTest > verifyingTopicCleanupPolicyShouldReturnFalseWhenClusterAuthorizationError STARTED
Gradle Test Run :connect:runtime:test > Gradle Test Executor 47 > org.apache.kafka.connect.util.TopicAdminTest > verifyingTopicCleanupPolicyShouldReturnFalseWhenClusterAuthorizationError PASSED
Gradle Test Run :connect:runtime:test > Gradle Test Executor 47 > org.apache.kafka.connect.util.TopicAdminTest > describeTopicConfigShouldReturnEmptyMapWhenTopicAuthorizationFailure STARTED
Gradle Test Run :connect:runtime:test > Gradle Test Executor 47 > org.apache.kafka.connect.util.TopicAdminTest > describeTopicConfigShouldReturnEmptyMapWhenTopicAuthorizationFailure PASSED
Gradle Test Run :connect:runtime:test > Gradle Test Executor 47 > org.apache.kafka.connect.util.TopicAdminTest > verifyingTopicCleanupPolicyShouldReturnTrueWhenTopicHasCorrectPolicy STARTED
Gradle Test Run :connect:runtime:test > Gradle Test Executor 47 > org.apache.kafka.connect.util.TopicAdminTest > verifyingTopicCleanupPolicyShouldReturnTrueWhenTopicHasCorrectPolicy PASSED
Gradle Test Run :connect:runtime:test > Gradle Test Executor 47 > org.apache.kafka.connect.util.TopicAdminTest > endOffsetsShouldFailWithNonRetriableWhenAuthorizationFailureOccurs STARTED
Gradle Test Run :connect:runtime:test > Gradle Test Executor 47 > org.apache.kafka.connect.util.TopicAdminTest > endOffsetsShouldFailWithNonRetriableWhenAuthorizationFailureOccurs PASSED
> Task :connect:runtime:test FAILED
FAILURE: Build completed with 4 failures.
1: Task failed with an exception.
-----------
* What went wrong:
Execution failed for task ':core:test'.
> Process 'Gradle Test Executor 14' finished with non-zero exit value 137
This problem might be caused by incorrect test process configuration.
For more on test execution, please refer to https://docs.gradle.org/8.3/userguide/java_testing.html#sec:test_execution in the Gradle documentation.
* Try:
> Run with --stacktrace option to get the stack trace.
> Run with --info or --debug option to get more log output.
> Get more help at https://help.gradle.org.
==============================================================================
2: Task failed with an exception.
-----------
* What went wrong:
Execution failed for task ':connect:mirror:test'.
> Process 'Gradle Test Executor 44' finished with non-zero exit value 137
This problem might be caused by incorrect test process configuration.
For more on test execution, please refer to https://docs.gradle.org/8.3/userguide/java_testing.html#sec:test_execution in the Gradle documentation.
* Try:
> Run with --stacktrace option to get the stack trace.
> Run with --info or --debug option to get more log output.
> Get more help at https://help.gradle.org.
==============================================================================
3: Task failed with an exception.
-----------
* What went wrong:
Execution failed for task ':streams:test'.
> Process 'Gradle Test Executor 25' finished with non-zero exit value 137
This problem might be caused by incorrect test process configuration.
For more on test execution, please refer to https://docs.gradle.org/8.3/userguide/java_testing.html#sec:test_execution in the Gradle documentation.
* Try:
> Run with --stacktrace option to get the stack trace.
> Run with --info or --debug option to get more log output.
> Get more help at https://help.gradle.org.
==============================================================================
4: Task failed with an exception.
-----------
* What went wrong:
Execution failed for task ':connect:runtime:test'.
> Process 'Gradle Test Executor 48' finished with non-zero exit value 137
This problem might be caused by incorrect test process configuration.
For more on test execution, please refer to https://docs.gradle.org/8.3/userguide/java_testing.html#sec:test_execution in the Gradle documentation.
* Try:
> Run with --stacktrace option to get the stack trace.
> Run with --info or --debug option to get more log output.
> Get more help at https://help.gradle.org.
==============================================================================
Deprecated Gradle features were used in this build, making it incompatible with Gradle 9.0.
You can use '--warning-mode all' to show the individual deprecation warnings and determine if they come from your own scripts or plugins.
For more on this, please refer to https://docs.gradle.org/8.3/userguide/command_line_interface.html#sec:command_line_warnings in the Gradle documentation.
BUILD FAILED in 3h 30m 47s
311 actionable tasks: 115 executed, 196 up-to-date
Publishing build scan...
https://ge.apache.org/s/ec4rgvllh2wxm
See the profiling report at: file:///home/jenkins/jenkins-agent/712657a4/workspace/Kafka_kafka_trunk/build/reports/profile/profile-2023-11-29-10-16-45.html
A fine-grained performance profile is available: use the --scan option.
[Pipeline] }
[Pipeline] // withEnv
[Pipeline] }
[Pipeline] // withEnv
[Pipeline] }
[Pipeline] // withEnv
[Pipeline] }
[Pipeline] // node
[Pipeline] }
[Pipeline] // timestamps
[Pipeline] }
[Pipeline] // timeout
[Pipeline] }
[Pipeline] // stage
[Pipeline] }
Failed in branch JDK 8 and Scala 2.12
[Pipeline] // parallel
[Pipeline] }
[Pipeline] // stage
[Pipeline] stage
[Pipeline] { (Declarative: Post Actions)
[Pipeline] script
[Pipeline] {
[Pipeline] node
Still waiting to schedule task
Waiting for next available executor on ‘ubuntu’
Running on builds57 in /home/jenkins/jenkins-agent/workspace/Kafka_kafka_trunk
[Pipeline] {
[Pipeline] step