You are viewing a plain text version of this content. The canonical link for it is here.
Posted to dev@lucene.apache.org by Policeman Jenkins Server <je...@thetaphi.de> on 2017/10/04 03:58:29 UTC

[JENKINS] Lucene-Solr-7.x-Linux (32bit/jdk1.8.0_144) - Build # 541 - Still Unstable!

Build: https://jenkins.thetaphi.de/job/Lucene-Solr-7.x-Linux/541/
Java: 32bit/jdk1.8.0_144 -client -XX:+UseG1GC

2 tests failed.
FAILED:  org.apache.solr.cloud.LeaderElectionContextKeyTest.test

Error Message:


Stack Trace:
java.lang.AssertionError
	at __randomizedtesting.SeedInfo.seed([57D64213D9525745:DF827DC977AE3ABD]:0)
	at org.junit.Assert.fail(Assert.java:92)
	at org.junit.Assert.assertTrue(Assert.java:43)
	at org.junit.Assert.assertTrue(Assert.java:54)
	at org.apache.solr.cloud.LeaderElectionContextKeyTest.test(LeaderElectionContextKeyTest.java:88)
	at sun.reflect.NativeMethodAccessorImpl.invoke0(Native Method)
	at sun.reflect.NativeMethodAccessorImpl.invoke(NativeMethodAccessorImpl.java:62)
	at sun.reflect.DelegatingMethodAccessorImpl.invoke(DelegatingMethodAccessorImpl.java:43)
	at java.lang.reflect.Method.invoke(Method.java:498)
	at com.carrotsearch.randomizedtesting.RandomizedRunner.invoke(RandomizedRunner.java:1737)
	at com.carrotsearch.randomizedtesting.RandomizedRunner$8.evaluate(RandomizedRunner.java:934)
	at com.carrotsearch.randomizedtesting.RandomizedRunner$9.evaluate(RandomizedRunner.java:970)
	at com.carrotsearch.randomizedtesting.RandomizedRunner$10.evaluate(RandomizedRunner.java:984)
	at com.carrotsearch.randomizedtesting.rules.SystemPropertiesRestoreRule$1.evaluate(SystemPropertiesRestoreRule.java:57)
	at org.apache.lucene.util.TestRuleSetupTeardownChained$1.evaluate(TestRuleSetupTeardownChained.java:49)
	at org.apache.lucene.util.AbstractBeforeAfterRule$1.evaluate(AbstractBeforeAfterRule.java:45)
	at org.apache.lucene.util.TestRuleThreadAndTestName$1.evaluate(TestRuleThreadAndTestName.java:48)
	at org.apache.lucene.util.TestRuleIgnoreAfterMaxFailures$1.evaluate(TestRuleIgnoreAfterMaxFailures.java:64)
	at org.apache.lucene.util.TestRuleMarkFailure$1.evaluate(TestRuleMarkFailure.java:47)
	at com.carrotsearch.randomizedtesting.rules.StatementAdapter.evaluate(StatementAdapter.java:36)
	at com.carrotsearch.randomizedtesting.ThreadLeakControl$StatementRunner.run(ThreadLeakControl.java:368)
	at com.carrotsearch.randomizedtesting.ThreadLeakControl.forkTimeoutingTask(ThreadLeakControl.java:817)
	at com.carrotsearch.randomizedtesting.ThreadLeakControl$3.evaluate(ThreadLeakControl.java:468)
	at com.carrotsearch.randomizedtesting.RandomizedRunner.runSingleTest(RandomizedRunner.java:943)
	at com.carrotsearch.randomizedtesting.RandomizedRunner$5.evaluate(RandomizedRunner.java:829)
	at com.carrotsearch.randomizedtesting.RandomizedRunner$6.evaluate(RandomizedRunner.java:879)
	at com.carrotsearch.randomizedtesting.RandomizedRunner$7.evaluate(RandomizedRunner.java:890)
	at com.carrotsearch.randomizedtesting.rules.StatementAdapter.evaluate(StatementAdapter.java:36)
	at com.carrotsearch.randomizedtesting.rules.SystemPropertiesRestoreRule$1.evaluate(SystemPropertiesRestoreRule.java:57)
	at org.apache.lucene.util.AbstractBeforeAfterRule$1.evaluate(AbstractBeforeAfterRule.java:45)
	at com.carrotsearch.randomizedtesting.rules.StatementAdapter.evaluate(StatementAdapter.java:36)
	at org.apache.lucene.util.TestRuleStoreClassName$1.evaluate(TestRuleStoreClassName.java:41)
	at com.carrotsearch.randomizedtesting.rules.NoShadowingOrOverridesOnMethodsRule$1.evaluate(NoShadowingOrOverridesOnMethodsRule.java:40)
	at com.carrotsearch.randomizedtesting.rules.NoShadowingOrOverridesOnMethodsRule$1.evaluate(NoShadowingOrOverridesOnMethodsRule.java:40)
	at com.carrotsearch.randomizedtesting.rules.StatementAdapter.evaluate(StatementAdapter.java:36)
	at com.carrotsearch.randomizedtesting.rules.StatementAdapter.evaluate(StatementAdapter.java:36)
	at com.carrotsearch.randomizedtesting.rules.StatementAdapter.evaluate(StatementAdapter.java:36)
	at org.apache.lucene.util.TestRuleAssertionsRequired$1.evaluate(TestRuleAssertionsRequired.java:53)
	at org.apache.lucene.util.TestRuleMarkFailure$1.evaluate(TestRuleMarkFailure.java:47)
	at org.apache.lucene.util.TestRuleIgnoreAfterMaxFailures$1.evaluate(TestRuleIgnoreAfterMaxFailures.java:64)
	at org.apache.lucene.util.TestRuleIgnoreTestSuites$1.evaluate(TestRuleIgnoreTestSuites.java:54)
	at com.carrotsearch.randomizedtesting.rules.StatementAdapter.evaluate(StatementAdapter.java:36)
	at com.carrotsearch.randomizedtesting.ThreadLeakControl$StatementRunner.run(ThreadLeakControl.java:368)
	at java.lang.Thread.run(Thread.java:748)


FAILED:  org.apache.solr.cloud.ReplaceNodeTest.test

Error Message:
Expecting no cores but found some: {replacenodetest_coll_shard2_replica_n21={name=replacenodetest_coll_shard2_replica_n21,instanceDir=/home/jenkins/workspace/Lucene-Solr-7.x-Linux/solr/build/solr-core/test/J0/temp/solr.cloud.ReplaceNodeTest_57D64213D9525745-001/tempDir-001/node5/replacenodetest_coll_shard2_replica_n21,dataDir=/home/jenkins/workspace/Lucene-Solr-7.x-Linux/solr/build/solr-core/test/J0/temp/solr.cloud.ReplaceNodeTest_57D64213D9525745-001/tempDir-001/node5/./replacenodetest_coll_shard2_replica_n21/data/,config=solrconfig.xml,schema=schema.xml,startTime=Wed Oct 04 16:33:44 NZDT 2017,uptime=23780,lastPublished=active,configVersion=0,cloud={collection=replacenodetest_coll,shard=shard2,replica=core_node22},index={numDocs=0,maxDoc=0,deletedDocs=0,indexHeapUsageBytes=0,version=2,segmentCount=0,current=true,hasDeletions=false,directory=org.apache.lucene.store.MockDirectoryWrapper:MockDirectoryWrapper(NIOFSDirectory@/home/jenkins/workspace/Lucene-Solr-7.x-Linux/solr/build/solr-core/test/J0/temp/solr.cloud.ReplaceNodeTest_57D64213D9525745-001/index-NIOFSDirectory-011 lockFactory=org.apache.lucene.store.NativeFSLockFactory@a7aaef),segmentsFile=segments_1,segmentsFileSizeInBytes=72,userData={},sizeInBytes=72,size=72 bytes}},replacenodetest_coll_shard5_replica_n23={name=replacenodetest_coll_shard5_replica_n23,instanceDir=/home/jenkins/workspace/Lucene-Solr-7.x-Linux/solr/build/solr-core/test/J0/temp/solr.cloud.ReplaceNodeTest_57D64213D9525745-001/tempDir-001/node5/replacenodetest_coll_shard5_replica_n23,dataDir=/home/jenkins/workspace/Lucene-Solr-7.x-Linux/solr/build/solr-core/test/J0/temp/solr.cloud.ReplaceNodeTest_57D64213D9525745-001/tempDir-001/node5/./replacenodetest_coll_shard5_replica_n23/data/,config=solrconfig.xml,schema=schema.xml,startTime=Wed Oct 04 16:33:45 NZDT 2017,uptime=22614,lastPublished=active,configVersion=0,cloud={collection=replacenodetest_coll,shard=shard5,replica=core_node24},index={numDocs=0,maxDoc=0,deletedDocs=0,indexHeapUsageBytes=0,version=2,segmentCount=0,current=true,hasDeletions=false,directory=org.apache.lucene.store.MockDirectoryWrapper:MockDirectoryWrapper(NIOFSDirectory@/home/jenkins/workspace/Lucene-Solr-7.x-Linux/solr/build/solr-core/test/J0/temp/solr.cloud.ReplaceNodeTest_57D64213D9525745-001/index-NIOFSDirectory-012 lockFactory=org.apache.lucene.store.NativeFSLockFactory@a7aaef),segmentsFile=segments_1,segmentsFileSizeInBytes=72,userData={},sizeInBytes=72,size=72 bytes}}} expected:<0> but was:<2>

Stack Trace:
java.lang.AssertionError: Expecting no cores but found some: {replacenodetest_coll_shard2_replica_n21={name=replacenodetest_coll_shard2_replica_n21,instanceDir=/home/jenkins/workspace/Lucene-Solr-7.x-Linux/solr/build/solr-core/test/J0/temp/solr.cloud.ReplaceNodeTest_57D64213D9525745-001/tempDir-001/node5/replacenodetest_coll_shard2_replica_n21,dataDir=/home/jenkins/workspace/Lucene-Solr-7.x-Linux/solr/build/solr-core/test/J0/temp/solr.cloud.ReplaceNodeTest_57D64213D9525745-001/tempDir-001/node5/./replacenodetest_coll_shard2_replica_n21/data/,config=solrconfig.xml,schema=schema.xml,startTime=Wed Oct 04 16:33:44 NZDT 2017,uptime=23780,lastPublished=active,configVersion=0,cloud={collection=replacenodetest_coll,shard=shard2,replica=core_node22},index={numDocs=0,maxDoc=0,deletedDocs=0,indexHeapUsageBytes=0,version=2,segmentCount=0,current=true,hasDeletions=false,directory=org.apache.lucene.store.MockDirectoryWrapper:MockDirectoryWrapper(NIOFSDirectory@/home/jenkins/workspace/Lucene-Solr-7.x-Linux/solr/build/solr-core/test/J0/temp/solr.cloud.ReplaceNodeTest_57D64213D9525745-001/index-NIOFSDirectory-011 lockFactory=org.apache.lucene.store.NativeFSLockFactory@a7aaef),segmentsFile=segments_1,segmentsFileSizeInBytes=72,userData={},sizeInBytes=72,size=72 bytes}},replacenodetest_coll_shard5_replica_n23={name=replacenodetest_coll_shard5_replica_n23,instanceDir=/home/jenkins/workspace/Lucene-Solr-7.x-Linux/solr/build/solr-core/test/J0/temp/solr.cloud.ReplaceNodeTest_57D64213D9525745-001/tempDir-001/node5/replacenodetest_coll_shard5_replica_n23,dataDir=/home/jenkins/workspace/Lucene-Solr-7.x-Linux/solr/build/solr-core/test/J0/temp/solr.cloud.ReplaceNodeTest_57D64213D9525745-001/tempDir-001/node5/./replacenodetest_coll_shard5_replica_n23/data/,config=solrconfig.xml,schema=schema.xml,startTime=Wed Oct 04 16:33:45 NZDT 2017,uptime=22614,lastPublished=active,configVersion=0,cloud={collection=replacenodetest_coll,shard=shard5,replica=core_node24},index={numDocs=0,maxDoc=0,deletedDocs=0,indexHeapUsageBytes=0,version=2,segmentCount=0,current=true,hasDeletions=false,directory=org.apache.lucene.store.MockDirectoryWrapper:MockDirectoryWrapper(NIOFSDirectory@/home/jenkins/workspace/Lucene-Solr-7.x-Linux/solr/build/solr-core/test/J0/temp/solr.cloud.ReplaceNodeTest_57D64213D9525745-001/index-NIOFSDirectory-012 lockFactory=org.apache.lucene.store.NativeFSLockFactory@a7aaef),segmentsFile=segments_1,segmentsFileSizeInBytes=72,userData={},sizeInBytes=72,size=72 bytes}}} expected:<0> but was:<2>
	at __randomizedtesting.SeedInfo.seed([57D64213D9525745:DF827DC977AE3ABD]:0)
	at org.junit.Assert.fail(Assert.java:93)
	at org.junit.Assert.failNotEquals(Assert.java:647)
	at org.junit.Assert.assertEquals(Assert.java:128)
	at org.junit.Assert.assertEquals(Assert.java:472)
	at org.apache.solr.cloud.ReplaceNodeTest.test(ReplaceNodeTest.java:120)
	at sun.reflect.NativeMethodAccessorImpl.invoke0(Native Method)
	at sun.reflect.NativeMethodAccessorImpl.invoke(NativeMethodAccessorImpl.java:62)
	at sun.reflect.DelegatingMethodAccessorImpl.invoke(DelegatingMethodAccessorImpl.java:43)
	at java.lang.reflect.Method.invoke(Method.java:498)
	at com.carrotsearch.randomizedtesting.RandomizedRunner.invoke(RandomizedRunner.java:1737)
	at com.carrotsearch.randomizedtesting.RandomizedRunner$8.evaluate(RandomizedRunner.java:934)
	at com.carrotsearch.randomizedtesting.RandomizedRunner$9.evaluate(RandomizedRunner.java:970)
	at com.carrotsearch.randomizedtesting.RandomizedRunner$10.evaluate(RandomizedRunner.java:984)
	at com.carrotsearch.randomizedtesting.rules.SystemPropertiesRestoreRule$1.evaluate(SystemPropertiesRestoreRule.java:57)
	at org.apache.lucene.util.TestRuleSetupTeardownChained$1.evaluate(TestRuleSetupTeardownChained.java:49)
	at org.apache.lucene.util.AbstractBeforeAfterRule$1.evaluate(AbstractBeforeAfterRule.java:45)
	at org.apache.lucene.util.TestRuleThreadAndTestName$1.evaluate(TestRuleThreadAndTestName.java:48)
	at org.apache.lucene.util.TestRuleIgnoreAfterMaxFailures$1.evaluate(TestRuleIgnoreAfterMaxFailures.java:64)
	at org.apache.lucene.util.TestRuleMarkFailure$1.evaluate(TestRuleMarkFailure.java:47)
	at com.carrotsearch.randomizedtesting.rules.StatementAdapter.evaluate(StatementAdapter.java:36)
	at com.carrotsearch.randomizedtesting.ThreadLeakControl$StatementRunner.run(ThreadLeakControl.java:368)
	at com.carrotsearch.randomizedtesting.ThreadLeakControl.forkTimeoutingTask(ThreadLeakControl.java:817)
	at com.carrotsearch.randomizedtesting.ThreadLeakControl$3.evaluate(ThreadLeakControl.java:468)
	at com.carrotsearch.randomizedtesting.RandomizedRunner.runSingleTest(RandomizedRunner.java:943)
	at com.carrotsearch.randomizedtesting.RandomizedRunner$5.evaluate(RandomizedRunner.java:829)
	at com.carrotsearch.randomizedtesting.RandomizedRunner$6.evaluate(RandomizedRunner.java:879)
	at com.carrotsearch.randomizedtesting.RandomizedRunner$7.evaluate(RandomizedRunner.java:890)
	at com.carrotsearch.randomizedtesting.rules.StatementAdapter.evaluate(StatementAdapter.java:36)
	at com.carrotsearch.randomizedtesting.rules.SystemPropertiesRestoreRule$1.evaluate(SystemPropertiesRestoreRule.java:57)
	at org.apache.lucene.util.AbstractBeforeAfterRule$1.evaluate(AbstractBeforeAfterRule.java:45)
	at com.carrotsearch.randomizedtesting.rules.StatementAdapter.evaluate(StatementAdapter.java:36)
	at org.apache.lucene.util.TestRuleStoreClassName$1.evaluate(TestRuleStoreClassName.java:41)
	at com.carrotsearch.randomizedtesting.rules.NoShadowingOrOverridesOnMethodsRule$1.evaluate(NoShadowingOrOverridesOnMethodsRule.java:40)
	at com.carrotsearch.randomizedtesting.rules.NoShadowingOrOverridesOnMethodsRule$1.evaluate(NoShadowingOrOverridesOnMethodsRule.java:40)
	at com.carrotsearch.randomizedtesting.rules.StatementAdapter.evaluate(StatementAdapter.java:36)
	at com.carrotsearch.randomizedtesting.rules.StatementAdapter.evaluate(StatementAdapter.java:36)
	at com.carrotsearch.randomizedtesting.rules.StatementAdapter.evaluate(StatementAdapter.java:36)
	at org.apache.lucene.util.TestRuleAssertionsRequired$1.evaluate(TestRuleAssertionsRequired.java:53)
	at org.apache.lucene.util.TestRuleMarkFailure$1.evaluate(TestRuleMarkFailure.java:47)
	at org.apache.lucene.util.TestRuleIgnoreAfterMaxFailures$1.evaluate(TestRuleIgnoreAfterMaxFailures.java:64)
	at org.apache.lucene.util.TestRuleIgnoreTestSuites$1.evaluate(TestRuleIgnoreTestSuites.java:54)
	at com.carrotsearch.randomizedtesting.rules.StatementAdapter.evaluate(StatementAdapter.java:36)
	at com.carrotsearch.randomizedtesting.ThreadLeakControl$StatementRunner.run(ThreadLeakControl.java:368)
	at java.lang.Thread.run(Thread.java:748)




Build Log:
[...truncated 11592 lines...]
   [junit4] Suite: org.apache.solr.cloud.LeaderElectionContextKeyTest
   [junit4]   2> Creating dataDir: /home/jenkins/workspace/Lucene-Solr-7.x-Linux/solr/build/solr-core/test/J1/temp/solr.cloud.LeaderElectionContextKeyTest_57D64213D9525745-001/init-core-data-001
   [junit4]   2> 95752 WARN  (SUITE-LeaderElectionContextKeyTest-seed#[57D64213D9525745]-worker) [    ] o.a.s.SolrTestCaseJ4 startTrackingSearchers: numOpens=1 numCloses=1
   [junit4]   2> 95752 INFO  (SUITE-LeaderElectionContextKeyTest-seed#[57D64213D9525745]-worker) [    ] o.a.s.SolrTestCaseJ4 Using PointFields (NUMERIC_POINTS_SYSPROP=true) w/NUMERIC_DOCVALUES_SYSPROP=true
   [junit4]   2> 95754 INFO  (SUITE-LeaderElectionContextKeyTest-seed#[57D64213D9525745]-worker) [    ] o.a.s.SolrTestCaseJ4 Randomized ssl (false) and clientAuth (false) via: @org.apache.solr.util.RandomizeSSL(reason=, ssl=NaN, value=NaN, clientAuth=NaN)
   [junit4]   2> 95754 INFO  (SUITE-LeaderElectionContextKeyTest-seed#[57D64213D9525745]-worker) [    ] o.a.s.SolrTestCaseJ4 SecureRandom sanity checks: test.solr.allowed.securerandom=null & java.security.egd=file:/dev/./urandom
   [junit4]   2> 95755 INFO  (SUITE-LeaderElectionContextKeyTest-seed#[57D64213D9525745]-worker) [    ] o.a.s.c.MiniSolrCloudCluster Starting cluster of 1 servers in /home/jenkins/workspace/Lucene-Solr-7.x-Linux/solr/build/solr-core/test/J1/temp/solr.cloud.LeaderElectionContextKeyTest_57D64213D9525745-001/tempDir-001
   [junit4]   2> 95755 INFO  (SUITE-LeaderElectionContextKeyTest-seed#[57D64213D9525745]-worker) [    ] o.a.s.c.ZkTestServer STARTING ZK TEST SERVER
   [junit4]   2> 95755 INFO  (Thread-121) [    ] o.a.s.c.ZkTestServer client port:0.0.0.0/0.0.0.0:0
   [junit4]   2> 95755 INFO  (Thread-121) [    ] o.a.s.c.ZkTestServer Starting server
   [junit4]   2> 95757 ERROR (Thread-121) [    ] o.a.z.s.ZooKeeperServer ZKShutdownHandler is not registered, so ZooKeeper server won't take any action on ERROR or SHUTDOWN server state changes
   [junit4]   2> 95855 INFO  (SUITE-LeaderElectionContextKeyTest-seed#[57D64213D9525745]-worker) [    ] o.a.s.c.ZkTestServer start zk server on port:40943
   [junit4]   2> 95861 INFO  (jetty-launcher-106-thread-1) [    ] o.e.j.s.Server jetty-9.3.20.v20170531
   [junit4]   2> 95866 INFO  (jetty-launcher-106-thread-1) [    ] o.e.j.s.h.ContextHandler Started o.e.j.s.ServletContextHandler@b2f101{/solr,null,AVAILABLE}
   [junit4]   2> 95869 INFO  (jetty-launcher-106-thread-1) [    ] o.e.j.s.AbstractConnector Started ServerConnector@1f3e820{HTTP/1.1,[http/1.1]}{127.0.0.1:40409}
   [junit4]   2> 95870 INFO  (jetty-launcher-106-thread-1) [    ] o.e.j.s.Server Started @97300ms
   [junit4]   2> 95870 INFO  (jetty-launcher-106-thread-1) [    ] o.a.s.c.s.e.JettySolrRunner Jetty properties: {hostContext=/solr, hostPort=40409}
   [junit4]   2> 95870 ERROR (jetty-launcher-106-thread-1) [    ] o.a.s.u.StartupLoggingUtils Missing Java Option solr.log.dir. Logging may be missing or incomplete.
   [junit4]   2> 95870 INFO  (jetty-launcher-106-thread-1) [    ] o.a.s.s.SolrDispatchFilter  ___      _       Welcome to Apache Solr? version 7.1.0
   [junit4]   2> 95870 INFO  (jetty-launcher-106-thread-1) [    ] o.a.s.s.SolrDispatchFilter / __| ___| |_ _   Starting in cloud mode on port null
   [junit4]   2> 95870 INFO  (jetty-launcher-106-thread-1) [    ] o.a.s.s.SolrDispatchFilter \__ \/ _ \ | '_|  Install dir: null, Default config dir: null
   [junit4]   2> 95870 INFO  (jetty-launcher-106-thread-1) [    ] o.a.s.s.SolrDispatchFilter |___/\___/_|_|    Start time: 2017-10-04T02:54:44.247Z
   [junit4]   2> 95876 INFO  (jetty-launcher-106-thread-1) [    ] o.a.s.s.SolrDispatchFilter solr.xml found in ZooKeeper. Loading...
   [junit4]   2> 95888 INFO  (jetty-launcher-106-thread-1) [    ] o.a.s.c.ZkContainer Zookeeper client=127.0.0.1:40943/solr
   [junit4]   2> 95956 INFO  (jetty-launcher-106-thread-1) [n:127.0.0.1:40409_solr    ] o.a.s.c.Overseer Overseer (id=null) closing
   [junit4]   2> 95956 INFO  (jetty-launcher-106-thread-1) [n:127.0.0.1:40409_solr    ] o.a.s.c.OverseerElectionContext I am going to be the leader 127.0.0.1:40409_solr
   [junit4]   2> 95956 INFO  (jetty-launcher-106-thread-1) [n:127.0.0.1:40409_solr    ] o.a.s.c.Overseer Overseer (id=98768367395340291-127.0.0.1:40409_solr-n_0000000000) starting
   [junit4]   2> 95969 INFO  (jetty-launcher-106-thread-1) [n:127.0.0.1:40409_solr    ] o.a.s.c.ZkController Register node as live in ZooKeeper:/live_nodes/127.0.0.1:40409_solr
   [junit4]   2> 95971 INFO  (zkCallback-113-thread-1-processing-n:127.0.0.1:40409_solr) [n:127.0.0.1:40409_solr    ] o.a.s.c.c.ZkStateReader Updated live nodes from ZooKeeper... (0) -> (1)
   [junit4]   2> 96186 INFO  (jetty-launcher-106-thread-1) [n:127.0.0.1:40409_solr    ] o.a.s.m.r.SolrJmxReporter JMX monitoring for 'solr_40409.solr.node' (registry 'solr.node') enabled at server: com.sun.jmx.mbeanserver.JmxMBeanServer@61546
   [junit4]   2> 96202 INFO  (jetty-launcher-106-thread-1) [n:127.0.0.1:40409_solr    ] o.a.s.m.r.SolrJmxReporter JMX monitoring for 'solr_40409.solr.jvm' (registry 'solr.jvm') enabled at server: com.sun.jmx.mbeanserver.JmxMBeanServer@61546
   [junit4]   2> 96202 INFO  (jetty-launcher-106-thread-1) [n:127.0.0.1:40409_solr    ] o.a.s.m.r.SolrJmxReporter JMX monitoring for 'solr_40409.solr.jetty' (registry 'solr.jetty') enabled at server: com.sun.jmx.mbeanserver.JmxMBeanServer@61546
   [junit4]   2> 96203 INFO  (jetty-launcher-106-thread-1) [n:127.0.0.1:40409_solr    ] o.a.s.c.CorePropertiesLocator Found 0 core definitions underneath /home/jenkins/workspace/Lucene-Solr-7.x-Linux/solr/build/solr-core/test/J1/temp/solr.cloud.LeaderElectionContextKeyTest_57D64213D9525745-001/tempDir-001/node1/.
   [junit4]   2> 96233 INFO  (SUITE-LeaderElectionContextKeyTest-seed#[57D64213D9525745]-worker) [    ] o.a.s.c.c.ZkStateReader Updated live nodes from ZooKeeper... (0) -> (1)
   [junit4]   2> 96233 INFO  (SUITE-LeaderElectionContextKeyTest-seed#[57D64213D9525745]-worker) [    ] o.a.s.c.s.i.ZkClientClusterStateProvider Cluster at 127.0.0.1:40943/solr ready
   [junit4]   2> 96239 INFO  (qtp17524196-599) [n:127.0.0.1:40409_solr    ] o.a.s.h.a.CollectionsHandler Invoked Collection Action :create with params replicationFactor=1&collection.configName=config&maxShardsPerNode=1000&name=testCollection1&nrtReplicas=1&action=CREATE&numShards=2&wt=javabin&version=2 and sendToOCPQueue=true
   [junit4]   2> 96241 INFO  (OverseerThreadFactory-170-thread-1-processing-n:127.0.0.1:40409_solr) [n:127.0.0.1:40409_solr    ] o.a.s.c.CreateCollectionCmd Create collection testCollection1
   [junit4]   2> 96347 INFO  (OverseerStateUpdate-98768367395340291-127.0.0.1:40409_solr-n_0000000000) [n:127.0.0.1:40409_solr    ] o.a.s.c.o.SliceMutator createReplica() {
   [junit4]   2>   "operation":"ADDREPLICA",
   [junit4]   2>   "collection":"testCollection1",
   [junit4]   2>   "shard":"shard1",
   [junit4]   2>   "core":"testCollection1_shard1_replica_n1",
   [junit4]   2>   "state":"down",
   [junit4]   2>   "base_url":"http://127.0.0.1:40409/solr",
   [junit4]   2>   "type":"NRT"} 
   [junit4]   2> 96349 INFO  (OverseerStateUpdate-98768367395340291-127.0.0.1:40409_solr-n_0000000000) [n:127.0.0.1:40409_solr    ] o.a.s.c.o.SliceMutator createReplica() {
   [junit4]   2>   "operation":"ADDREPLICA",
   [junit4]   2>   "collection":"testCollection1",
   [junit4]   2>   "shard":"shard2",
   [junit4]   2>   "core":"testCollection1_shard2_replica_n2",
   [junit4]   2>   "state":"down",
   [junit4]   2>   "base_url":"http://127.0.0.1:40409/solr",
   [junit4]   2>   "type":"NRT"} 
   [junit4]   2> 96558 INFO  (qtp17524196-595) [n:127.0.0.1:40409_solr    ] o.a.s.h.a.CoreAdminOperation core create command qt=/admin/cores&coreNodeName=core_node4&collection.configName=config&newCollection=true&name=testCollection1_shard2_replica_n2&action=CREATE&numShards=2&collection=testCollection1&shard=shard2&wt=javabin&version=2&replicaType=NRT
   [junit4]   2> 96558 INFO  (qtp17524196-595) [n:127.0.0.1:40409_solr    ] o.a.s.c.TransientSolrCoreCacheDefault Allocating transient cache for 2147483647 transient cores
   [junit4]   2> 96560 INFO  (qtp17524196-596) [n:127.0.0.1:40409_solr    ] o.a.s.h.a.CoreAdminOperation core create command qt=/admin/cores&coreNodeName=core_node3&collection.configName=config&newCollection=true&name=testCollection1_shard1_replica_n1&action=CREATE&numShards=2&collection=testCollection1&shard=shard1&wt=javabin&version=2&replicaType=NRT
   [junit4]   2> 96667 INFO  (zkCallback-113-thread-1-processing-n:127.0.0.1:40409_solr) [n:127.0.0.1:40409_solr    ] o.a.s.c.c.ZkStateReader A cluster state change: [WatchedEvent state:SyncConnected type:NodeDataChanged path:/collections/testCollection1/state.json] for collection [testCollection1] has occurred - updating... (live nodes size: [1])
   [junit4]   2> 97583 INFO  (qtp17524196-595) [n:127.0.0.1:40409_solr c:testCollection1 s:shard2 r:core_node4 x:testCollection1_shard2_replica_n2] o.a.s.c.SolrConfig Using Lucene MatchVersion: 7.1.0
   [junit4]   2> 97584 INFO  (qtp17524196-596) [n:127.0.0.1:40409_solr c:testCollection1 s:shard1 r:core_node3 x:testCollection1_shard1_replica_n1] o.a.s.c.SolrConfig Using Lucene MatchVersion: 7.1.0
   [junit4]   2> 97618 INFO  (qtp17524196-595) [n:127.0.0.1:40409_solr c:testCollection1 s:shard2 r:core_node4 x:testCollection1_shard2_replica_n2] o.a.s.s.IndexSchema [testCollection1_shard2_replica_n2] Schema name=minimal
   [junit4]   2> 97618 INFO  (qtp17524196-596) [n:127.0.0.1:40409_solr c:testCollection1 s:shard1 r:core_node3 x:testCollection1_shard1_replica_n1] o.a.s.s.IndexSchema [testCollection1_shard1_replica_n1] Schema name=minimal
   [junit4]   2> 97622 INFO  (qtp17524196-596) [n:127.0.0.1:40409_solr c:testCollection1 s:shard1 r:core_node3 x:testCollection1_shard1_replica_n1] o.a.s.s.IndexSchema Loaded schema minimal/1.1 with uniqueid field id
   [junit4]   2> 97622 INFO  (qtp17524196-596) [n:127.0.0.1:40409_solr c:testCollection1 s:shard1 r:core_node3 x:testCollection1_shard1_replica_n1] o.a.s.c.CoreContainer Creating SolrCore 'testCollection1_shard1_replica_n1' using configuration from collection testCollection1, trusted=true
   [junit4]   2> 97622 INFO  (qtp17524196-595) [n:127.0.0.1:40409_solr c:testCollection1 s:shard2 r:core_node4 x:testCollection1_shard2_replica_n2] o.a.s.s.IndexSchema Loaded schema minimal/1.1 with uniqueid field id
   [junit4]   2> 97623 INFO  (qtp17524196-595) [n:127.0.0.1:40409_solr c:testCollection1 s:shard2 r:core_node4 x:testCollection1_shard2_replica_n2] o.a.s.c.CoreContainer Creating SolrCore 'testCollection1_shard2_replica_n2' using configuration from collection testCollection1, trusted=true
   [junit4]   2> 97625 INFO  (qtp17524196-595) [n:127.0.0.1:40409_solr c:testCollection1 s:shard2 r:core_node4 x:testCollection1_shard2_replica_n2] o.a.s.m.r.SolrJmxReporter JMX monitoring for 'solr_40409.solr.core.testCollection1.shard2.replica_n2' (registry 'solr.core.testCollection1.shard2.replica_n2') enabled at server: com.sun.jmx.mbeanserver.JmxMBeanServer@61546
   [junit4]   2> 97625 INFO  (qtp17524196-596) [n:127.0.0.1:40409_solr c:testCollection1 s:shard1 r:core_node3 x:testCollection1_shard1_replica_n1] o.a.s.m.r.SolrJmxReporter JMX monitoring for 'solr_40409.solr.core.testCollection1.shard1.replica_n1' (registry 'solr.core.testCollection1.shard1.replica_n1') enabled at server: com.sun.jmx.mbeanserver.JmxMBeanServer@61546
   [junit4]   2> 97625 INFO  (qtp17524196-595) [n:127.0.0.1:40409_solr c:testCollection1 s:shard2 r:core_node4 x:testCollection1_shard2_replica_n2] o.a.s.c.SolrCore solr.RecoveryStrategy.Builder
   [junit4]   2> 97625 INFO  (qtp17524196-596) [n:127.0.0.1:40409_solr c:testCollection1 s:shard1 r:core_node3 x:testCollection1_shard1_replica_n1] o.a.s.c.SolrCore solr.RecoveryStrategy.Builder
   [junit4]   2> 97625 INFO  (qtp17524196-595) [n:127.0.0.1:40409_solr c:testCollection1 s:shard2 r:core_node4 x:testCollection1_shard2_replica_n2] o.a.s.c.SolrCore [[testCollection1_shard2_replica_n2] ] Opening new SolrCore at [/home/jenkins/workspace/Lucene-Solr-7.x-Linux/solr/build/solr-core/test/J1/temp/solr.cloud.LeaderElectionContextKeyTest_57D64213D9525745-001/tempDir-001/node1/testCollection1_shard2_replica_n2], dataDir=[/home/jenkins/workspace/Lucene-Solr-7.x-Linux/solr/build/solr-core/test/J1/temp/solr.cloud.LeaderElectionContextKeyTest_57D64213D9525745-001/tempDir-001/node1/./testCollection1_shard2_replica_n2/data/]
   [junit4]   2> 97625 INFO  (qtp17524196-596) [n:127.0.0.1:40409_solr c:testCollection1 s:shard1 r:core_node3 x:testCollection1_shard1_replica_n1] o.a.s.c.SolrCore [[testCollection1_shard1_replica_n1] ] Opening new SolrCore at [/home/jenkins/workspace/Lucene-Solr-7.x-Linux/solr/build/solr-core/test/J1/temp/solr.cloud.LeaderElectionContextKeyTest_57D64213D9525745-001/tempDir-001/node1/testCollection1_shard1_replica_n1], dataDir=[/home/jenkins/workspace/Lucene-Solr-7.x-Linux/solr/build/solr-core/test/J1/temp/solr.cloud.LeaderElectionContextKeyTest_57D64213D9525745-001/tempDir-001/node1/./testCollection1_shard1_replica_n1/data/]
   [junit4]   2> 97699 INFO  (qtp17524196-595) [n:127.0.0.1:40409_solr c:testCollection1 s:shard2 r:core_node4 x:testCollection1_shard2_replica_n2] o.a.s.u.UpdateHandler Using UpdateLog implementation: org.apache.solr.update.UpdateLog
   [junit4]   2> 97699 INFO  (qtp17524196-595) [n:127.0.0.1:40409_solr c:testCollection1 s:shard2 r:core_node4 x:testCollection1_shard2_replica_n2] o.a.s.u.UpdateLog Initializing UpdateLog: dataDir=null defaultSyncLevel=FLUSH numRecordsToKeep=100 maxNumLogsToKeep=10 numVersionBuckets=65536
   [junit4]   2> 97700 INFO  (qtp17524196-595) [n:127.0.0.1:40409_solr c:testCollection1 s:shard2 r:core_node4 x:testCollection1_shard2_replica_n2] o.a.s.u.CommitTracker Hard AutoCommit: disabled
   [junit4]   2> 97700 INFO  (qtp17524196-595) [n:127.0.0.1:40409_solr c:testCollection1 s:shard2 r:core_node4 x:testCollection1_shard2_replica_n2] o.a.s.u.CommitTracker Soft AutoCommit: disabled
   [junit4]   2> 97703 INFO  (qtp17524196-595) [n:127.0.0.1:40409_solr c:testCollection1 s:shard2 r:core_node4 x:testCollection1_shard2_replica_n2] o.a.s.s.SolrIndexSearcher Opening [Searcher@186e335[testCollection1_shard2_replica_n2] main]
   [junit4]   2> 97703 INFO  (qtp17524196-596) [n:127.0.0.1:40409_solr c:testCollection1 s:shard1 r:core_node3 x:testCollection1_shard1_replica_n1] o.a.s.u.UpdateHandler Using UpdateLog implementation: org.apache.solr.update.UpdateLog
   [junit4]   2> 97704 INFO  (qtp17524196-596) [n:127.0.0.1:40409_solr c:testCollection1 s:shard1 r:core_node3 x:testCollection1_shard1_replica_n1] o.a.s.u.UpdateLog Initializing UpdateLog: dataDir=null defaultSyncLevel=FLUSH numRecordsToKeep=100 maxNumLogsToKeep=10 numVersionBuckets=65536
   [junit4]   2> 97704 INFO  (qtp17524196-595) [n:127.0.0.1:40409_solr c:testCollection1 s:shard2 r:core_node4 x:testCollection1_shard2_replica_n2] o.a.s.r.ManagedResourceStorage Configured ZooKeeperStorageIO with znodeBase: /configs/config
   [junit4]   2> 97704 INFO  (qtp17524196-595) [n:127.0.0.1:40409_solr c:testCollection1 s:shard2 r:core_node4 x:testCollection1_shard2_replica_n2] o.a.s.r.ManagedResourceStorage Loaded null at path _rest_managed.json using ZooKeeperStorageIO:path=/configs/config
   [junit4]   2> 97705 INFO  (qtp17524196-595) [n:127.0.0.1:40409_solr c:testCollection1 s:shard2 r:core_node4 x:testCollection1_shard2_replica_n2] o.a.s.h.ReplicationHandler Commits will be reserved for 10000ms.
   [junit4]   2> 97705 INFO  (qtp17524196-596) [n:127.0.0.1:40409_solr c:testCollection1 s:shard1 r:core_node3 x:testCollection1_shard1_replica_n1] o.a.s.u.CommitTracker Hard AutoCommit: disabled
   [junit4]   2> 97705 INFO  (qtp17524196-596) [n:127.0.0.1:40409_solr c:testCollection1 s:shard1 r:core_node3 x:testCollection1_shard1_replica_n1] o.a.s.u.CommitTracker Soft AutoCommit: disabled
   [junit4]   2> 97710 INFO  (searcherExecutor-174-thread-1-processing-n:127.0.0.1:40409_solr x:testCollection1_shard2_replica_n2 s:shard2 c:testCollection1 r:core_node4) [n:127.0.0.1:40409_solr c:testCollection1 s:shard2 r:core_node4 x:testCollection1_shard2_replica_n2] o.a.s.c.SolrCore [testCollection1_shard2_replica_n2] Registered new searcher Searcher@186e335[testCollection1_shard2_replica_n2] main{ExitableDirectoryReader(UninvertingDirectoryReader())}
   [junit4]   2> 97711 INFO  (qtp17524196-595) [n:127.0.0.1:40409_solr c:testCollection1 s:shard2 r:core_node4 x:testCollection1_shard2_replica_n2] o.a.s.u.UpdateLog Could not find max version in index or recent updates, using new clock 1580293880375410688
   [junit4]   2> 97713 INFO  (qtp17524196-596) [n:127.0.0.1:40409_solr c:testCollection1 s:shard1 r:core_node3 x:testCollection1_shard1_replica_n1] o.a.s.s.SolrIndexSearcher Opening [Searcher@150cba6[testCollection1_shard1_replica_n1] main]
   [junit4]   2> 97713 INFO  (qtp17524196-596) [n:127.0.0.1:40409_solr c:testCollection1 s:shard1 r:core_node3 x:testCollection1_shard1_replica_n1] o.a.s.r.ManagedResourceStorage Configured ZooKeeperStorageIO with znodeBase: /configs/config
   [junit4]   2> 97714 INFO  (qtp17524196-596) [n:127.0.0.1:40409_solr c:testCollection1 s:shard1 r:core_node3 x:testCollection1_shard1_replica_n1] o.a.s.r.ManagedResourceStorage Loaded null at path _rest_managed.json using ZooKeeperStorageIO:path=/configs/config
   [junit4]   2> 97715 INFO  (qtp17524196-596) [n:127.0.0.1:40409_solr c:testCollection1 s:shard1 r:core_node3 x:testCollection1_shard1_replica_n1] o.a.s.h.ReplicationHandler Commits will be reserved for 10000ms.
   [junit4]   2> 97715 INFO  (qtp17524196-596) [n:127.0.0.1:40409_solr c:testCollection1 s:shard1 r:core_node3 x:testCollection1_shard1_replica_n1] o.a.s.u.UpdateLog Could not find max version in index or recent updates, using new clock 1580293880379604992
   [junit4]   2> 97716 INFO  (qtp17524196-595) [n:127.0.0.1:40409_solr c:testCollection1 s:shard2 r:core_node4 x:testCollection1_shard2_replica_n2] o.a.s.c.ShardLeaderElectionContext Enough replicas found to continue.
   [junit4]   2> 97716 INFO  (qtp17524196-595) [n:127.0.0.1:40409_solr c:testCollection1 s:shard2 r:core_node4 x:testCollection1_shard2_replica_n2] o.a.s.c.ShardLeaderElectionContext I may be the new leader - try and sync
   [junit4]   2> 97716 INFO  (qtp17524196-595) [n:127.0.0.1:40409_solr c:testCollection1 s:shard2 r:core_node4 x:testCollection1_shard2_replica_n2] o.a.s.c.SyncStrategy Sync replicas to http://127.0.0.1:40409/solr/testCollection1_shard2_replica_n2/
   [junit4]   2> 97717 INFO  (qtp17524196-595) [n:127.0.0.1:40409_solr c:testCollection1 s:shard2 r:core_node4 x:testCollection1_shard2_replica_n2] o.a.s.c.SyncStrategy Sync Success - now sync replicas to me
   [junit4]   2> 97717 INFO  (qtp17524196-595) [n:127.0.0.1:40409_solr c:testCollection1 s:shard2 r:core_node4 x:testCollection1_shard2_replica_n2] o.a.s.c.SyncStrategy http://127.0.0.1:40409/solr/testCollection1_shard2_replica_n2/ has no replicas
   [junit4]   2> 97717 INFO  (qtp17524196-595) [n:127.0.0.1:40409_solr c:testCollection1 s:shard2 r:core_node4 x:testCollection1_shard2_replica_n2] o.a.s.c.ShardLeaderElectionContext Found all replicas participating in election, clear LIR
   [junit4]   2> 97718 INFO  (searcherExecutor-173-thread-1-processing-n:127.0.0.1:40409_solr x:testCollection1_shard1_replica_n1 s:shard1 c:testCollection1 r:core_node3) [n:127.0.0.1:40409_solr c:testCollection1 s:shard1 r:core_node3 x:testCollection1_shard1_replica_n1] o.a.s.c.SolrCore [testCollection1_shard1_replica_n1] Registered new searcher Searcher@150cba6[testCollection1_shard1_replica_n1] main{ExitableDirectoryReader(UninvertingDirectoryReader())}
   [junit4]   2> 97720 INFO  (qtp17524196-596) [n:127.0.0.1:40409_solr c:testCollection1 s:shard1 r:core_node3 x:testCollection1_shard1_replica_n1] o.a.s.c.ShardLeaderElectionContext Enough replicas found to continue.
   [junit4]   2> 97720 INFO  (qtp17524196-596) [n:127.0.0.1:40409_solr c:testCollection1 s:shard1 r:core_node3 x:testCollection1_shard1_replica_n1] o.a.s.c.ShardLeaderElectionContext I may be the new leader - try and sync
   [junit4]   2> 97720 INFO  (qtp17524196-596) [n:127.0.0.1:40409_solr c:testCollection1 s:shard1 r:core_node3 x:testCollection1_shard1_replica_n1] o.a.s.c.SyncStrategy Sync replicas to http://127.0.0.1:40409/solr/testCollection1_shard1_replica_n1/
   [junit4]   2> 97720 INFO  (qtp17524196-596) [n:127.0.0.1:40409_solr c:testCollection1 s:shard1 r:core_node3 x:testCollection1_shard1_replica_n1] o.a.s.c.SyncStrategy Sync Success - now sync replicas to me
   [junit4]   2> 97720 INFO  (qtp17524196-596) [n:127.0.0.1:40409_solr c:testCollection1 s:shard1 r:core_node3 x:testCollection1_shard1_replica_n1] o.a.s.c.SyncStrategy http://127.0.0.1:40409/solr/testCollection1_shard1_replica_n1/ has no replicas
   [junit4]   2> 97720 INFO  (qtp17524196-596) [n:127.0.0.1:40409_solr c:testCollection1 s:shard1 r:core_node3 x:testCollection1_shard1_replica_n1] o.a.s.c.ShardLeaderElectionContext Found all replicas participating in election, clear LIR
   [junit4]   2> 97723 INFO  (qtp17524196-596) [n:127.0.0.1:40409_solr c:testCollection1 s:shard1 r:core_node3 x:testCollection1_shard1_replica_n1] o.a.s.c.ShardLeaderElectionContext I am the new leader: http://127.0.0.1:40409/solr/testCollection1_shard1_replica_n1/ shard1
   [junit4]   2> 97723 INFO  (qtp17524196-595) [n:127.0.0.1:40409_solr c:testCollection1 s:shard2 r:core_node4 x:testCollection1_shard2_replica_n2] o.a.s.c.ShardLeaderElectionContext I am the new leader: http://127.0.0.1:40409/solr/testCollection1_shard2_replica_n2/ shard2
   [junit4]   2> 97825 INFO  (zkCallback-113-thread-1-processing-n:127.0.0.1:40409_solr) [n:127.0.0.1:40409_solr    ] o.a.s.c.c.ZkStateReader A cluster state change: [WatchedEvent state:SyncConnected type:NodeDataChanged path:/collections/testCollection1/state.json] for collection [testCollection1] has occurred - updating... (live nodes size: [1])
   [junit4]   2> 97874 INFO  (qtp17524196-596) [n:127.0.0.1:40409_solr c:testCollection1 s:shard1 r:core_node3 x:testCollection1_shard1_replica_n1] o.a.s.c.ZkController I am the leader, no recovery necessary
   [junit4]   2> 97874 INFO  (qtp17524196-595) [n:127.0.0.1:40409_solr c:testCollection1 s:shard2 r:core_node4 x:testCollection1_shard2_replica_n2] o.a.s.c.ZkController I am the leader, no recovery necessary
   [junit4]   2> 97875 INFO  (qtp17524196-596) [n:127.0.0.1:40409_solr c:testCollection1 s:shard1 r:core_node3 x:testCollection1_shard1_replica_n1] o.a.s.s.HttpSolrCall [admin] webapp=null path=/admin/cores params={qt=/admin/cores&coreNodeName=core_node3&collection.configName=config&newCollection=true&name=testCollection1_shard1_replica_n1&action=CREATE&numShards=2&collection=testCollection1&shard=shard1&wt=javabin&version=2&replicaType=NRT} status=0 QTime=1315
   [junit4]   2> 97877 INFO  (qtp17524196-595) [n:127.0.0.1:40409_solr c:testCollection1 s:shard2 r:core_node4 x:testCollection1_shard2_replica_n2] o.a.s.s.HttpSolrCall [admin] webapp=null path=/admin/cores params={qt=/admin/cores&coreNodeName=core_node4&collection.configName=config&newCollection=true&name=testCollection1_shard2_replica_n2&action=CREATE&numShards=2&collection=testCollection1&shard=shard2&wt=javabin&version=2&replicaType=NRT} status=0 QTime=1319
   [junit4]   2> 97884 INFO  (qtp17524196-599) [n:127.0.0.1:40409_solr    ] o.a.s.h.a.CollectionsHandler Wait for new collection to be active for at most 30 seconds. Check all shard replicas
   [junit4]   2> 97984 INFO  (zkCallback-113-thread-2-processing-n:127.0.0.1:40409_solr) [n:127.0.0.1:40409_solr    ] o.a.s.c.c.ZkStateReader A cluster state change: [WatchedEvent state:SyncConnected type:NodeDataChanged path:/collections/testCollection1/state.json] for collection [testCollection1] has occurred - updating... (live nodes size: [1])
   [junit4]   2> 98243 INFO  (OverseerCollectionConfigSetProcessor-98768367395340291-127.0.0.1:40409_solr-n_0000000000) [n:127.0.0.1:40409_solr    ] o.a.s.c.OverseerTaskQueue Response ZK path: /overseer/collection-queue-work/qnr-0000000000 doesn't exist.  Requestor may have disconnected from ZooKeeper
   [junit4]   2> 98884 INFO  (qtp17524196-599) [n:127.0.0.1:40409_solr    ] o.a.s.s.HttpSolrCall [admin] webapp=null path=/admin/collections params={replicationFactor=1&collection.configName=config&maxShardsPerNode=1000&name=testCollection1&nrtReplicas=1&action=CREATE&numShards=2&wt=javabin&version=2} status=0 QTime=2645
   [junit4]   2> 98886 INFO  (qtp17524196-600) [n:127.0.0.1:40409_solr    ] o.a.s.h.a.CollectionsHandler Invoked Collection Action :create with params replicationFactor=1&collection.configName=config&maxShardsPerNode=1000&name=testCollection2&nrtReplicas=1&action=CREATE&numShards=2&wt=javabin&version=2 and sendToOCPQueue=true
   [junit4]   2> 98890 INFO  (OverseerThreadFactory-170-thread-2-processing-n:127.0.0.1:40409_solr) [n:127.0.0.1:40409_solr    ] o.a.s.c.CreateCollectionCmd Create collection testCollection2
   [junit4]   2> 99099 INFO  (OverseerStateUpdate-98768367395340291-127.0.0.1:40409_solr-n_0000000000) [n:127.0.0.1:40409_solr    ] o.a.s.c.o.SliceMutator createReplica() {
   [junit4]   2>   "operation":"ADDREPLICA",
   [junit4]   2>   "collection":"testCollection2",
   [junit4]   2>   "shard":"shard1",
   [junit4]   2>   "core":"testCollection2_shard1_replica_n1",
   [junit4]   2>   "state":"down",
   [junit4]   2>   "base_url":"http://127.0.0.1:40409/solr",
   [junit4]   2>   "type":"NRT"} 
   [junit4]   2> 99101 INFO  (OverseerStateUpdate-98768367395340291-127.0.0.1:40409_solr-n_0000000000) [n:127.0.0.1:40409_solr    ] o.a.s.c.o.SliceMutator createReplica() {
   [junit4]   2>   "operation":"ADDREPLICA",
   [junit4]   2>   "collection":"testCollection2",
   [junit4]   2>   "shard":"shard2",
   [junit4]   2>   "core":"testCollection2_shard2_replica_n3",
   [junit4]   2>   "state":"down",
   [junit4]   2>   "base_url":"http://127.0.0.1:40409/solr",
   [junit4]   2>   "type":"NRT"} 
   [junit4]   2> 99306 INFO  (qtp17524196-594) [n:127.0.0.1:40409_solr    ] o.a.s.h.a.CoreAdminOperation core create command qt=/admin/cores&coreNodeName=core_node4&collection.configName=config&newCollection=true&name=testCollection2_shard2_replica_n3&action=CREATE&numShards=2&collection=testCollection2&shard=shard2&wt=javabin&version=2&replicaType=NRT
   [junit4]   2> 99306 INFO  (qtp17524196-601) [n:127.0.0.1:40409_solr    ] o.a.s.h.a.CoreAdminOperation core create command qt=/admin/cores&coreNodeName=core_node2&collection.configName=config&newCollection=true&name=testCollection2_shard1_replica_n1&action=CREATE&numShards=2&collection=testCollection2&shard=shard1&wt=javabin&version=2&replicaType=NRT
   [junit4]   2> 99410 INFO  (zkCallback-113-thread-2-processing-n:127.0.0.1:40409_solr) [n:127.0.0.1:40409_solr    ] o.a.s.c.c.ZkStateReader A cluster state change: [WatchedEvent state:SyncConnected type:NodeDataChanged path:/collections/testCollection2/state.json] for collection [testCollection2] has occurred - updating... (live nodes size: [1])
   [junit4]   2> 99410 INFO  (zkCallback-113-thread-1-processing-n:127.0.0.1:40409_solr) [n:127.0.0.1:40409_solr    ] o.a.s.c.c.ZkStateReader A cluster state change: [WatchedEvent state:SyncConnected type:NodeDataChanged path:/collections/testCollection2/state.json] for collection [testCollection2] has occurred - updating... (live nodes size: [1])
   [junit4]   2> 100319 INFO  (qtp17524196-594) [n:127.0.0.1:40409_solr c:testCollection2 s:shard2 r:core_node4 x:testCollection2_shard2_replica_n3] o.a.s.c.SolrConfig Using Lucene MatchVersion: 7.1.0
   [junit4]   2> 100327 INFO  (qtp17524196-601) [n:127.0.0.1:40409_solr c:testCollection2 s:shard1 r:core_node2 x:testCollection2_shard1_replica_n1] o.a.s.c.SolrConfig Using Lucene MatchVersion: 7.1.0
   [junit4]   2> 100332 INFO  (qtp17524196-594) [n:127.0.0.1:40409_solr c:testCollection2 s:shard2 r:core_node4 x:testCollection2_shard2_replica_n3] o.a.s.s.IndexSchema [testCollection2_shard2_replica_n3] Schema name=minimal
   [junit4]   2> 100336 INFO  (qtp17524196-594) [n:127.0.0.1:40409_solr c:testCollection2 s:shard2 r:core_node4 x:testCollection2_shard2_replica_n3] o.a.s.s.IndexSchema Loaded schema minimal/1.1 with uniqueid field id
   [junit4]   2> 100336 INFO  (qtp17524196-594) [n:127.0.0.1:40409_solr c:testCollection2 s:shard2 r:core_node4 x:testCollection2_shard2_replica_n3] o.a.s.c.CoreContainer Creating SolrCore 'testCollection2_shard2_replica_n3' using configuration from collection testCollection2, trusted=true
   [junit4]   2> 100337 INFO  (qtp17524196-594) [n:127.0.0.1:40409_solr c:testCollection2 s:shard2 r:core_node4 x:testCollection2_shard2_replica_n3] o.a.s.m.r.SolrJmxReporter JMX monitoring for 'solr_40409.solr.core.testCollection2.shard2.replica_n3' (registry 'solr.core.testCollection2.shard2.replica_n3') enabled at server: com.sun.jmx.mbeanserver.JmxMBeanServer@61546
   [junit4]   2> 100337 INFO  (qtp17524196-594) [n:127.0.0.1:40409_solr c:testCollection2 s:shard2 r:core_node4 x:testCollection2_shard2_replica_n3] o.a.s.c.SolrCore solr.RecoveryStrategy.Builder
   [junit4]   2> 100337 INFO  (qtp17524196-594) [n:127.0.0.1:40409_solr c:testCollection2 s:shard2 r:core_node4 x:testCollection2_shard2_replica_n3] o.a.s.c.SolrCore [[testCollection2_shard2_replica_n3] ] Opening new SolrCore at [/home/jenkins/workspace/Lucene-Solr-7.x-Linux/solr/build/solr-core/test/J1/temp/solr.cloud.LeaderElectionContextKeyTest_57D64213D9525745-001/tempDir-001/node1/testCollection2_shard2_replica_n3], dataDir=[/home/jenkins/workspace/Lucene-Solr-7.x-Linux/solr/build/solr-core/test/J1/temp/solr.cloud.LeaderElectionContextKeyTest_57D64213D9525745-001/tempDir-001/node1/./testCollection2_shard2_replica_n3/data/]
   [junit4]   2> 100349 INFO  (qtp17524196-601) [n:127.0.0.1:40409_solr c:testCollection2 s:shard1 r:core_node2 x:testCollection2_shard1_replica_n1] o.a.s.s.IndexSchema [testCollection2_shard1_replica_n1] Schema name=minimal
   [junit4]   2> 100353 INFO  (qtp17524196-601) [n:127.0.0.1:40409_solr c:testCollection2 s:shard1 r:core_node2 x:testCollection2_shard1_replica_n1] o.a.s.s.IndexSchema Loaded schema minimal/1.1 with uniqueid field id
   [junit4]   2> 100353 INFO  (qtp17524196-601) [n:127.0.0.1:40409_solr c:testCollection2 s:shard1 r:core_node2 x:testCollection2_shard1_replica_n1] o.a.s.c.CoreContainer Creating SolrCore 'testCollection2_shard1_replica_n1' using configuration from collection testCollection2, trusted=true
   [junit4]   2> 100353 INFO  (qtp17524196-601) [n:127.0.0.1:40409_solr c:testCollection2 s:shard1 r:core_node2 x:testCollection2_shard1_replica_n1] o.a.s.m.r.SolrJmxReporter JMX monitoring for 'solr_40409.solr.core.testCollection2.shard1.replica_n1' (registry 'solr.core.testCollection2.shard1.replica_n1') enabled at server: com.sun.jmx.mbeanserver.JmxMBeanServer@61546
   [junit4]   2> 100354 INFO  (qtp17524196-601) [n:127.0.0.1:40409_solr c:testCollection2 s:shard1 r:core_node2 x:testCollection2_shard1_replica_n1] o.a.s.c.SolrCore solr.RecoveryStrategy.Builder
   [junit4]   2> 100354 INFO  (qtp17524196-601) [n:127.0.0.1:40409_solr c:testCollection2 s:shard1 r:core_node2 x:testCollection2_shard1_replica_n1] o.a.s.c.SolrCore [[testCollection2_shard1_replica_n1] ] Opening new SolrCore at [/home/jenkins/workspace/Lucene-Solr-7.x-Linux/solr/build/solr-core/test/J1/temp/solr.cloud.LeaderElectionContextKeyTest_57D64213D9525745-001/tempDir-001/node1/testCollection2_shard1_replica_n1], dataDir=[/home/jenkins/workspace/Lucene-Solr-7.x-Linux/solr/build/solr-core/test/J1/temp/solr.cloud.LeaderElectionContextKeyTest_57D64213D9525745-001/tempDir-001/node1/./testCollection2_shard1_replica_n1/data/]
   [junit4]   2> 100446 INFO  (qtp17524196-601) [n:127.0.0.1:40409_solr c:testCollection2 s:shard1 r:core_node2 x:testCollection2_shard1_replica_n1] o.a.s.u.UpdateHandler Using UpdateLog implementation: org.apache.solr.update.UpdateLog
   [junit4]   2> 100446 INFO  (qtp17524196-601) [n:127.0.0.1:40409_solr c:testCollection2 s:shard1 r:core_node2 x:testCollection2_shard1_replica_n1] o.a.s.u.UpdateLog Initializing UpdateLog: dataDir=null defaultSyncLevel=FLUSH numRecordsToKeep=100 maxNumLogsToKeep=10 numVersionBuckets=65536
   [junit4]   2> 100448 INFO  (qtp17524196-601) [n:127.0.0.1:40409_solr c:testCollection2 s:shard1 r:core_node2 x:testCollection2_shard1_replica_n1] o.a.s.u.CommitTracker Hard AutoCommit: disabled
   [junit4]   2> 100448 INFO  (qtp17524196-601) [n:127.0.0.1:40409_solr c:testCollection2 s:shard1 r:core_node2 x:testCollection2_shard1_replica_n1] o.a.s.u.CommitTracker Soft AutoCommit: disabled
   [junit4]   2> 100449 INFO  (qtp17524196-594) [n:127.0.0.1:40409_solr c:testCollection2 s:shard2 r:core_node4 x:testCollection2_shard2_replica_n3] o.a.s.u.UpdateHandler Using UpdateLog implementation: org.apache.solr.update.UpdateLog
   [junit4]   2> 100449 INFO  (qtp17524196-594) [n:127.0.0.1:40409_solr c:testCollection2 s:shard2 r:core_node4 x:testCollection2_shard2_replica_n3] o.a.s.u.UpdateLog Initializing UpdateLog: dataDir=null defaultSyncLevel=FLUSH numRecordsToKeep=100 maxNumLogsToKeep=10 numVersionBuckets=65536
   [junit4]   2> 100450 INFO  (qtp17524196-601) [n:127.0.0.1:40409_solr c:testCollection2 s:shard1 r:core_node2 x:testCollection2_shard1_replica_n1] o.a.s.s.SolrIndexSearcher Opening [Searcher@1080202[testCollection2_shard1_replica_n1] main]
   [junit4]   2> 100451 INFO  (qtp17524196-594) [n:127.0.0.1:40409_solr c:testCollection2 s:shard2 r:core_node4 x:testCollection2_shard2_replica_n3] o.a.s.u.CommitTracker Hard AutoCommit: disabled
   [junit4]   2> 100451 INFO  (qtp17524196-594) [n:127.0.0.1:40409_solr c:testCollection2 s:shard2 r:core_node4 x:testCollection2_shard2_replica_n3] o.a.s.u.CommitTracker Soft AutoCommit: disabled
   [junit4]   2> 100452 INFO  (qtp17524196-601) [n:127.0.0.1:40409_solr c:testCollection2 s:shard1 r:core_node2 x:testCollection2_shard1_replica_n1] o.a.s.r.ManagedResourceStorage Configured ZooKeeperStorageIO with znodeBase: /configs/config
   [junit4]   2> 100452 INFO  (qtp17524196-601) [n:127.0.0.1:40409_solr c:testCollection2 s:shard1 r:core_node2 x:testCollection2_shard1_replica_n1] o.a.s.r.ManagedResourceStorage Loaded null at path _rest_managed.json using ZooKeeperStorageIO:path=/configs/config
   [junit4]   2> 100453 INFO  (qtp17524196-601) [n:127.0.0.1:40409_solr c:testCollection2 s:shard1 r:core_node2 x:testCollection2_shard1_replica_n1] o.a.s.h.ReplicationHandler Commits will be reserved for 10000ms.
   [junit4]   2> 100454 INFO  (qtp17524196-594) [n:127.0.0.1:40409_solr c:testCollection2 s:shard2 r:core_node4 x:testCollection2_shard2_replica_n3] o.a.s.s.SolrIndexSearcher Opening [Searcher@1c36d7b[testCollection2_shard2_replica_n3] main]
   [junit4]   2> 100455 INFO  (qtp17524196-594) [n:127.0.0.1:40409_solr c:testCollection2 s:shard2 r:core_node4 x:testCollection2_shard2_replica_n3] o.a.s.r.ManagedResourceStorage Configured ZooKeeperStorageIO with znodeBase: /configs/config
   [junit4]   2> 100455 INFO  (searcherExecutor-184-thread-1-processing-n:127.0.0.1:40409_solr x:testCollection2_shard1_replica_n1 s:shard1 c:testCollection2 r:core_node2) [n:127.0.0.1:40409_solr c:testCollection2 s:shard1 r:core_node2 x:testCollection2_shard1_replica_n1] o.a.s.c.SolrCore [testCollection2_shard1_replica_n1] Registered new searcher Searcher@1080202[testCollection2_shard1_replica_n1] main{ExitableDirectoryReader(UninvertingDirectoryReader())}
   [junit4]   2> 100455 INFO  (qtp17524196-601) [n:127.0.0.1:40409_solr c:testCollection2 s:shard1 r:core_node2 x:testCollection2_shard1_replica_n1] o.a.s.u.UpdateLog Could not find max version in index or recent updates, using new clock 1580293883252703232
   [junit4]   2> 100455 INFO  (qtp17524196-594) [n:127.0.0.1:40409_solr c:testCollection2 s:shard2 r:core_node4 x:testCollection2_shard2_replica_n3] o.a.s.r.ManagedResourceStorage Loaded null at path _rest_managed.json using ZooKeeperStorageIO:path=/configs/config
   [junit4]   2> 100456 INFO  (qtp17524196-594) [n:127.0.0.1:40409_solr c:testCollection2 s:shard2 r:core_node4 x:testCollection2_shard2_replica_n3] o.a.s.h.ReplicationHandler Commits will be reserved for 10000ms.
   [junit4]   2> 100456 INFO  (qtp17524196-594) [n:127.0.0.1:40409_solr c:testCollection2 s:shard2 r:core_node4 x:testCollection2_shard2_replica_n3] o.a.s.u.UpdateLog Could not find max version in index or recent updates, using new clock 1580293883253751808
   [junit4]   2> 100458 INFO  (qtp17524196-601) [n:127.0.0.1:40409_solr c:testCollection2 s:shard1 r:core_node2 x:testCollection2_shard1_replica_n1] o.a.s.c.ShardLeaderElectionContext Enough replicas found to continue.
   [junit4]   2> 100459 INFO  (qtp17524196-601) [n:127.0.0.1:40409_solr c:testCollection2 s:shard1 r:core_node2 x:testCollection2_shard1_replica_n1] o.a.s.c.ShardLeaderElectionContext I may be the new leader - try and sync
   [junit4]   2> 100459 INFO  (qtp17524196-601) [n:127.0.0.1:40409_solr c:testCollection2 s:shard1 r:core_node2 x:testCollection2_shard1_replica_n1] o.a.s.c.SyncStrategy Sync replicas to http://127.0.0.1:40409/solr/testCollection2_shard1_replica_n1/
   [junit4]   2> 100459 INFO  (qtp17524196-601) [n:127.0.0.1:40409_solr c:testCollection2 s:shard1 r:core_node2 x:testCollection2_shard1_replica_n1] o.a.s.c.SyncStrategy Sync Success - now sync replicas to me
   [junit4]   2> 100459 INFO  (qtp17524196-601) [n:127.0.0.1:40409_solr c:testCollection2 s:shard1 r:core_node2 x:testCollection2_shard1_replica_n1] o.a.s.c.SyncStrategy http://127.0.0.1:40409/solr/testCollection2_shard1_replica_n1/ has no replicas
   [junit4]   2> 100459 INFO  (qtp17524196-601) [n:127.0.0.1:40409_solr c:testCollection2 s:shard1 r:core_node2 x:testCollection2_shard1_replica_n1] o.a.s.c.ShardLeaderElectionContext Found all replicas participating in election, clear LIR
   [junit4]   2> 100460 INFO  (searcherExecutor-183-thread-1-processing-n:127.0.0.1:40409_solr x:testCollection2_shard2_replica_n3 s:shard2 c:testCollection2 r:core_node4) [n:127.0.0.1:40409_solr c:testCollection2 s:shard2 r:core_node4 x:testCollection2_shard2_replica_n3] o.a.s.c.SolrCore [testCollection2_shard2_replica_n3] Registered new searcher Searcher@1c36d7b[testCollection2_shard2_replica_n3] main{ExitableDirectoryReader(UninvertingDirectoryReader())}
   [junit4]   2> 100462 INFO  (qtp17524196-594) [n:127.0.0.1:40409_solr c:testCollection2 s:shard2 r:core_node4 x:testCollection2_shard2_replica_n3] o.a.s.c.ShardLeaderElectionContext Enough replicas found to continue.
   [junit4]   2> 100462 INFO  (qtp17524196-594) [n:127.0.0.1:40409_solr c:testCollection2 s:shard2 r:core_node4 x:testCollection2_shard2_replica_n3] o.a.s.c.ShardLeaderElectionContext I may be the new leader - try and sync
   [junit4]   2> 100462 INFO  (qtp17524196-594) [n:127.0.0.1:40409_solr c:testCollection2 s:shard2 r:core_node4 x:testCollection2_shard2_replica_n3] o.a.s.c.SyncStrategy Sync replicas to http://127.0.0.1:40409/solr/testCollection2_shard2_replica_n3/
   [junit4]   2> 100462 INFO  (qtp17524196-594) [n:127.0.0.1:40409_solr c:testCollection2 s:shard2 r:core_node4 x:testCollection2_shard2_replica_n3] o.a.s.c.SyncStrategy Sync Success - now sync replicas to me
   [junit4]   2> 100462 INFO  (qtp17524196-594) [n:127.0.0.1:40409_solr c:testCollection2 s:shard2 r:core_node4 x:testCollection2_shard2_replica_n3] o.a.s.c.SyncStrategy http://127.0.0.1:40409/solr/testCollection2_shard2_replica_n3/ has no replicas
   [junit4]   2> 100462 INFO  (qtp17524196-594) [n:127.0.0.1:40409_solr c:testCollection2 s:shard2 r:core_node4 x:testCollection2_shard2_replica_n3] o.a.s.c.ShardLeaderElectionContext Found all replicas participating in election, clear LIR
   [junit4]   2> 100463 INFO  (qtp17524196-601) [n:127.0.0.1:40409_solr c:testCollection2 s:shard1 r:core_node2 x:testCollection2_shard1_replica_n1] o.a.s.c.ShardLeaderElectionContext I am the new leader: http://127.0.0.1:40409/solr/testCollection2_shard1_replica_n1/ shard1
   [junit4]   2> 100465 INFO  (qtp17524196-594) [n:127.0.0.1:40409_solr c:testCollection2 s:shard2 r:core_node4 x:testCollection2_shard2_replica_n3] o.a.s.c.ShardLeaderElectionContext I am the new leader: http://127.0.0.1:40409/solr/testCollection2_shard2_replica_n3/ shard2
   [junit4]   2> 100567 INFO  (zkCallback-113-thread-2-processing-n:127.0.0.1:40409_solr) [n:127.0.0.1:40409_solr    ] o.a.s.c.c.ZkStateReader A cluster state change: [WatchedEvent state:SyncConnected type:NodeDataChanged path:/collections/testCollection2/state.json] for collection [testCollection2] has occurred - updating... (live nodes size: [1])
   [junit4]   2> 100567 INFO  (zkCallback-113-thread-1-processing-n:127.0.0.1:40409_solr) [n:127.0.0.1:40409_solr    ] o.a.s.c.c.ZkStateReader A cluster state change: [WatchedEvent state:SyncConnected type:NodeDataChanged path:/collections/testCollection2/state.json] for collection [testCollection2] has occurred - updating... (live nodes size: [1])
   [junit4]   2> 100614 INFO  (qtp17524196-601) [n:127.0.0.1:40409_solr c:testCollection2 s:shard1 r:core_node2 x:testCollection2_shard1_replica_n1] o.a.s.c.ZkController I am the leader, no recovery necessary
   [junit4]   2> 100615 INFO  (qtp17524196-601) [n:127.0.0.1:40409_solr c:testCollection2 s:shard1 r:core_node2 x:testCollection2_shard1_replica_n1] o.a.s.s.HttpSolrCall [admin] webapp=null path=/admin/cores params={qt=/admin/cores&coreNodeName=core_node2&collection.configName=config&newCollection=true&name=testCollection2_shard1_replica_n1&action=CREATE&numShards=2&collection=testCollection2&shard=shard1&wt=javabin&version=2&replicaType=NRT} status=0 QTime=1309
   [junit4]   2> 100617 INFO  (qtp17524196-594) [n:127.0.0.1:40409_solr c:testCollection2 s:shard2 r:core_node4 x:testCollection2_shard2_replica_n3] o.a.s.c.ZkController I am the leader, no recovery necessary
   [junit4]   2> 100619 INFO  (qtp17524196-594) [n:127.0.0.1:40409_solr c:testCollection2 s:shard2 r:core_node4 x:testCollection2_shard2_replica_n3] o.a.s.s.HttpSolrCall [admin] webapp=null path=/admin/cores params={qt=/admin/cores&coreNodeName=core_node4&collection.configName=config&newCollection=true&name=testCollection2_shard2_replica_n3&action=CREATE&numShards=2&collection=testCollection2&shard=shard2&wt=javabin&version=2&replicaType=NRT} status=0 QTime=1313
   [junit4]   2> 100623 INFO  (qtp17524196-600) [n:127.0.0.1:40409_solr    ] o.a.s.h.a.CollectionsHandler Wait for new collection to be active for at most 30 seconds. Check all shard replicas
   [junit4]   2> 100719 INFO  (zkCallback-113-thread-2-processing-n:127.0.0.1:40409_solr) [n:127.0.0.1:40409_solr    ] o.a.s.c.c.ZkStateReader A cluster state change: [WatchedEvent state:SyncConnected type:NodeDataChanged path:/collections/testCollection2/state.json] for collection [testCollection2] has occurred - updating... (live nodes size: [1])
   [junit4]   2> 100719 INFO  (zkCallback-113-thread-1-processing-n:127.0.0.1:40409_solr) [n:127.0.0.1:40409_solr    ] o.a.s.c.c.ZkStateReader A cluster state change: [WatchedEvent state:SyncConnected type:NodeDataChanged path:/collections/testCollection2/state.json] for collection [testCollection2] has occurred - updating... (live nodes size: [1])
   [junit4]   2> 100891 INFO  (OverseerCollectionConfigSetProcessor-98768367395340291-127.0.0.1:40409_solr-n_0000000000) [n:127.0.0.1:40409_solr    ] o.a.s.c.OverseerTaskQueue Response ZK path: /overseer/collection-queue-work/qnr-0000000002 doesn't exist.  Requestor may have disconnected from ZooKeeper
   [junit4]   2> 101623 INFO  (qtp17524196-600) [n:127.0.0.1:40409_solr    ] o.a.s.s.HttpSolrCall [admin] webapp=null path=/admin/collections params={replicationFactor=1&collection.configName=config&maxShardsPerNode=1000&name=testCollection2&nrtReplicas=1&action=CREATE&numShards=2&wt=javabin&version=2} status=0 QTime=2737
   [junit4]   2> 101624 INFO  (SUITE-LeaderElectionContextKeyTest-seed#[57D64213D9525745]-worker) [    ] o.a.s.c.AbstractDistribZkTestBase Wait for recoveries to finish - collection: testCollection1 failOnTimeout:true timeout (sec):30
   [junit4]   2> 101624 INFO  (SUITE-LeaderElectionContextKeyTest-seed#[57D64213D9525745]-worker) [    ] o.a.s.c.AbstractDistribZkTestBase Recoveries finished - collection: testCollection1
   [junit4]   2> 101624 INFO  (SUITE-LeaderElectionContextKeyTest-seed#[57D64213D9525745]-worker) [    ] o.a.s.c.AbstractDistribZkTestBase Wait for recoveries to finish - collection: testCollection2 failOnTimeout:true timeout (sec):30
   [junit4]   2> 101625 INFO  (SUITE-LeaderElectionContextKeyTest-seed#[57D64213D9525745]-worker) [    ] o.a.s.c.AbstractDistribZkTestBase Recoveries finished - collection: testCollection2
   [junit4]   2> 101632 INFO  (TEST-LeaderElectionContextKeyTest.test-seed#[57D64213D9525745]) [    ] o.a.s.SolrTestCaseJ4 ###Starting test
   [junit4]   2> 101638 INFO  (qtp17524196-597) [n:127.0.0.1:40409_solr    ] o.a.s.m.SolrMetricManager Closing metric reporters for registry=solr.core.testCollection1.shard2.replica_n2, tag=null
   [junit4]   2> 101638 INFO  (qtp17524196-597) [n:127.0.0.1:40409_solr    ] o.a.s.m.r.SolrJmxReporter Closing reporter [org.apache.solr.metrics.reporters.SolrJmxReporter@1608f7b: rootName = solr_40409, domain = solr.core.testCollection1.shard2.replica_n2, service url = null, agent id = null] for registry solr.core.testCollection1.shard2.replica_n2 / com.codahale.metrics.MetricRegistry@b361c1
   [junit4]   2> 101655 INFO  (qtp17524196-597) [n:127.0.0.1:40409_solr    ] o.a.s.c.SolrCore [testCollection1_shard2_replica_n2]  CLOSING SolrCore org.apache.solr.core.SolrCore@121d899
   [junit4]   2> 101655 INFO  (qtp17524196-597) [n:127.0.0.1:40409_solr    ] o.a.s.m.SolrMetricManager Closing metric reporters for registry=solr.core.testCollection1.shard2.replica_n2, tag=18995353
   [junit4]   2> 101655 INFO  (qtp17524196-597) [n:127.0.0.1:40409_solr    ] o.a.s.m.SolrMetricManager Closing metric reporters for registry=solr.collection.testCollection1.shard2.leader, tag=18995353
   [junit4]   2> 101661 INFO  (qtp17524196-597) [n:127.0.0.1:40409_solr    ] o.a.s.s.HttpSolrCall [admin] webapp=null path=/admin/cores params={deleteInstanceDir=false&core=testCollection1_shard2_replica_n2&deleteDataDir=false&action=UNLOAD&indexInfo=true&wt=javabin&version=2&deleteIndex=false} status=0 QTime=23
   [junit4]   2> 101662 INFO  (TEST-LeaderElectionContextKeyTest.test-seed#[57D64213D9525745]) [    ] o.a.s.SolrTestCaseJ4 ###Ending test
   [junit4]   2> NOTE: reproduce with: ant test  -Dtestcase=LeaderElectionContextKeyTest -Dtests.method=test -Dtests.seed=57D64213D9525745 -Dtests.multiplier=3 -Dtests.slow=true -Dtests.locale=de-DE -Dtests.timezone=Asia/Kuching -Dtests.asserts=true -Dtests.file.encoding=US-ASCII
   [junit4] FAILURE 0.04s J1 | LeaderElectionContextKeyTest.test <<<
   [junit4]    > Throwable #1: java.lang.AssertionError
   [junit4]    > 	at __randomizedtesting.SeedInfo.seed([57D64213D9525745:DF827DC977AE3ABD]:0)
   [junit4]    > 	at org.apache.solr.cloud.LeaderElectionContextKeyTest.test(LeaderElectionContextKeyTest.java:88)
   [junit4]    > 	at java.lang.Thread.run(Thread.java:748)
   [junit4]   2> 101666 INFO  (jetty-closer-107-thread-1) [    ] o.e.j.s.AbstractConnector Stopped ServerConnector@1f3e820{HTTP/1.1,[http/1.1]}{127.0.0.1:0}
   [junit4]   2> 101666 INFO  (jetty-closer-107-thread-1) [    ] o.a.s.c.CoreContainer Shutting down CoreContainer instance=30320532
   [junit4]   2> 101669 INFO  (jetty-closer-107-thread-1) [    ] o.a.s.m.SolrMetricManager Closing metric reporters for registry=solr.node, tag=null
   [junit4]   2> 101669 INFO  (jetty-closer-107-thread-1) [    ] o.a.s.m.r.SolrJmxReporter Closing reporter [org.apache.solr.metrics.reporters.SolrJmxReporter@1f4a5af: rootName = solr_40409, domain = solr.node, service url = null, agent id = null] for registry solr.node / com.codahale.metrics.MetricRegistry@1338aac
   [junit4]   2> 101675 INFO  (jetty-closer-107-thread-1) [    ] o.a.s.m.SolrMetricManager Closing metric reporters for registry=solr.jvm, tag=null
   [junit4]   2> 101676 INFO  (jetty-closer-107-thread-1) [    ] o.a.s.m.r.SolrJmxReporter Closing reporter [org.apache.solr.metrics.reporters.SolrJmxReporter@756496: rootName = solr_40409, domain = solr.jvm, service url = null, agent id = null] for registry solr.jvm / com.codahale.metrics.MetricRegistry@12e9df6
   [junit4]   2> 101683 INFO  (jetty-closer-107-thread-1) [    ] o.a.s.m.SolrMetricManager Closing metric reporters for registry=solr.jetty, tag=null
   [junit4]   2> 101683 INFO  (jetty-closer-107-thread-1) [    ] o.a.s.m.r.SolrJmxReporter Closing reporter [org.apache.solr.metrics.reporters.SolrJmxReporter@12ab69a: rootName = solr_40409, domain = solr.jetty, service url = null, agent id = null] for registry solr.jetty / com.codahale.metrics.MetricRegistry@14eaf1
   [junit4]   2> 101684 INFO  (jetty-closer-107-thread-1) [    ] o.a.s.m.SolrMetricManager Closing metric reporters for registry=solr.cluster, tag=null
   [junit4]   2> 101685 INFO  (coreCloseExecutor-193-thread-1) [n:127.0.0.1:40409_solr c:testCollection1 s:shard1 r:core_node3 x:testCollection1_shard1_replica_n1] o.a.s.c.SolrCore [testCollection1_shard1_replica_n1]  CLOSING SolrCore org.apache.solr.core.SolrCore@af5280
   [junit4]   2> 101685 INFO  (coreCloseExecutor-193-thread-1) [n:127.0.0.1:40409_solr c:testCollection1 s:shard1 r:core_node3 x:testCollection1_shard1_replica_n1] o.a.s.m.SolrMetricManager Closing metric reporters for registry=solr.core.testCollection1.shard1.replica_n1, tag=11489920
   [junit4]   2> 101685 INFO  (coreCloseExecutor-193-thread-1) [n:127.0.0.1:40409_solr c:testCollection1 s:shard1 r:core_node3 x:testCollection1_shard1_replica_n1] o.a.s.m.r.SolrJmxReporter Closing reporter [org.apache.solr.metrics.reporters.SolrJmxReporter@187fbdd: rootName = solr_40409, domain = solr.core.testCollection1.shard1.replica_n1, service url = null, agent id = null] for registry solr.core.testCollection1.shard1.replica_n1 / com.codahale.metrics.MetricRegistry@1abea8a
   [junit4]   2> 101685 INFO  (coreCloseExecutor-193-thread-2) [n:127.0.0.1:40409_solr c:testCollection2 s:shard1 r:core_node2 x:testCollection2_shard1_replica_n1] o.a.s.c.SolrCore [testCollection2_shard1_replica_n1]  CLOSING SolrCore org.apache.solr.core.SolrCore@1334665
   [junit4]   2> 101685 INFO  (coreCloseExecutor-193-thread-3) [n:127.0.0.1:40409_solr c:testCollection2 s:shard2 r:core_node4 x:testCollection2_shard2_replica_n3] o.a.s.c.SolrCore [testCollection2_shard2_replica_n3]  CLOSING SolrCore org.apache.solr.core.SolrCore@ee5503
   [junit4]   2> 101693 INFO  (coreCloseExecutor-193-thread-2) [n:127.0.0.1:40409_solr c:testCollection2 s:shard1 r:core_node2 x:testCollection2_shard1_replica_n1] o.a.s.m.SolrMetricManager Closing metric reporters for registry=solr.core.testCollection2.shard1.replica_n1, tag=20137573
   [junit4]   2> 101694 INFO  (coreCloseExecutor-193-thread-2) [n:127.0.0.1:40409_solr c:testCollection2 s:shard1 r:core_node2 x:testCollection2_shard1_replica_n1] o.a.s.m.r.SolrJmxReporter Closing reporter [org.apache.solr.metrics.reporters.SolrJmxReporter@159f05: rootName = solr_40409, domain = solr.core.testCollection2.shard1.replica_n1, service url = null, agent id = null] for registry solr.core.testCollection2.shard1.replica_n1 / com.codahale.metrics.MetricRegistry@1899158
   [junit4]   2> 101702 INFO  (coreCloseExecutor-193-thread-3) [n:127.0.0.1:40409_solr c:testCollection2 s:shard2 r:core_node4 x:testCollection2_shard2_replica_n3] o.a.s.m.SolrMetricManager Closing metric reporters for registry=solr.core.testCollection2.shard2.replica_n3, tag=15619331
   [junit4]   2> 101702 INFO  (coreCloseExecutor-193-thread-3) [n:127.0.0.1:40409_solr c:testCollection2 s:shard2 r:core_node4 x:testCollection2_shard2_replica_n3] o.a.s.m.r.SolrJmxReporter Closing reporter [org.apache.solr.metrics.reporters.SolrJmxReporter@162219a: rootName = solr_40409, domain = solr.core.testCollection2.shard2.replica_n3, service url = null, agent id = null] for registry solr.core.testCollection2.shard2.replica_n3 / com.codahale.metrics.MetricRegistry@a01f27
   [junit4]   2> 101710 INFO  (coreCloseExecutor-193-thread-1) [n:127.0.0.1:40409_solr c:testCollection1 s:shard1 r:core_node3 x:testCollection1_shard1_replica_n1] o.a.s.m.SolrMetricManager Closing metric reporters for registry=solr.collection.testCollection1.shard1.leader, tag=11489920
   [junit4]   2> 101711 INFO  (coreCloseExecutor-193-thread-2) [n:127.0.0.1:40409_solr c:testCollection2 s:shard1 r:core_node2 x:testCollection2_shard1_replica_n1] o.a.s.m.SolrMetricManager Closing metric reporters for registry=solr.collection.testCollection2.shard1.leader, tag=20137573
   [junit4]   2> 101715 INFO  (coreCloseExecutor-193-thread-3) [n:127.0.0.1:40409_solr c:testCollection2 s:shard2 r:core_node4 x:testCollection2_shard2_replica_n3] o.a.s.m.SolrMetricManager Closing metric reporters for registry=solr.collection.testCollection2.shard2.leader, tag=15619331
   [junit4]   2> 101722 INFO  (jetty-closer-107-thread-1) [    ] o.a.s.c.Overseer Overseer (id=98768367395340291-127.0.0.1:40409_solr-n_0000000000) closing
   [junit4]   2> 101722 INFO  (OverseerStateUpdate-98768367395340291-127.0.0.1:40409_solr-n_0000000000) [n:127.0.0.1:40409_solr    ] o.a.s.c.Overseer Overseer Loop exiting : 127.0.0.1:40409_solr
   [junit4]   2> 101723 INFO  (jetty-closer-107-thread-1) [    ] o.e.j.s.h.ContextHandler Stopped o.e.j.s.ServletContextHandler@b2f101{/solr,null,UNAVAILABLE}
   [junit4]   2> 101725 ERROR (SUITE-LeaderElectionContextKeyTest-seed#[57D64213D9525745]-worker) [    ] o.a.z.s.ZooKeeperServer ZKShutdownHandler is not registered, so ZooKeeper server won't take any action on ERROR or SHUTDOWN server state changes
   [junit4]   2> 101726 INFO  (SUITE-LeaderElectionContextKeyTest-seed#[57D64213D9525745]-worker) [    ] o.a.s.c.ZkTestServer connecting to 127.0.0.1:40943 40943
   [junit4]   2> 106637 INFO  (Thread-121) [    ] o.a.s.c.ZkTestServer connecting to 127.0.0.1:40943 40943
   [junit4]   2> 106637 WARN  (Thread-121) [    ] o.a.s.c.ZkTestServer Watch limit violations: 
   [junit4]   2> Maximum concurrent create/delete watches above limit:
   [junit4]   2> 
   [junit4]   2> 	2	/solr/aliases.json
   [junit4]   2> 	2	/solr/clusterprops.json
   [junit4]   2> 
   [junit4]   2> Maximum concurrent data watches above limit:
   [junit4]   2> 
   [junit4]   2> 	5	/solr/collections/testCollection2/state.json
   [junit4]   2> 	2	/solr/clusterstate.json
   [junit4]   2> 
   [junit4]   2> Maximum concurrent children watches above limit:
   [junit4]   2> 
   [junit4]   2> 	2	/solr/live_nodes
   [junit4]   2> 	2	/solr/collections
   [junit4]   2> 
   [junit4]   2> NOTE: leaving temporary files on disk at: /home/jenkins/workspace/Lucene-Solr-7.x-Linux/solr/build/solr-core/test/J1/temp/solr.cloud.LeaderElectionContextKeyTest_57D64213D9525745-001
   [junit4]   2> NOTE: test params are: codec=Asserting(Lucene70): {}, docValues:{}, maxPointsInLeafNode=1650, maxMBSortInHeap=5.695890243274297, sim=RandomSimilarity(queryNorm=false): {}, locale=de-DE, timezone=Asia/Kuching
   [junit4]   2> NOTE: Linux 4.10.0-33-generic i386/Oracle Corporation 1.8.0_144 (32-bit)/cpus=8,threads=1,free=146935600,total=289406976
   [junit4]   2> NOTE: All tests run in this JVM: [DistribJoinFromCollectionTest, DirectoryFactoryTest, TestPivotHelperCode, TestSolrCloudWithSecureImpersonation, TestZkAclsWithHadoopAuth, DeleteStatusTest, HdfsTlogReplayBufferedWhileIndexingTest, OverseerTaskQueueTest, TestBM25SimilarityFactory, LeaderElectionContextKeyTest]
   [junit4] Completed [26/734 (1!)] on J1 in 10.90s, 1 test, 1 failure <<< FAILURES!

[...truncated 1657 lines...]
   [junit4] Suite: org.apache.solr.cloud.ReplaceNodeTest
   [junit4]   2> Creating dataDir: /home/jenkins/workspace/Lucene-Solr-7.x-Linux/solr/build/solr-core/test/J0/temp/solr.cloud.ReplaceNodeTest_57D64213D9525745-001/init-core-data-001
   [junit4]   2> 2430950 WARN  (SUITE-ReplaceNodeTest-seed#[57D64213D9525745]-worker) [    ] o.a.s.SolrTestCaseJ4 startTrackingSearchers: numOpens=2 numCloses=2
   [junit4]   2> 2430951 INFO  (SUITE-ReplaceNodeTest-seed#[57D64213D9525745]-worker) [    ] o.a.s.SolrTestCaseJ4 Using TrieFields (NUMERIC_POINTS_SYSPROP=false) w/NUMERIC_DOCVALUES_SYSPROP=false
   [junit4]   2> 2430952 INFO  (SUITE-ReplaceNodeTest-seed#[57D64213D9525745]-worker) [    ] o.a.s.SolrTestCaseJ4 Randomized ssl (true) and clientAuth (true) via: @org.apache.solr.util.RandomizeSSL(reason=, ssl=NaN, value=NaN, clientAuth=NaN)
   [junit4]   2> 2430954 INFO  (SUITE-ReplaceNodeTest-seed#[57D64213D9525745]-worker) [    ] o.a.s.SolrTestCaseJ4 SecureRandom sanity checks: test.solr.allowed.securerandom=null & java.security.egd=file:/dev/./urandom
   [junit4]   2> 2430955 INFO  (SUITE-ReplaceNodeTest-seed#[57D64213D9525745]-worker) [    ] o.a.s.c.MiniSolrCloudCluster Starting cluster of 6 servers in /home/jenkins/workspace/Lucene-Solr-7.x-Linux/solr/build/solr-core/test/J0/temp/solr.cloud.ReplaceNodeTest_57D64213D9525745-001/tempDir-001
   [junit4]   2> 2430955 INFO  (SUITE-ReplaceNodeTest-seed#[57D64213D9525745]-worker) [    ] o.a.s.c.ZkTestServer STARTING ZK TEST SERVER
   [junit4]   2> 2430955 INFO  (Thread-1999) [    ] o.a.s.c.ZkTestServer client port:0.0.0.0/0.0.0.0:0
   [junit4]   2> 2430955 INFO  (Thread-1999) [    ] o.a.s.c.ZkTestServer Starting server
   [junit4]   2> 2430958 ERROR (Thread-1999) [    ] o.a.z.s.ZooKeeperServer ZKShutdownHandler is not registered, so ZooKeeper server won't take any action on ERROR or SHUTDOWN server state changes
   [junit4]   2> 2431055 INFO  (SUITE-ReplaceNodeTest-seed#[57D64213D9525745]-worker) [    ] o.a.s.c.ZkTestServer start zk server on port:41067
   [junit4]   2> 2431064 INFO  (jetty-launcher-1400-thread-1) [    ] o.e.j.s.Server jetty-9.3.20.v20170531
   [junit4]   2> 2431064 INFO  (jetty-launcher-1400-thread-3) [    ] o.e.j.s.Server jetty-9.3.20.v20170531
   [junit4]   2> 2431068 INFO  (jetty-launcher-1400-thread-4) [    ] o.e.j.s.Server jetty-9.3.20.v20170531
   [junit4]   2> 2431068 INFO  (jetty-launcher-1400-thread-5) [    ] o.e.j.s.Server jetty-9.3.20.v20170531
   [junit4]   2> 2431068 INFO  (jetty-launcher-1400-thread-6) [    ] o.e.j.s.Server jetty-9.3.20.v20170531
   [junit4]   2> 2431069 INFO  (jetty-launcher-1400-thread-2) [    ] o.e.j.s.Server jetty-9.3.20.v20170531
   [junit4]   2> 2431070 INFO  (jetty-launcher-1400-thread-3) [    ] o.e.j.s.h.ContextHandler Started o.e.j.s.ServletContextHandler@19ce233{/solr,null,AVAILABLE}
   [junit4]   2> 2431075 INFO  (jetty-launcher-1400-thread-3) [    ] o.e.j.s.AbstractConnector Started ServerConnector@36e6f8{SSL,[ssl, http/1.1]}{127.0.0.1:42221}
   [junit4]   2> 2431075 INFO  (jetty-launcher-1400-thread-3) [    ] o.e.j.s.Server Started @2432553ms
   [junit4]   2> 2431075 INFO  (jetty-launcher-1400-thread-3) [    ] o.a.s.c.s.e.JettySolrRunner Jetty properties: {hostContext=/solr, hostPort=42221}
   [junit4]   2> 2431076 ERROR (jetty-launcher-1400-thread-3) [    ] o.a.s.u.StartupLoggingUtils Missing Java Option solr.log.dir. Logging may be missing or incomplete.
   [junit4]   2> 2431076 INFO  (jetty-launcher-1400-thread-3) [    ] o.a.s.s.SolrDispatchFilter  ___      _       Welcome to Apache Solr? version 7.1.0
   [junit4]   2> 2431076 INFO  (jetty-launcher-1400-thread-3) [    ] o.a.s.s.SolrDispatchFilter / __| ___| |_ _   Starting in cloud mode on port null
   [junit4]   2> 2431076 INFO  (jetty-launcher-1400-thread-3) [    ] o.a.s.s.SolrDispatchFilter \__ \/ _ \ | '_|  Install dir: null, Default config dir: null
   [junit4]   2> 2431076 INFO  (jetty-launcher-1400-thread-3) [    ] o.a.s.s.SolrDispatchFilter |___/\___/_|_|    Start time: 2017-10-04T03:33:39.478Z
   [junit4]   2> 2431087 INFO  (jetty-launcher-1400-thread-1) [    ] o.e.j.s.h.ContextHandler Started o.e.j.s.ServletContextHandler@4fd188{/solr,null,AVAILABLE}
   [junit4]   2> 2431088 INFO  (jetty-launcher-1400-thread-5) [    ] o.e.j.s.h.ContextHandler Started o.e.j.s.ServletContextHandler@162dc54{/solr,null,AVAILABLE}
   [junit4]   2> 2431088 INFO  (jetty-launcher-1400-thread-3) [    ] o.a.s.s.SolrDispatchFilter solr.xml found in ZooKeeper. Loading...
   [junit4]   2> 2431089 INFO  (jetty-launcher-1400-thread-5) [    ] o.e.j.s.AbstractConnector Started ServerConnector@1d4e072{SSL,[ssl, http/1.1]}{127.0.0.1:34639}
   [junit4]   2> 2431089 INFO  (jetty-launcher-1400-thread-5) [    ] o.e.j.s.Server Started @2432566ms
   [junit4]   2> 2431089 INFO  (jetty-launcher-1400-thread-5) [    ] o.a.s.c.s.e.JettySolrRunner Jetty properties: {hostContext=/solr, hostPort=34639}
   [junit4]   2> 2431089 ERROR (jetty-launcher-1400-thread-5) [    ] o.a.s.u.StartupLoggingUtils Missing Java Option solr.log.dir. Logging may be missing or incomplete.
   [junit4]   2> 2431089 INFO  (jetty-launcher-1400-thread-5) [    ] o.a.s.s.SolrDispatchFilter  ___      _       Welcome to Apache Solr? version 7.1.0
   [junit4]   2> 2431089 INFO  (jetty-launcher-1400-thread-5) [    ] o.a.s.s.SolrDispatchFilter / __| ___| |_ _   Starting in cloud mode on port null
   [junit4]   2> 2431089 INFO  (jetty-launcher-1400-thread-5) [    ] o.a.s.s.SolrDispatchFilter \__ \/ _ \ | '_|  Install dir: null, Default config dir: null
   [junit4]   2> 2431090 INFO  (jetty-launcher-1400-thread-5) [    ] o.a.s.s.SolrDispatchFilter |___/\___/_|_|    Start time: 2017-10-04T03:33:39.491Z
   [junit4]   2> 2431092 INFO  (jetty-launcher-1400-thread-1) [    ] o.e.j.s.AbstractConnector Started ServerConnector@c23e0c{SSL,[ssl, http/1.1]}{127.0.0.1:39501}
   [junit4]   2> 2431092 INFO  (jetty-launcher-1400-thread-1) [    ] o.e.j.s.Server Started @2432570ms
   [junit4]   2> 2431092 INFO  (jetty-launcher-1400-thread-1) [    ] o.a.s.c.s.e.JettySolrRunner Jetty properties: {hostContext=/solr, hostPort=39501}
   [junit4]   2> 2431093 ERROR (jetty-launcher-1400-thread-1) [    ] o.a.s.u.StartupLoggingUtils Missing Java Option solr.log.dir. Logging may be missing or incomplete.
   [junit4]   2> 2431093 INFO  (jetty-launcher-1400-thread-1) [    ] o.a.s.s.SolrDispatchFilter  ___      _       Welcome to Apache Solr? version 7.1.0
   [junit4]   2> 2431093 INFO  (jetty-launcher-1400-thread-1) [    ] o.a.s.s.SolrDispatchFilter / __| ___| |_ _   Starting in cloud mode on port null
   [junit4]   2> 2431093 INFO  (jetty-launcher-1400-thread-1) [    ] o.a.s.s.SolrDispatchFilter \__ \/ _ \ | '_|  Install dir: null, Default config dir: null
   [junit4]   2> 2431093 INFO  (jetty-launcher-1400-thread-1) [    ] o.a.s.s.SolrDispatchFilter |___/\___/_|_|    Start time: 2017-10-04T03:33:39.495Z
   [junit4]   2> 2431095 INFO  (jetty-launcher-1400-thread-4) [    ] o.e.j.s.h.ContextHandler Started o.e.j.s.ServletContextHandler@1e854df{/solr,null,AVAILABLE}
   [junit4]   2> 2431100 INFO  (jetty-launcher-1400-thread-2) [    ] o.e.j.s.h.ContextHandler Started o.e.j.s.ServletContextHandler@1a3f057{/solr,null,AVAILABLE}
   [junit4]   2> 2431100 INFO  (jetty-launcher-1400-thread-6) [    ] o.e.j.s.h.ContextHandler Started o.e.j.s.ServletContextHandler@1521c3f{/solr,null,AVAILABLE}
   [junit4]   2> 2431100 INFO  (jetty-launcher-1400-thread-2) [    ] o.e.j.s.AbstractConnector Started ServerConnector@a91a5e{SSL,[ssl, http/1.1]}{127.0.0.1:39713}
   [junit4]   2> 2431100 INFO  (jetty-launcher-1400-thread-6) [    ] o.e.j.s.AbstractConnector Started ServerConnector@435f61{SSL,[ssl, http/1.1]}{127.0.0.1:35765}
   [junit4]   2> 2431100 INFO  (jetty-launcher-1400-thread-2) [    ] o.e.j.s.Server Started @2432578ms
   [junit4]   2> 2431100 INFO  (jetty-launcher-1400-thread-6) [    ] o.e.j.s.Server Started @2432578ms
   [junit4]   2> 2431100 INFO  (jetty-launcher-1400-thread-2) [    ] o.a.s.c.s.e.JettySolrRunner Jetty properties: {hostContext=/solr, hostPort=39713}
   [junit4]   2> 2431100 INFO  (jetty-launcher-1400-thread-6) [    ] o.a.s.c.s.e.JettySolrRunner Jetty properties: {hostContext=/solr, hostPort=35765}
   [junit4]   2> 2431101 ERROR (jetty-launcher-1400-thread-6) [    ] o.a.s.u.StartupLoggingUtils Missing Java Option solr.log.dir. Logging may be missing or incomplete.
   [junit4]   2> 2431101 INFO  (jetty-launcher-1400-thread-6) [    ] o.a.s.s.SolrDispatchFilter  ___      _       Welcome to Apache Solr? version 7.1.0
   [junit4]   2> 2431101 INFO  (jetty-launcher-1400-thread-6) [    ] o.a.s.s.SolrDispatchFilter / __| ___| |_ _   Starting in cloud mode on port null
   [junit4]   2> 2431101 INFO  (jetty-launcher-1400-thread-6) [    ] o.a.s.s.SolrDispatchFilter \__ \/ _ \ | '_|  Install dir: null, Default config dir: null
   [junit4]   2> 2431101 INFO  (jetty-launcher-1400-thread-6) [    ] o.a.s.s.SolrDispatchFilter |___/\___/_|_|    Start time: 2017-10-04T03:33:39.503Z
   [junit4]   2> 2431101 ERROR (jetty-launcher-1400-thread-2) [    ] o.a.s.u.StartupLoggingUtils Missing Java Option solr.log.dir. Logging may be missing or incomplete.
   [junit4]   2> 2431101 INFO  (jetty-launcher-1400-thread-2) [    ] o.a.s.s.SolrDispatchFilter  ___      _       Welcome to Apache Solr? version 7.1.0
   [junit4]   2> 2431101 INFO  (jetty-launcher-1400-thread-2) [    ] o.a.s.s.SolrDispatchFilter / __| ___| |_ _   Starting in cloud mode on port null
   [junit4]   2> 2431101 INFO  (jetty-launcher-1400-thread-2) [    ] o.a.s.s.SolrDispatchFilter \__ \/ _ \ | '_|  Install dir: null, Default config dir: null
   [junit4]   2> 2431102 INFO  (jetty-launcher-1400-thread-2) [    ] o.a.s.s.SolrDispatchFilter |___/\___/_|_|    Start time: 2017-10-04T03:33:39.503Z
   [junit4]   2> 2431104 INFO  (jetty-launcher-1400-thread-6) [    ] o.a.s.s.SolrDispatchFilter solr.xml found in ZooKeeper. Loading...
   [junit4]   2> 2431106 INFO  (jetty-launcher-1400-thread-3) [    ] o.a.s.c.ZkContainer Zookeeper client=127.0.0.1:41067/solr
   [junit4]   2> 2431107 INFO  (jetty-launcher-1400-thread-4) [    ] o.e.j.s.AbstractConnector Started ServerConnector@1899923{SSL,[ssl, http/1.1]}{127.0.0.1:37961}
   [junit4]   2> 2431111 INFO  (jetty-launcher-1400-thread-4) [    ] o.e.j.s.Server Started @2432588ms
   [junit4]   2> 2431111 INFO  (jetty-launcher-1400-thread-4) [    ] o.a.s.c.s.e.JettySolrRunner Jetty properties: {hostContext=/solr, hostPort=37961}
   [junit4]   2> 2431111 ERROR (jetty-launcher-1400-thread-4) [    ] o.a.s.u.StartupLoggingUtils Missing Java Option solr.log.dir. Logging may be missing or incomplete.
   [junit4]   2> 2431111 INFO  (jetty-launcher-1400-thread-4) [    ] o.a.s.s.SolrDispatchFilter  ___      _       Welcome to Apache Solr? version 7.1.0
   [junit4]   2> 2431111 INFO  (jetty-launcher-1400-thread-4) [    ] o.a.s.s.SolrDispatchFilter / __| ___| |_ _   Starting in cloud mode on port null
   [junit4]   2> 2431111 INFO  (jetty-launcher-1400-thread-4) [    ] o.a.s.s.SolrDispatchFilter \__ \/ _ \ | '_|  Install dir: null, Default config dir: null
   [junit4]   2> 2431111 INFO  (jetty-launcher-1400-thread-4) [    ] o.a.s.s.SolrDispatchFilter |___/\___/_|_|    Start time: 2017-10-04T03:33:39.513Z
   [junit4]   2> 2431114 INFO  (jetty-launcher-1400-thread-1) [    ] o.a.s.s.SolrDispatchFilter solr.xml found in ZooKeeper. Loading...
   [junit4]   2> 2431114 INFO  (jetty-launcher-1400-thread-2) [    ] o.a.s.s.SolrDispatchFilter solr.xml found in ZooKeeper. Loading...
   [junit4]   2> 2431121 INFO  (jetty-launcher-1400-thread-5) [    ] o.a.s.s.SolrDispatchFilter solr.xml found in ZooKeeper. Loading...
   [junit4]   2> 2431121 INFO  (jetty-launcher-1400-thread-4) [    ] o.a.s.s.SolrDispatchFilter solr.xml found in ZooKeeper. Loading...
   [junit4]   2> 2431158 WARN  (NIOServerCxn.Factory:0.0.0.0/0.0.0.0:0) [    ] o.a.z.s.NIOServerCnxn caught end of stream exception
   [junit4]   2> EndOfStreamException: Unable to read additional data from client sessionid 0x15ee5722f9e0007, likely client has closed socket
   [junit4]   2> 	at org.apache.zookeeper.server.NIOServerCnxn.doIO(NIOServerCnxn.java:239)
   [junit4]   2> 	at org.apache.zookeeper.server.NIOServerCnxnFactory.run(NIOServerCnxnFactory.java:203)
   [junit4]   2> 	at java.lang.Thread.run(Thread.java:748)
   [junit4]   2> 2431160 INFO  (jetty-launcher-1400-thread-1) [    ] o.a.s.c.ZkContainer Zookeeper client=127.0.0.1:41067/solr
   [junit4]   2> 2431161 INFO  (jetty-launcher-1400-thread-6) [    ] o.a.s.c.ZkContainer Zookeeper client=127.0.0.1:41067/solr
   [junit4]   2> 2431161 INFO  (jetty-launcher-1400-thread-2) [    ] o.a.s.c.ZkContainer Zookeeper client=127.0.0.1:41067/solr
   [junit4]   2> 2431189 INFO  (jetty-launcher-1400-thread-5) [    ] o.a.s.c.ZkContainer Zookeeper client=127.0.0.1:41067/solr
   [junit4]   2> 2431194 INFO  (jetty-launcher-1400-thread-4) [    ] o.a.s.c.ZkContainer Zookeeper client=127.0.0.1:41067/solr
   [junit4]   2> 2431197 WARN  (NIOServerCxn.Factory:0.0.0.0/0.0.0.0:0) [    ] o.a.z.s.NIOServerCnxn caught end of stream exception
   [junit4]   2> EndOfStreamException: Unable to read additional data from client sessionid 0x15ee5722f9e000c, likely client has closed socket
   [junit4]   2> 	at org.apache.zookeeper.server.NIOServerCnxn.doIO(NIOServerCnxn.java:239)
   [junit4]   2> 	at org.apache.zookeeper.server.NIOServerCnxnFactory.run(NIOServerCnxnFactory.java:203)
   [junit4]   2> 	at java.lang.Thread.run(Thread.java:748)
   [junit4]   2> 2431201 WARN  (NIOServerCxn.Factory:0.0.0.0/0.0.0.0:0) [    ] o.a.z.s.NIOServerCnxn caught end of stream exception
   [junit4]   2> EndOfStreamException: Unable to read additional data from client sessionid 0x15ee5722f9e000e, likely client has closed socket
   [junit4]   2> 	at org.apache.zookeeper.server.NIOServerCnxn.doIO(NIOServerCnxn.java:239)
   [junit4]   2> 	at org.apache.zookeeper.server.NIOServerCnxnFactory.run(NIOServerCnxnFactory.java:203)
   [junit4]   2> 	at java.lang.Thread.run(Thread.java:748)
   [junit4]   2> 2431216 INFO  (jetty-launcher-1400-thread-3) [n:127.0.0.1:42221_solr    ] o.a.s.c.Overseer Overseer (id=null) closing
   [junit4]   2> 2431216 INFO  (jetty-launcher-1400-thread-3) [n:127.0.0.1:42221_solr    ] o.a.s.c.OverseerElectionContext I am going to be the leader 127.0.0.1:42221_solr
   [junit4]   2> 2431218 INFO  (jetty-launcher-1400-thread-3) [n:127.0.0.1:42221_solr    ] o.a.s.c.Overseer Overseer (id=98768520436645896-127.0.0.1:42221_solr-n_0000000000) starting
   [junit4]   2> 2431219 INFO  (jetty-launcher-1400-thread-1) [n:127.0.0.1:39501_solr    ] o.a.s.c.Overseer Overseer (id=null) closing
   [junit4]   2> 2431219 INFO  (jetty-launcher-1400-thread-4) [n:127.0.0.1:37961_solr    ] o.a.s.c.Overseer Overseer (id=null) closing
   [junit4]   2> 2431221 INFO  (jetty-launcher-1400-thread-1) [n:127.0.0.1:39501_solr    ] o.a.s.c.ZkController Register node as live in ZooKeeper:/live_nodes/127.0.0.1:39501_solr
   [junit4]   2> 2431221 INFO  (jetty-launcher-1400-thread-4) [n:127.0.0.1:37961_solr    ] o.a.s.c.ZkController Register node as live in ZooKeeper:/live_nodes/127.0.0.1:37961_solr
   [junit4]   2> 2431221 INFO  (jetty-launcher-1400-thread-2) [n:127.0.0.1:39713_solr    ] o.a.s.c.Overseer Overseer (id=null) closing
   [junit4]   2> 2431223 INFO  (zkCallback-1431-thread-1-processing-n:127.0.0.1:34639_solr) [n:127.0.0.1:34639_solr    ] o.a.s.c.c.ZkStateReader Updated live nodes from ZooKeeper... (0) -> (2)
   [junit4]   2> 2431223 INFO  (zkCallback-1430-thread-1-processing-n:127.0.0.1:39501_solr) [n:127.0.0.1:39501_solr    ] o.a.s.c.c.ZkStateReader Updated live nodes from ZooKeeper... (0) -> (2)
   [junit4]   2> 2431224 INFO  (zkCallback-1412-thread-1-processing-n:127.0.0.1:42221_solr) [n:127.0.0.1:42221_solr    ] o.a.s.c.c.ZkStateReader Updated live nodes from ZooKeeper... (0) -> (2)
   [junit4]   2> 2431229 INFO  (zkCallback-1434-thread-1-processing-n:127.0.0.1:39713_solr) [n:127.0.0.1:39713_solr    ] o.a.s.c.c.ZkStateReader Updated live nodes from ZooKeeper... (0) -> (2)
   [junit4]   2> 2431229 INFO  (zkCallback-1432-thread-1-processing-n:127.0.0.1:37961_solr) [n:127.0.0.1:37961_solr    ] o.a.s.c.c.ZkStateReader Updated live nodes from ZooKeeper... (0) -> (2)
   [junit4]   2> 2431229 INFO  (jetty-launcher-1400-thread-5) [n:127.0.0.1:34639_solr    ] o.a.s.c.Overseer Overseer (id=null) closing
   [junit4]   2> 2431242 INFO  (jetty-launcher-1400-thread-2) [n:127.0.0.1:39713_solr    ] o.a.s.c.ZkController Register node as live in ZooKeeper:/live_nodes/127.0.0.1:39713_solr
   [junit4]   2> 2431244 INFO  (zkCallback-1430-thread-1-processing-n:127.0.0.1:39501_solr) [n:127.0.0.1:39501_solr    ] o.a.s.c.c.ZkStateReader Updated live nodes from ZooKeeper... (2) -> (3)
   [junit4]   2> 2431244 INFO  (zkCallback-1412-thread-1-processing-n:127.0.0.1:42221_solr) [n:127.0.0.1:42221_solr    ] o.a.s.c.c.ZkStateReader Updated live nodes from ZooKeeper... (2) -> (3)
   [junit4]   2> 2431246 INFO  (zkCallback-1432-thread-1-processing-n:127.0.0.1:37961_solr) [n:127.0.0.1:37961_solr    ] o.a.s.c.c.ZkStateReader Updated live nodes from ZooKeeper... (2) -> (3)
   [junit4]   2> 2431255 INFO  (zkCallback-1431-thread-1-processing-n:127.0.0.1:34639_solr) [n:127.0.0.1:34639_solr    ] o.a.s.c.c.ZkStateReader Updated live nodes from ZooKeeper... (2) -> (3)
   [junit4]   2> 2431255 INFO  (jetty-launcher-1400-thread-5) [n:127.0.0.1:34639_solr    ] o.a.s.c.ZkController Register node as live in ZooKeeper:/live_nodes/127.0.0.1:34639_solr
   [junit4]   2> 2431256 INFO  (zkCallback-1434-thread-1-processing-n:127.0.0.1:39713_solr) [n:127.0.0.1:39713_solr    ] o.a.s.c.c.ZkStateReader Updated live nodes from ZooKeeper... (2) -> (3)
   [junit4]   2> 2431257 INFO  (zkCallback-1430-thread-1-processing-n:127.0.0.1:39501_solr) [n:127.0.0.1:39501_solr    ] o.a.s.c.c.ZkStateReader Updated live nodes from ZooKeeper... (3) -> (4)
   [junit4]   2> 2431257 INFO  (zkCallback-1412-thread-1-processing-n:127.0.0.1:42221_solr) [n:127.0.0.1:42221_solr    ] o.a.s.c.c.ZkStateReader Updated live nodes from ZooKeeper... (3) -> (4)
   [junit4]   2> 2431257 INFO  (zkCallback-1432-thread-1-processing-n:127.0.0.1:37961_solr) [n:127.0.0.1:37961_solr    ] o.a.s.c.c.ZkStateReader Updated live nodes from ZooKeeper... (3) -> (4)
   [junit4]   2> 2431257 INFO  (zkCallback-1434-thread-1-processing-n:127.0.0.1:39713_solr) [n:127.0.0.1:39713_solr    ] o.a.s.c.c.ZkStateReader Updated live nodes from ZooKeeper... (3) -> (4)
   [junit4]   2> 2431257 INFO  (zkCallback-1431-thread-1-processing-n:127.0.0.1:34639_solr) [n:127.0.0.1:34639_solr    ] o.a.s.c.c.ZkStateReader Updated live nodes from ZooKeeper... (3) -> (4)
   [junit4]   2> 2431278 INFO  (jetty-launcher-1400-thread-6) [n:127.0.0.1:35765_solr    ] o.a.s.c.c.ZkStateReader Updated live nodes from ZooKeeper... (0) -> (4)
   [junit4]   2> 2431279 INFO  (jetty-launcher-1400-thread-6) [n:127.0.0.1:35765_solr    ] o.a.s.c.Overseer Overseer (id=null) closing
   [junit4]   2> 2431280 INFO  (jetty-launcher-1400-thread-6) [n:127.0.0.1:35765_solr    ] o.a.s.c.ZkController Register node as live in ZooKeeper:/live_nodes/127.0.0.1:35765_solr
   [junit4]   2> 2431281 INFO  (zkCallback-1412-thread-1-processing-n:127.0.0.1:42221_solr) [n:127.0.0.1:42221_solr    ] o.a.s.c.c.ZkStateReader Updated live nodes from ZooKeeper... (4) -> (5)
   [junit4]   2> 2431281 INFO  (zkCallback-1434-thread-1-processing-n:127.0.0.1:39713_solr) [n:127.0.0.1:39713_solr    ] o.a.s.c.c.ZkStateReader Updated live nodes from ZooKeeper... (4) -> (5)
   [junit4]   2> 2431281 INFO  (zkCallback-1432-thread-1-processing-n:127.0.0.1:37961_solr) [n:127.0.0.1:37961_solr    ] o.a.s.c.c.ZkStateReader Updated live nodes from ZooKeeper... (4) -> (5)
   [junit4]   2> 2431281 INFO  (zkCallback-1430-thread-1-processing-n:127.0.0.1:39501_solr) [n:127.0.0.1:39501_solr    ] o.a.s.c.c.ZkStateReader Updated live nodes from ZooKeeper... (4) -> (5)
   [junit4]   2> 2431281 INFO  (zkCallback-1431-thread-1-processing-n:127.0.0.1:34639_solr) [n:127.0.0.1:34639_solr    ] o.a.s.c.c.ZkStateReader Updated live nodes from ZooKeeper... (4) -> (5)
   [junit4]   2> 2431292 INFO  (jetty-launcher-1400-thread-3) [n:127.0.0.1:42221_solr    ] o.a.s.c.ZkController Register node as live in ZooKeeper:/live_nodes/127.0.0.1:42221_solr
   [junit4]   2> 2431297 INFO  (zkCallback-1422-thread-1-processing-n:127.0.0.1:35765_solr) [n:127.0.0.1:35765_solr    ] o.a.s.c.c.ZkStateReader Updated live nodes from ZooKeeper... (4) -> (5)
   [junit4]   2> 2431298 INFO  (zkCallback-1430-thread-1-processing-n:127.0.0.1:39501_solr) [n:127.0.0.1:39501_solr    ] o.a.s.c.c.ZkStateReader Updated live nodes from ZooKeeper... (5) -> (6)
   [junit4]   2> 2431298 INFO  (zkCallback-1422-thread-1-processing-n:127.0.0.1:35765_solr) [n:127.0.0.1:35765_solr    ] o.a.s.c.c.ZkStateReader Updated live nodes from ZooKeeper...

[...truncated too long message...]

[junit4]   2> 2460786 ERROR (OverseerThreadFactory-4152-thread-3-processing-n:127.0.0.1:42221_solr) [n:127.0.0.1:42221_solr    ] o.a.s.c.OverseerCollectionMessageHandler Operation replacenode failed:java.util.concurrent.RejectedExecutionException: Task org.apache.solr.common.util.ExecutorUtil$MDCAwareThreadPoolExecutor$$Lambda$8/8046622@7c9e9 rejected from org.apache.solr.common.util.ExecutorUtil$MDCAwareThreadPoolExecutor@1eb9403[Terminated, pool size = 0, active threads = 0, queued tasks = 0, completed tasks = 46]
   [junit4]   2> 	at java.util.concurrent.ThreadPoolExecutor$AbortPolicy.rejectedExecution(ThreadPoolExecutor.java:2063)
   [junit4]   2> 	at java.util.concurrent.ThreadPoolExecutor.reject(ThreadPoolExecutor.java:830)
   [junit4]   2> 	at java.util.concurrent.ThreadPoolExecutor.execute(ThreadPoolExecutor.java:1379)
   [junit4]   2> 	at org.apache.solr.common.util.ExecutorUtil$MDCAwareThreadPoolExecutor.execute(ExecutorUtil.java:173)
   [junit4]   2> 	at com.codahale.metrics.InstrumentedExecutorService.execute(InstrumentedExecutorService.java:61)
   [junit4]   2> 	at java.util.concurrent.ExecutorCompletionService.submit(ExecutorCompletionService.java:181)
   [junit4]   2> 	at org.apache.solr.handler.component.HttpShardHandler.submit(HttpShardHandler.java:203)
   [junit4]   2> 	at org.apache.solr.cloud.OverseerCollectionMessageHandler.waitForCoreAdminAsyncCallToComplete(OverseerCollectionMessageHandler.java:886)
   [junit4]   2> 	at org.apache.solr.cloud.OverseerCollectionMessageHandler.waitForAsyncCallsToComplete(OverseerCollectionMessageHandler.java:866)
   [junit4]   2> 	at org.apache.solr.cloud.OverseerCollectionMessageHandler.processResponses(OverseerCollectionMessageHandler.java:745)
   [junit4]   2> 	at org.apache.solr.cloud.OverseerCollectionMessageHandler.processResponses(OverseerCollectionMessageHandler.java:721)
   [junit4]   2> 	at org.apache.solr.cloud.AddReplicaCmd.lambda$addReplica$0(AddReplicaCmd.java:185)
   [junit4]   2> 	at org.apache.solr.cloud.AddReplicaCmd.addReplica(AddReplicaCmd.java:191)
   [junit4]   2> 	at org.apache.solr.cloud.OverseerCollectionMessageHandler.addReplica(OverseerCollectionMessageHandler.java:716)
   [junit4]   2> 	at org.apache.solr.cloud.ReplaceNodeCmd.call(ReplaceNodeCmd.java:103)
   [junit4]   2> 	at org.apache.solr.cloud.OverseerCollectionMessageHandler.processMessage(OverseerCollectionMessageHandler.java:228)
   [junit4]   2> 	at org.apache.solr.cloud.OverseerTaskProcessor$Runner.run(OverseerTaskProcessor.java:464)
   [junit4]   2> 	at org.apache.solr.common.util.ExecutorUtil$MDCAwareThreadPoolExecutor.lambda$execute$0(ExecutorUtil.java:188)
   [junit4]   2> 	at java.util.concurrent.ThreadPoolExecutor.runWorker(ThreadPoolExecutor.java:1149)
   [junit4]   2> 	at java.util.concurrent.ThreadPoolExecutor$Worker.run(ThreadPoolExecutor.java:624)
   [junit4]   2> 	at java.lang.Thread.run(Thread.java:748)
   [junit4]   2> 
   [junit4]   2> 2460792 INFO  (OverseerThreadFactory-4152-thread-3-processing-n:127.0.0.1:42221_solr) [n:127.0.0.1:42221_solr    ] o.a.s.c.OverseerTaskQueue Response ZK path: /overseer/collection-queue-work/qnr-0000000003 doesn't exist.  Requestor may have disconnected from ZooKeeper
   [junit4]   2> 2460793 WARN  (zkCallback-1412-thread-2-processing-n:127.0.0.1:42221_solr) [n:127.0.0.1:42221_solr    ] o.a.s.c.c.ZkStateReader ZooKeeper watch triggered, but Solr cannot talk to ZK: [KeeperErrorCode = Session expired for /live_nodes]
   [junit4]   2> 2460793 INFO  (jetty-closer-1401-thread-5) [    ] o.e.j.s.h.ContextHandler Stopped o.e.j.s.ServletContextHandler@19ce233{/solr,null,UNAVAILABLE}
   [junit4]   2> 2461616 WARN  (zkCallback-1431-thread-2-processing-n:127.0.0.1:34639_solr) [n:127.0.0.1:34639_solr    ] o.a.s.c.c.ZkStateReader ZooKeeper watch triggered, but Solr cannot talk to ZK: [KeeperErrorCode = Session expired for /live_nodes]
   [junit4]   2> 2461617 INFO  (jetty-closer-1401-thread-1) [    ] o.e.j.s.h.ContextHandler Stopped o.e.j.s.ServletContextHandler@162dc54{/solr,null,UNAVAILABLE}
   [junit4]   2> 2461631 WARN  (zkCallback-1422-thread-1-processing-n:127.0.0.1:35765_solr) [n:127.0.0.1:35765_solr    ] o.a.s.c.c.ZkStateReader ZooKeeper watch triggered, but Solr cannot talk to ZK: [KeeperErrorCode = Session expired for /live_nodes]
   [junit4]   2> 2461631 INFO  (jetty-closer-1401-thread-3) [    ] o.e.j.s.h.ContextHandler Stopped o.e.j.s.ServletContextHandler@1521c3f{/solr,null,UNAVAILABLE}
   [junit4]   2> 2461632 WARN  (zkCallback-1432-thread-1-processing-n:127.0.0.1:37961_solr) [n:127.0.0.1:37961_solr    ] o.a.s.c.c.ZkStateReader ZooKeeper watch triggered, but Solr cannot talk to ZK: [KeeperErrorCode = Session expired for /live_nodes]
   [junit4]   2> 2461632 INFO  (jetty-closer-1401-thread-4) [    ] o.e.j.s.h.ContextHandler Stopped o.e.j.s.ServletContextHandler@1e854df{/solr,null,UNAVAILABLE}
   [junit4]   2> 2461633 ERROR (SUITE-ReplaceNodeTest-seed#[57D64213D9525745]-worker) [    ] o.a.z.s.ZooKeeperServer ZKShutdownHandler is not registered, so ZooKeeper server won't take any action on ERROR or SHUTDOWN server state changes
   [junit4]   2> 2461633 INFO  (SUITE-ReplaceNodeTest-seed#[57D64213D9525745]-worker) [    ] o.a.s.c.ZkTestServer connecting to 127.0.0.1:41067 41067
   [junit4]   2> 2466667 INFO  (Thread-1999) [    ] o.a.s.c.ZkTestServer connecting to 127.0.0.1:41067 41067
   [junit4]   2> 2466669 WARN  (Thread-1999) [    ] o.a.s.c.ZkTestServer Watch limit violations: 
   [junit4]   2> Maximum concurrent create/delete watches above limit:
   [junit4]   2> 
   [junit4]   2> 	7	/solr/aliases.json
   [junit4]   2> 	7	/solr/configs/conf1
   [junit4]   2> 	6	/solr/security.json
   [junit4]   2> 
   [junit4]   2> Maximum concurrent data watches above limit:
   [junit4]   2> 
   [junit4]   2> 	119	/solr/collections/replacenodetest_coll/state.json
   [junit4]   2> 	7	/solr/clusterprops.json
   [junit4]   2> 	7	/solr/clusterstate.json
   [junit4]   2> 	2	/solr/collections/replacenodetest_coll/leader_elect/shard5/election/98768520436645905-core_node20-n_0000000000
   [junit4]   2> 	2	/solr/overseer_elect/election/98768520436645906-127.0.0.1:39713_solr-n_0000000003
   [junit4]   2> 	2	/solr/collections/replacenodetest_coll/leader_elect/shard2/election/98768520436645896-core_node7-n_0000000001
   [junit4]   2> 
   [junit4]   2> Maximum concurrent children watches above limit:
   [junit4]   2> 
   [junit4]   2> 	7	/solr/live_nodes
   [junit4]   2> 	7	/solr/collections
   [junit4]   2> 
   [junit4]   2> NOTE: leaving temporary files on disk at: /home/jenkins/workspace/Lucene-Solr-7.x-Linux/solr/build/solr-core/test/J0/temp/solr.cloud.ReplaceNodeTest_57D64213D9525745-001
   [junit4]   2> NOTE: test params are: codec=CheapBastard, sim=RandomSimilarity(queryNorm=false): {}, locale=el-CY, timezone=NZ
   [junit4]   2> NOTE: Linux 4.10.0-33-generic i386/Oracle Corporation 1.8.0_144 (32-bit)/cpus=8,threads=1,free=85682288,total=536870912
   [junit4]   2> NOTE: All tests run in this JVM: [DeleteLastCustomShardedReplicaTest, RAMDirectoryFactoryTest, JavabinLoaderTest, TestSolrCloudWithKerberosAlt, TestAuthorizationFramework, CreateCollectionCleanupTest, ZkStateReaderTest, MoveReplicaHDFSUlogDirTest, GraphQueryTest, DistribDocExpirationUpdateProcessorTest, ChaosMonkeySafeLeaderWithPullReplicasTest, LargeFieldTest, CloudExitableDirectoryReaderTest, UpdateParamsTest, ActionThrottleTest, TestHttpShardHandlerFactory, TestExactSharedStatsCache, SolrIndexSplitterTest, OutputWriterTest, TestEmbeddedSolrServerSchemaAPI, TestJsonFacetRefinement, TestComponentsName, TestLockTree, SpellCheckCollatorTest, SolrCoreTest, AssignTest, CoreSorterTest, SSLMigrationTest, DebugComponentTest, RuleEngineTest, TestDocSet, BlockDirectoryTest, TestReplicaProperties, HdfsBasicDistributedZkTest, TestHashQParserPlugin, TestConfigReload, TestRawTransformer, ResponseHeaderTest, TestFunctionQuery, CdcrRequestHandlerTest, OverseerStatusTest, TestDocBasedVersionConstraints, XmlUpdateRequestHandlerTest, QueryElevationComponentTest, TestNumericRangeQuery32, SuggesterWFSTTest, SynonymTokenizerTest, TestConfigSets, TestSolrQueryParser, InfoHandlerTest, RequestLoggingTest, SortSpecParsingTest, HttpPartitionTest, ShufflingReplicaListTransformerTest, PluginInfoTest, TestFreeTextSuggestions, SolrCLIZkUtilsTest, HdfsWriteToMultipleCollectionsTest, TestOrdValues, TestLuceneIndexBackCompat, AutoScalingHandlerTest, TestCloudJSONFacetJoinDomain, TestSolrCLIRunExample, TestInitParams, TestSchemaNameResource, TestPHPSerializedResponseWriter, OverseerCollectionConfigSetProcessorTest, TestDynamicFieldCollectionResource, SyncSliceTest, TestDeleteCollectionOnDownNodes, TestLuceneMatchVersion, TestDFISimilarityFactory, TestCollationField, DistributedQueryElevationComponentTest, RequestHandlersTest, TestExtendedDismaxParser, BasicZkTest, DocumentAnalysisRequestHandlerTest, TestDistributedSearch, TestAnalyzeInfixSuggestions, FieldMutatingUpdateProcessorTest, DistributedQueryComponentCustomSortTest, TestSolrDeletionPolicy1, EnumFieldTest, TestJavabinTupleStreamParser, CloudMLTQParserTest, TestChildDocTransformer, TestJoin, TestRangeQuery, SolrMetricsIntegrationTest, TestScoreJoinQPNoScore, LeaderFailureAfterFreshStartTest, TestIndexingPerformance, TestTrieFacet, TestSubQueryTransformerDistrib, DistributedFacetExistsSmallTest, TestMaxTokenLenTokenizer, ConcurrentDeleteAndCreateCollectionTest, TestStressLucene, SecurityConfHandlerTest, TestCSVResponseWriter, VersionInfoTest, TestSQLHandlerNonCloud, SolrRequestParserTest, FieldAnalysisRequestHandlerTest, BlockJoinFacetDistribTest, TestLMDirichletSimilarityFactory, TestCloudManagedSchema, TestSolrXml, TestReqParamsAPI, DeleteShardTest, BinaryUpdateRequestHandlerTest, HdfsLockFactoryTest, TestCollectionAPI, SolrJmxReporterCloudTest, TestExportWriter, DataDrivenBlockJoinTest, BasicDistributedZkTest, RemoteQueryErrorTest, ReplaceNodeTest]
   [junit4] Completed [528/734 (2!)] on J0 in 35.75s, 1 test, 1 failure <<< FAILURES!

[...truncated 43464 lines...]

[JENKINS] Lucene-Solr-7.x-Linux (64bit/jdk1.8.0_144) - Build # 542 - Failure!

Posted by Policeman Jenkins Server <je...@thetaphi.de>.
Build: https://jenkins.thetaphi.de/job/Lucene-Solr-7.x-Linux/542/
Java: 64bit/jdk1.8.0_144 -XX:-UseCompressedOops -XX:+UseG1GC

1 tests failed.
FAILED:  junit.framework.TestSuite.org.apache.solr.security.hadoop.TestImpersonationWithHadoopAuth

Error Message:
2 threads leaked from SUITE scope at org.apache.solr.security.hadoop.TestImpersonationWithHadoopAuth:     1) Thread[id=32676, name=jetty-launcher-6160-thread-1-EventThread, state=TIMED_WAITING, group=TGRP-TestImpersonationWithHadoopAuth]         at sun.misc.Unsafe.park(Native Method)         at java.util.concurrent.locks.LockSupport.parkNanos(LockSupport.java:215)         at java.util.concurrent.locks.AbstractQueuedSynchronizer.doAcquireSharedNanos(AbstractQueuedSynchronizer.java:1037)         at java.util.concurrent.locks.AbstractQueuedSynchronizer.tryAcquireSharedNanos(AbstractQueuedSynchronizer.java:1328)         at java.util.concurrent.CountDownLatch.await(CountDownLatch.java:277)         at org.apache.curator.CuratorZookeeperClient.internalBlockUntilConnectedOrTimedOut(CuratorZookeeperClient.java:323)         at org.apache.curator.RetryLoop.callWithRetry(RetryLoop.java:105)         at org.apache.curator.framework.imps.GetDataBuilderImpl.pathInForeground(GetDataBuilderImpl.java:288)         at org.apache.curator.framework.imps.GetDataBuilderImpl.forPath(GetDataBuilderImpl.java:279)         at org.apache.curator.framework.imps.GetDataBuilderImpl.forPath(GetDataBuilderImpl.java:41)         at org.apache.curator.framework.recipes.shared.SharedValue.readValue(SharedValue.java:244)         at org.apache.curator.framework.recipes.shared.SharedValue.access$100(SharedValue.java:44)         at org.apache.curator.framework.recipes.shared.SharedValue$1.process(SharedValue.java:61)         at org.apache.curator.framework.imps.NamespaceWatcher.process(NamespaceWatcher.java:67)         at org.apache.zookeeper.ClientCnxn$EventThread.processEvent(ClientCnxn.java:530)         at org.apache.zookeeper.ClientCnxn$EventThread.run(ClientCnxn.java:505)    2) Thread[id=32666, name=jetty-launcher-6160-thread-2-EventThread, state=TIMED_WAITING, group=TGRP-TestImpersonationWithHadoopAuth]         at sun.misc.Unsafe.park(Native Method)         at java.util.concurrent.locks.LockSupport.parkNanos(LockSupport.java:215)         at java.util.concurrent.locks.AbstractQueuedSynchronizer.doAcquireSharedNanos(AbstractQueuedSynchronizer.java:1037)         at java.util.concurrent.locks.AbstractQueuedSynchronizer.tryAcquireSharedNanos(AbstractQueuedSynchronizer.java:1328)         at java.util.concurrent.CountDownLatch.await(CountDownLatch.java:277)         at org.apache.curator.CuratorZookeeperClient.internalBlockUntilConnectedOrTimedOut(CuratorZookeeperClient.java:323)         at org.apache.curator.RetryLoop.callWithRetry(RetryLoop.java:105)         at org.apache.curator.framework.imps.GetDataBuilderImpl.pathInForeground(GetDataBuilderImpl.java:288)         at org.apache.curator.framework.imps.GetDataBuilderImpl.forPath(GetDataBuilderImpl.java:279)         at org.apache.curator.framework.imps.GetDataBuilderImpl.forPath(GetDataBuilderImpl.java:41)         at org.apache.curator.framework.recipes.shared.SharedValue.readValue(SharedValue.java:244)         at org.apache.curator.framework.recipes.shared.SharedValue.access$100(SharedValue.java:44)         at org.apache.curator.framework.recipes.shared.SharedValue$1.process(SharedValue.java:61)         at org.apache.curator.framework.imps.NamespaceWatcher.process(NamespaceWatcher.java:67)         at org.apache.zookeeper.ClientCnxn$EventThread.processEvent(ClientCnxn.java:530)         at org.apache.zookeeper.ClientCnxn$EventThread.run(ClientCnxn.java:505)

Stack Trace:
com.carrotsearch.randomizedtesting.ThreadLeakError: 2 threads leaked from SUITE scope at org.apache.solr.security.hadoop.TestImpersonationWithHadoopAuth: 
   1) Thread[id=32676, name=jetty-launcher-6160-thread-1-EventThread, state=TIMED_WAITING, group=TGRP-TestImpersonationWithHadoopAuth]
        at sun.misc.Unsafe.park(Native Method)
        at java.util.concurrent.locks.LockSupport.parkNanos(LockSupport.java:215)
        at java.util.concurrent.locks.AbstractQueuedSynchronizer.doAcquireSharedNanos(AbstractQueuedSynchronizer.java:1037)
        at java.util.concurrent.locks.AbstractQueuedSynchronizer.tryAcquireSharedNanos(AbstractQueuedSynchronizer.java:1328)
        at java.util.concurrent.CountDownLatch.await(CountDownLatch.java:277)
        at org.apache.curator.CuratorZookeeperClient.internalBlockUntilConnectedOrTimedOut(CuratorZookeeperClient.java:323)
        at org.apache.curator.RetryLoop.callWithRetry(RetryLoop.java:105)
        at org.apache.curator.framework.imps.GetDataBuilderImpl.pathInForeground(GetDataBuilderImpl.java:288)
        at org.apache.curator.framework.imps.GetDataBuilderImpl.forPath(GetDataBuilderImpl.java:279)
        at org.apache.curator.framework.imps.GetDataBuilderImpl.forPath(GetDataBuilderImpl.java:41)
        at org.apache.curator.framework.recipes.shared.SharedValue.readValue(SharedValue.java:244)
        at org.apache.curator.framework.recipes.shared.SharedValue.access$100(SharedValue.java:44)
        at org.apache.curator.framework.recipes.shared.SharedValue$1.process(SharedValue.java:61)
        at org.apache.curator.framework.imps.NamespaceWatcher.process(NamespaceWatcher.java:67)
        at org.apache.zookeeper.ClientCnxn$EventThread.processEvent(ClientCnxn.java:530)
        at org.apache.zookeeper.ClientCnxn$EventThread.run(ClientCnxn.java:505)
   2) Thread[id=32666, name=jetty-launcher-6160-thread-2-EventThread, state=TIMED_WAITING, group=TGRP-TestImpersonationWithHadoopAuth]
        at sun.misc.Unsafe.park(Native Method)
        at java.util.concurrent.locks.LockSupport.parkNanos(LockSupport.java:215)
        at java.util.concurrent.locks.AbstractQueuedSynchronizer.doAcquireSharedNanos(AbstractQueuedSynchronizer.java:1037)
        at java.util.concurrent.locks.AbstractQueuedSynchronizer.tryAcquireSharedNanos(AbstractQueuedSynchronizer.java:1328)
        at java.util.concurrent.CountDownLatch.await(CountDownLatch.java:277)
        at org.apache.curator.CuratorZookeeperClient.internalBlockUntilConnectedOrTimedOut(CuratorZookeeperClient.java:323)
        at org.apache.curator.RetryLoop.callWithRetry(RetryLoop.java:105)
        at org.apache.curator.framework.imps.GetDataBuilderImpl.pathInForeground(GetDataBuilderImpl.java:288)
        at org.apache.curator.framework.imps.GetDataBuilderImpl.forPath(GetDataBuilderImpl.java:279)
        at org.apache.curator.framework.imps.GetDataBuilderImpl.forPath(GetDataBuilderImpl.java:41)
        at org.apache.curator.framework.recipes.shared.SharedValue.readValue(SharedValue.java:244)
        at org.apache.curator.framework.recipes.shared.SharedValue.access$100(SharedValue.java:44)
        at org.apache.curator.framework.recipes.shared.SharedValue$1.process(SharedValue.java:61)
        at org.apache.curator.framework.imps.NamespaceWatcher.process(NamespaceWatcher.java:67)
        at org.apache.zookeeper.ClientCnxn$EventThread.processEvent(ClientCnxn.java:530)
        at org.apache.zookeeper.ClientCnxn$EventThread.run(ClientCnxn.java:505)
	at __randomizedtesting.SeedInfo.seed([1C9A0069B95234A]:0)




Build Log:
[...truncated 13947 lines...]
   [junit4] Suite: org.apache.solr.security.hadoop.TestImpersonationWithHadoopAuth
   [junit4]   2> Creating dataDir: /home/jenkins/workspace/Lucene-Solr-7.x-Linux/solr/build/solr-core/test/J1/temp/solr.security.hadoop.TestImpersonationWithHadoopAuth_1C9A0069B95234A-001/init-core-data-001
   [junit4]   2> 2866600 WARN  (SUITE-TestImpersonationWithHadoopAuth-seed#[1C9A0069B95234A]-worker) [    ] o.a.s.SolrTestCaseJ4 startTrackingSearchers: numOpens=2 numCloses=2
   [junit4]   2> 2866600 INFO  (SUITE-TestImpersonationWithHadoopAuth-seed#[1C9A0069B95234A]-worker) [    ] o.a.s.SolrTestCaseJ4 Using PointFields (NUMERIC_POINTS_SYSPROP=true) w/NUMERIC_DOCVALUES_SYSPROP=true
   [junit4]   2> 2866601 INFO  (SUITE-TestImpersonationWithHadoopAuth-seed#[1C9A0069B95234A]-worker) [    ] o.a.s.SolrTestCaseJ4 Randomized ssl (true) and clientAuth (false) via: @org.apache.solr.util.RandomizeSSL(reason=, value=NaN, ssl=NaN, clientAuth=NaN)
   [junit4]   2> 2866602 INFO  (SUITE-TestImpersonationWithHadoopAuth-seed#[1C9A0069B95234A]-worker) [    ] o.a.s.SolrTestCaseJ4 SecureRandom sanity checks: test.solr.allowed.securerandom=null & java.security.egd=file:/dev/./urandom
   [junit4]   2> 2866622 INFO  (SUITE-TestImpersonationWithHadoopAuth-seed#[1C9A0069B95234A]-worker) [    ] o.a.s.c.MiniSolrCloudCluster Starting cluster of 2 servers in /home/jenkins/workspace/Lucene-Solr-7.x-Linux/solr/build/solr-core/test/J1/temp/solr.security.hadoop.TestImpersonationWithHadoopAuth_1C9A0069B95234A-001/tempDir-001
   [junit4]   2> 2866622 INFO  (SUITE-TestImpersonationWithHadoopAuth-seed#[1C9A0069B95234A]-worker) [    ] o.a.s.c.ZkTestServer STARTING ZK TEST SERVER
   [junit4]   2> 2866622 INFO  (Thread-6705) [    ] o.a.s.c.ZkTestServer client port:0.0.0.0/0.0.0.0:0
   [junit4]   2> 2866622 INFO  (Thread-6705) [    ] o.a.s.c.ZkTestServer Starting server
   [junit4]   2> 2866627 ERROR (Thread-6705) [    ] o.a.z.s.ZooKeeperServer ZKShutdownHandler is not registered, so ZooKeeper server won't take any action on ERROR or SHUTDOWN server state changes
   [junit4]   2> 2866722 INFO  (SUITE-TestImpersonationWithHadoopAuth-seed#[1C9A0069B95234A]-worker) [    ] o.a.s.c.ZkTestServer start zk server on port:42069
   [junit4]   2> 2866729 INFO  (jetty-launcher-6160-thread-1) [    ] o.e.j.s.Server jetty-9.3.20.v20170531
   [junit4]   2> 2866729 INFO  (jetty-launcher-6160-thread-2) [    ] o.e.j.s.Server jetty-9.3.20.v20170531
   [junit4]   2> 2866738 INFO  (jetty-launcher-6160-thread-2) [    ] o.e.j.s.h.ContextHandler Started o.e.j.s.ServletContextHandler@7dc0542{/solr,null,AVAILABLE}
   [junit4]   2> 2866738 INFO  (jetty-launcher-6160-thread-1) [    ] o.e.j.s.h.ContextHandler Started o.e.j.s.ServletContextHandler@49459248{/solr,null,AVAILABLE}
   [junit4]   2> 2866739 INFO  (jetty-launcher-6160-thread-2) [    ] o.e.j.s.AbstractConnector Started ServerConnector@26f435ab{SSL,[ssl, http/1.1]}{127.0.0.1:42617}
   [junit4]   2> 2866739 INFO  (jetty-launcher-6160-thread-1) [    ] o.e.j.s.AbstractConnector Started ServerConnector@5d53a9f8{SSL,[ssl, http/1.1]}{127.0.0.1:44947}
   [junit4]   2> 2866739 INFO  (jetty-launcher-6160-thread-2) [    ] o.e.j.s.Server Started @2868444ms
   [junit4]   2> 2866739 INFO  (jetty-launcher-6160-thread-1) [    ] o.e.j.s.Server Started @2868444ms
   [junit4]   2> 2866739 INFO  (jetty-launcher-6160-thread-2) [    ] o.a.s.c.s.e.JettySolrRunner Jetty properties: {hostContext=/solr, hostPort=42617}
   [junit4]   2> 2866739 INFO  (jetty-launcher-6160-thread-1) [    ] o.a.s.c.s.e.JettySolrRunner Jetty properties: {hostContext=/solr, hostPort=44947}
   [junit4]   2> 2866739 ERROR (jetty-launcher-6160-thread-2) [    ] o.a.s.u.StartupLoggingUtils Missing Java Option solr.log.dir. Logging may be missing or incomplete.
   [junit4]   2> 2866739 ERROR (jetty-launcher-6160-thread-1) [    ] o.a.s.u.StartupLoggingUtils Missing Java Option solr.log.dir. Logging may be missing or incomplete.
   [junit4]   2> 2866739 INFO  (jetty-launcher-6160-thread-2) [    ] o.a.s.s.SolrDispatchFilter  ___      _       Welcome to Apache Solr™ version 7.1.0
   [junit4]   2> 2866739 INFO  (jetty-launcher-6160-thread-1) [    ] o.a.s.s.SolrDispatchFilter  ___      _       Welcome to Apache Solr™ version 7.1.0
   [junit4]   2> 2866739 INFO  (jetty-launcher-6160-thread-2) [    ] o.a.s.s.SolrDispatchFilter / __| ___| |_ _   Starting in cloud mode on port null
   [junit4]   2> 2866739 INFO  (jetty-launcher-6160-thread-1) [    ] o.a.s.s.SolrDispatchFilter / __| ___| |_ _   Starting in cloud mode on port null
   [junit4]   2> 2866739 INFO  (jetty-launcher-6160-thread-2) [    ] o.a.s.s.SolrDispatchFilter \__ \/ _ \ | '_|  Install dir: null, Default config dir: null
   [junit4]   2> 2866739 INFO  (jetty-launcher-6160-thread-1) [    ] o.a.s.s.SolrDispatchFilter \__ \/ _ \ | '_|  Install dir: null, Default config dir: null
   [junit4]   2> 2866739 INFO  (jetty-launcher-6160-thread-2) [    ] o.a.s.s.SolrDispatchFilter |___/\___/_|_|    Start time: 2017-10-04T08:03:45.941Z
   [junit4]   2> 2866739 INFO  (jetty-launcher-6160-thread-1) [    ] o.a.s.s.SolrDispatchFilter |___/\___/_|_|    Start time: 2017-10-04T08:03:45.941Z
   [junit4]   2> 2866740 INFO  (jetty-launcher-6160-thread-2) [    ] o.a.s.s.SolrDispatchFilter solr.xml found in ZooKeeper. Loading...
   [junit4]   2> 2866740 INFO  (jetty-launcher-6160-thread-1) [    ] o.a.s.s.SolrDispatchFilter solr.xml found in ZooKeeper. Loading...
   [junit4]   2> 2866746 INFO  (jetty-launcher-6160-thread-1) [    ] o.a.s.c.ZkContainer Zookeeper client=127.0.0.1:42069/solr
   [junit4]   2> 2866746 INFO  (jetty-launcher-6160-thread-2) [    ] o.a.s.c.ZkContainer Zookeeper client=127.0.0.1:42069/solr
   [junit4]   2> 2866749 WARN  (NIOServerCxn.Factory:0.0.0.0/0.0.0.0:0) [    ] o.a.z.s.NIOServerCnxn caught end of stream exception
   [junit4]   2> EndOfStreamException: Unable to read additional data from client sessionid 0x15ee6697a210004, likely client has closed socket
   [junit4]   2> 	at org.apache.zookeeper.server.NIOServerCnxn.doIO(NIOServerCnxn.java:239)
   [junit4]   2> 	at org.apache.zookeeper.server.NIOServerCnxnFactory.run(NIOServerCnxnFactory.java:203)
   [junit4]   2> 	at java.lang.Thread.run(Thread.java:748)
   [junit4]   2> 2866749 WARN  (NIOServerCxn.Factory:0.0.0.0/0.0.0.0:0) [    ] o.a.z.s.NIOServerCnxn caught end of stream exception
   [junit4]   2> EndOfStreamException: Unable to read additional data from client sessionid 0x15ee6697a210003, likely client has closed socket
   [junit4]   2> 	at org.apache.zookeeper.server.NIOServerCnxn.doIO(NIOServerCnxn.java:239)
   [junit4]   2> 	at org.apache.zookeeper.server.NIOServerCnxnFactory.run(NIOServerCnxnFactory.java:203)
   [junit4]   2> 	at java.lang.Thread.run(Thread.java:748)
   [junit4]   2> 2866779 INFO  (jetty-launcher-6160-thread-1) [n:127.0.0.1:44947_solr    ] o.a.s.c.Overseer Overseer (id=null) closing
   [junit4]   2> 2866779 INFO  (jetty-launcher-6160-thread-2) [n:127.0.0.1:42617_solr    ] o.a.s.c.Overseer Overseer (id=null) closing
   [junit4]   2> 2866780 INFO  (jetty-launcher-6160-thread-1) [n:127.0.0.1:44947_solr    ] o.a.s.c.OverseerElectionContext I am going to be the leader 127.0.0.1:44947_solr
   [junit4]   2> 2866780 INFO  (jetty-launcher-6160-thread-2) [n:127.0.0.1:42617_solr    ] o.a.s.c.ZkController Register node as live in ZooKeeper:/live_nodes/127.0.0.1:42617_solr
   [junit4]   2> 2866780 INFO  (jetty-launcher-6160-thread-1) [n:127.0.0.1:44947_solr    ] o.a.s.c.Overseer Overseer (id=98769582543667206-127.0.0.1:44947_solr-n_0000000000) starting
   [junit4]   2> 2866781 INFO  (zkCallback-6171-thread-1-processing-n:127.0.0.1:44947_solr) [n:127.0.0.1:44947_solr    ] o.a.s.c.c.ZkStateReader Updated live nodes from ZooKeeper... (0) -> (1)
   [junit4]   2> 2866793 INFO  (zkCallback-6172-thread-1-processing-n:127.0.0.1:42617_solr) [n:127.0.0.1:42617_solr    ] o.a.s.c.c.ZkStateReader Updated live nodes from ZooKeeper... (0) -> (1)
   [junit4]   2> 2866793 INFO  (jetty-launcher-6160-thread-1) [n:127.0.0.1:44947_solr    ] o.a.s.c.ZkController Register node as live in ZooKeeper:/live_nodes/127.0.0.1:44947_solr
   [junit4]   2> 2866794 INFO  (zkCallback-6172-thread-1-processing-n:127.0.0.1:42617_solr) [n:127.0.0.1:42617_solr    ] o.a.s.c.c.ZkStateReader Updated live nodes from ZooKeeper... (1) -> (2)
   [junit4]   2> 2866794 INFO  (zkCallback-6171-thread-1-processing-n:127.0.0.1:44947_solr) [n:127.0.0.1:44947_solr    ] o.a.s.c.c.ZkStateReader Updated live nodes from ZooKeeper... (1) -> (2)
   [junit4]   2> 2866810 INFO  (jetty-launcher-6160-thread-2) [n:127.0.0.1:42617_solr    ] o.a.s.c.CoreContainer Initializing authentication plugin: org.apache.solr.security.HadoopAuthPlugin
   [junit4]   2> 2866810 INFO  (jetty-launcher-6160-thread-2) [n:127.0.0.1:42617_solr    ] o.a.s.s.HadoopAuthPlugin Params: {proxyuser.anyHostUsersGroup.hosts=*, proxyuser.wrongHost.hosts=1.1.1.1.1.1, proxyuser.bogusGroup.groups=__some_bogus_group, proxyuser.localHostAnyGroup.groups=*, cookie.domain=127.0.0.1, proxyuser.wrongHost.groups=*, type=simple, proxyuser.noHosts.groups=*, proxyuser.anyHostUsersGroup.groups=jenkins, proxyuser.noGroups.hosts=*, proxyuser.anyHostAnyUser.groups=*, delegation-token.token-kind=solr-dt, proxyuser.bogusGroup.hosts=*, zk-dt-secret-manager.znodeWorkingPath=solr/security/zkdtsm, signer.secret.provider.zookeeper.path=/token, zk-dt-secret-manager.enable=true, proxyuser.localHostAnyGroup.hosts=localhost.localdomain,localhost,127.0.0.1, proxyuser.anyHostAnyUser.hosts=*, signer.secret.provider=zookeeper}
   [junit4]   2> 2866811 INFO  (jetty-launcher-6160-thread-2) [n:127.0.0.1:42617_solr    ] o.a.c.f.i.CuratorFrameworkImpl Starting
   [junit4]   2> 2866819 INFO  (jetty-launcher-6160-thread-2-EventThread) [n:127.0.0.1:42617_solr    ] o.a.c.f.s.ConnectionStateManager State change: CONNECTED
   [junit4]   2> 2866829 INFO  (jetty-launcher-6160-thread-2) [n:127.0.0.1:42617_solr    ] o.a.s.c.CoreContainer PKIAuthenticationPlugin is managing internode requests
   [junit4]   2> 2866849 INFO  (jetty-launcher-6160-thread-1) [n:127.0.0.1:44947_solr    ] o.a.s.c.CoreContainer Initializing authentication plugin: org.apache.solr.security.HadoopAuthPlugin
   [junit4]   2> 2866849 INFO  (jetty-launcher-6160-thread-1) [n:127.0.0.1:44947_solr    ] o.a.s.s.HadoopAuthPlugin Params: {proxyuser.anyHostUsersGroup.hosts=*, proxyuser.wrongHost.hosts=1.1.1.1.1.1, proxyuser.bogusGroup.groups=__some_bogus_group, proxyuser.localHostAnyGroup.groups=*, cookie.domain=127.0.0.1, proxyuser.wrongHost.groups=*, type=simple, proxyuser.noHosts.groups=*, proxyuser.anyHostUsersGroup.groups=jenkins, proxyuser.noGroups.hosts=*, proxyuser.anyHostAnyUser.groups=*, delegation-token.token-kind=solr-dt, proxyuser.bogusGroup.hosts=*, zk-dt-secret-manager.znodeWorkingPath=solr/security/zkdtsm, signer.secret.provider.zookeeper.path=/token, zk-dt-secret-manager.enable=true, proxyuser.localHostAnyGroup.hosts=localhost.localdomain,localhost,127.0.0.1, proxyuser.anyHostAnyUser.hosts=*, signer.secret.provider=zookeeper}
   [junit4]   2> 2866850 INFO  (jetty-launcher-6160-thread-1) [n:127.0.0.1:44947_solr    ] o.a.c.f.i.CuratorFrameworkImpl Starting
   [junit4]   2> 2866860 INFO  (jetty-launcher-6160-thread-2) [n:127.0.0.1:42617_solr    ] o.a.s.m.r.SolrJmxReporter JMX monitoring for 'solr_42617.solr.node' (registry 'solr.node') enabled at server: com.sun.jmx.mbeanserver.JmxMBeanServer@61d8887
   [junit4]   2> 2866861 INFO  (jetty-launcher-6160-thread-1-EventThread) [n:127.0.0.1:44947_solr    ] o.a.c.f.s.ConnectionStateManager State change: CONNECTED
   [junit4]   2> 2866865 INFO  (jetty-launcher-6160-thread-2) [n:127.0.0.1:42617_solr    ] o.a.s.m.r.SolrJmxReporter JMX monitoring for 'solr_42617.solr.jvm' (registry 'solr.jvm') enabled at server: com.sun.jmx.mbeanserver.JmxMBeanServer@61d8887
   [junit4]   2> 2866865 INFO  (jetty-launcher-6160-thread-2) [n:127.0.0.1:42617_solr    ] o.a.s.m.r.SolrJmxReporter JMX monitoring for 'solr_42617.solr.jetty' (registry 'solr.jetty') enabled at server: com.sun.jmx.mbeanserver.JmxMBeanServer@61d8887
   [junit4]   2> 2866865 INFO  (jetty-launcher-6160-thread-2) [n:127.0.0.1:42617_solr    ] o.a.s.c.CorePropertiesLocator Found 0 core definitions underneath /home/jenkins/workspace/Lucene-Solr-7.x-Linux/solr/build/solr-core/test/J1/temp/solr.security.hadoop.TestImpersonationWithHadoopAuth_1C9A0069B95234A-001/tempDir-001/node2/.
   [junit4]   2> 2867892 INFO  (jetty-launcher-6160-thread-1) [n:127.0.0.1:44947_solr    ] o.a.s.c.CoreContainer PKIAuthenticationPlugin is managing internode requests
   [junit4]   2> 2867920 INFO  (jetty-launcher-6160-thread-1) [n:127.0.0.1:44947_solr    ] o.a.s.m.r.SolrJmxReporter JMX monitoring for 'solr_44947.solr.node' (registry 'solr.node') enabled at server: com.sun.jmx.mbeanserver.JmxMBeanServer@61d8887
   [junit4]   2> 2867927 INFO  (jetty-launcher-6160-thread-1) [n:127.0.0.1:44947_solr    ] o.a.s.m.r.SolrJmxReporter JMX monitoring for 'solr_44947.solr.jvm' (registry 'solr.jvm') enabled at server: com.sun.jmx.mbeanserver.JmxMBeanServer@61d8887
   [junit4]   2> 2867928 INFO  (jetty-launcher-6160-thread-1) [n:127.0.0.1:44947_solr    ] o.a.s.m.r.SolrJmxReporter JMX monitoring for 'solr_44947.solr.jetty' (registry 'solr.jetty') enabled at server: com.sun.jmx.mbeanserver.JmxMBeanServer@61d8887
   [junit4]   2> 2867929 INFO  (jetty-launcher-6160-thread-1) [n:127.0.0.1:44947_solr    ] o.a.s.c.CorePropertiesLocator Found 0 core definitions underneath /home/jenkins/workspace/Lucene-Solr-7.x-Linux/solr/build/solr-core/test/J1/temp/solr.security.hadoop.TestImpersonationWithHadoopAuth_1C9A0069B95234A-001/tempDir-001/node1/.
   [junit4]   2> 2867965 INFO  (SUITE-TestImpersonationWithHadoopAuth-seed#[1C9A0069B95234A]-worker) [    ] o.a.s.c.c.ZkStateReader Updated live nodes from ZooKeeper... (0) -> (2)
   [junit4]   2> 2867966 INFO  (SUITE-TestImpersonationWithHadoopAuth-seed#[1C9A0069B95234A]-worker) [    ] o.a.s.c.s.i.ZkClientClusterStateProvider Cluster at 127.0.0.1:42069/solr ready
   [junit4]   2> 2867997 INFO  (TEST-TestImpersonationWithHadoopAuth.testProxyValidateAnyHostAnyUser-seed#[1C9A0069B95234A]) [    ] o.a.s.SolrTestCaseJ4 ###Starting testProxyValidateAnyHostAnyUser
   [junit4]   2> 2868022 INFO  (qtp1962895672-32634) [n:127.0.0.1:42617_solr    ] o.a.s.h.a.CollectionsHandler Invoked Collection Action :list with params doAs=bar&action=LIST&user.name=anyHostAnyUser&wt=javabin&version=2 and sendToOCPQueue=true
   [junit4]   2> 2868023 INFO  (qtp1962895672-32634) [n:127.0.0.1:42617_solr    ] o.a.s.s.HttpSolrCall [admin] webapp=null path=/admin/collections params={doAs=bar&action=LIST&user.name=anyHostAnyUser&wt=javabin&version=2} status=0 QTime=0
   [junit4]   2> 2868023 INFO  (TEST-TestImpersonationWithHadoopAuth.testProxyValidateAnyHostAnyUser-seed#[1C9A0069B95234A]) [    ] o.a.s.SolrTestCaseJ4 ###Ending testProxyValidateAnyHostAnyUser
   [junit4]   2> 2868053 INFO  (TEST-TestImpersonationWithHadoopAuth.testProxyInvalidProxyUser-seed#[1C9A0069B95234A]) [    ] o.a.s.SolrTestCaseJ4 ###Starting testProxyInvalidProxyUser
   [junit4]   2> 2868062 INFO  (TEST-TestImpersonationWithHadoopAuth.testProxyInvalidProxyUser-seed#[1C9A0069B95234A]) [    ] o.a.s.SolrTestCaseJ4 ###Ending testProxyInvalidProxyUser
   [junit4]   2> 2868092 INFO  (TEST-TestImpersonationWithHadoopAuth.testProxyValidateHost-seed#[1C9A0069B95234A]) [    ] o.a.s.SolrTestCaseJ4 ###Starting testProxyValidateHost
   [junit4]   2> 2868094 INFO  (qtp1962895672-32622) [n:127.0.0.1:42617_solr    ] o.a.s.h.a.CollectionsHandler Invoked Collection Action :list with params doAs=bar&action=LIST&user.name=localHostAnyGroup&wt=javabin&version=2 and sendToOCPQueue=true
   [junit4]   2> 2868094 INFO  (qtp1962895672-32622) [n:127.0.0.1:42617_solr    ] o.a.s.s.HttpSolrCall [admin] webapp=null path=/admin/collections params={doAs=bar&action=LIST&user.name=localHostAnyGroup&wt=javabin&version=2} status=0 QTime=0
   [junit4]   2> 2868094 INFO  (TEST-TestImpersonationWithHadoopAuth.testProxyValidateHost-seed#[1C9A0069B95234A]) [    ] o.a.s.SolrTestCaseJ4 ###Ending testProxyValidateHost
   [junit4]   2> 2868119 INFO  (TEST-TestImpersonationWithHadoopAuth.testProxyValidateGroup-seed#[1C9A0069B95234A]) [    ] o.a.s.SolrTestCaseJ4 ###Starting testProxyValidateGroup
   [junit4]   2> 2868128 INFO  (qtp1962895672-32624) [n:127.0.0.1:42617_solr    ] o.a.s.h.a.CollectionsHandler Invoked Collection Action :list with params doAs=jenkins&action=LIST&user.name=anyHostUsersGroup&wt=javabin&version=2 and sendToOCPQueue=true
   [junit4]   2> 2868128 INFO  (qtp1962895672-32624) [n:127.0.0.1:42617_solr    ] o.a.s.s.HttpSolrCall [admin] webapp=null path=/admin/collections params={doAs=jenkins&action=LIST&user.name=anyHostUsersGroup&wt=javabin&version=2} status=0 QTime=0
   [junit4]   2> 2868128 INFO  (TEST-TestImpersonationWithHadoopAuth.testProxyValidateGroup-seed#[1C9A0069B95234A]) [    ] o.a.s.SolrTestCaseJ4 ###Ending testProxyValidateGroup
   [junit4]   2> 2868151 INFO  (TEST-TestImpersonationWithHadoopAuth.testProxyNoConfigGroups-seed#[1C9A0069B95234A]) [    ] o.a.s.SolrTestCaseJ4 ###Starting testProxyNoConfigGroups
   [junit4]   2> 2868154 INFO  (TEST-TestImpersonationWithHadoopAuth.testProxyNoConfigGroups-seed#[1C9A0069B95234A]) [    ] o.a.s.SolrTestCaseJ4 ###Ending testProxyNoConfigGroups
   [junit4]   2> 2868175 INFO  (TEST-TestImpersonationWithHadoopAuth.testProxyWrongHost-seed#[1C9A0069B95234A]) [    ] o.a.s.SolrTestCaseJ4 ###Starting testProxyWrongHost
   [junit4]   2> 2883190 WARN  (jetty-launcher-6160-thread-1-SendThread(127.0.0.1:42069)) [n:127.0.0.1:44947_solr    ] o.a.z.ClientCnxn Client session timed out, have not heard from server in 15277ms for sessionid 0x15ee6697a210008
   [junit4]   2> 2883190 WARN  (jetty-launcher-6160-thread-2-SendThread(127.0.0.1:42069)) [n:127.0.0.1:42617_solr    ] o.a.z.ClientCnxn Client session timed out, have not heard from server in 16324ms for sessionid 0x15ee6697a210005
   [junit4]   2> 2883190 WARN  (NIOServerCxn.Factory:0.0.0.0/0.0.0.0:0) [    ] o.a.z.s.NIOServerCnxn caught end of stream exception
   [junit4]   2> EndOfStreamException: Unable to read additional data from client sessionid 0x15ee6697a210008, likely client has closed socket
   [junit4]   2> 	at org.apache.zookeeper.server.NIOServerCnxn.doIO(NIOServerCnxn.java:239)
   [junit4]   2> 	at org.apache.zookeeper.server.NIOServerCnxnFactory.run(NIOServerCnxnFactory.java:203)
   [junit4]   2> 	at java.lang.Thread.run(Thread.java:748)
   [junit4]   2> 2883190 WARN  (jetty-launcher-6160-thread-2-SendThread(127.0.0.1:42069)) [n:127.0.0.1:42617_solr    ] o.a.z.ClientCnxn Client session timed out, have not heard from server in 15277ms for sessionid 0x15ee6697a210007
   [junit4]   2> 2883191 WARN  (NIOServerCxn.Factory:0.0.0.0/0.0.0.0:0) [    ] o.a.z.s.NIOServerCnxn caught end of stream exception
   [junit4]   2> EndOfStreamException: Unable to read additional data from client sessionid 0x15ee6697a210005, likely client has closed socket
   [junit4]   2> 	at org.apache.zookeeper.server.NIOServerCnxn.doIO(NIOServerCnxn.java:239)
   [junit4]   2> 	at org.apache.zookeeper.server.NIOServerCnxnFactory.run(NIOServerCnxnFactory.java:203)
   [junit4]   2> 	at java.lang.Thread.run(Thread.java:748)
   [junit4]   2> 2883190 WARN  (jetty-launcher-6160-thread-1-SendThread(127.0.0.1:42069)) [n:127.0.0.1:44947_solr    ] o.a.z.ClientCnxn Client session timed out, have not heard from server in 15258ms for sessionid 0x15ee6697a210006
   [junit4]   2> 2883191 WARN  (NIOServerCxn.Factory:0.0.0.0/0.0.0.0:0) [    ] o.a.z.s.NIOServerCnxn caught end of stream exception
   [junit4]   2> EndOfStreamException: Unable to read additional data from client sessionid 0x15ee6697a210007, likely client has closed socket
   [junit4]   2> 	at org.apache.zookeeper.server.NIOServerCnxn.doIO(NIOServerCnxn.java:239)
   [junit4]   2> 	at org.apache.zookeeper.server.NIOServerCnxnFactory.run(NIOServerCnxnFactory.java:203)
   [junit4]   2> 	at java.lang.Thread.run(Thread.java:748)
   [junit4]   2> 2883191 WARN  (NIOServerCxn.Factory:0.0.0.0/0.0.0.0:0) [    ] o.a.z.s.NIOServerCnxn caught end of stream exception
   [junit4]   2> EndOfStreamException: Unable to read additional data from client sessionid 0x15ee6697a210006, likely client has closed socket
   [junit4]   2> 	at org.apache.zookeeper.server.NIOServerCnxn.doIO(NIOServerCnxn.java:239)
   [junit4]   2> 	at org.apache.zookeeper.server.NIOServerCnxnFactory.run(NIOServerCnxnFactory.java:203)
   [junit4]   2> 	at java.lang.Thread.run(Thread.java:748)
   [junit4]   2> 2883192 INFO  (TEST-TestImpersonationWithHadoopAuth.testProxyWrongHost-seed#[1C9A0069B95234A]) [    ] o.a.s.SolrTestCaseJ4 ###Ending testProxyWrongHost
   [junit4]   2> 2883230 INFO  (TEST-TestImpersonationWithHadoopAuth.testProxyInvalidGroup-seed#[1C9A0069B95234A]) [    ] o.a.s.SolrTestCaseJ4 ###Starting testProxyInvalidGroup
   [junit4]   2> 2883245 WARN  (qtp1962895672-32634) [n:127.0.0.1:42617_solr    ] o.a.h.s.ShellBasedUnixGroupsMapping got exception trying to get groups for user bar: id: ‘bar’: no such user
   [junit4]   2> id: ‘bar’: no such user
   [junit4]   2> 
   [junit4]   2> 2883247 INFO  (TEST-TestImpersonationWithHadoopAuth.testProxyInvalidGroup-seed#[1C9A0069B95234A]) [    ] o.a.s.SolrTestCaseJ4 ###Ending testProxyInvalidGroup
   [junit4]   2> 2883288 INFO  (TEST-TestImpersonationWithHadoopAuth.testProxyNullProxyUser-seed#[1C9A0069B95234A]) [    ] o.a.s.SolrTestCaseJ4 ###Starting testProxyNullProxyUser
   [junit4]   2> 2883290 INFO  (qtp1962895672-32624) [n:127.0.0.1:42617_solr    ] o.a.s.s.SolrDispatchFilter Error authenticating
   [junit4]   2> java.lang.IllegalArgumentException: userName is NULL, empty or contains a '&'
   [junit4]   2> 	at org.apache.hadoop.security.authentication.util.AuthToken.checkForIllegalArgument(AuthToken.java:87)
   [junit4]   2> 	at org.apache.hadoop.security.authentication.util.AuthToken.<init>(AuthToken.java:70)
   [junit4]   2> 	at org.apache.hadoop.security.authentication.server.AuthenticationToken.<init>(AuthenticationToken.java:58)
   [junit4]   2> 	at org.apache.hadoop.security.authentication.server.PseudoAuthenticationHandler.authenticate(PseudoAuthenticationHandler.java:195)
   [junit4]   2> 	at org.apache.hadoop.security.token.delegation.web.DelegationTokenAuthenticationHandler.authenticate(DelegationTokenAuthenticationHandler.java:348)
   [junit4]   2> 	at org.apache.solr.security.RequestContinuesRecorderAuthenticationHandler.authenticate(RequestContinuesRecorderAuthenticationHandler.java:69)
   [junit4]   2> 	at org.apache.hadoop.security.authentication.server.AuthenticationFilter.doFilter(AuthenticationFilter.java:518)
   [junit4]   2> 	at org.apache.solr.security.HadoopAuthFilter.doFilter(HadoopAuthFilter.java:110)
   [junit4]   2> 	at org.apache.solr.security.HadoopAuthPlugin.doAuthenticate(HadoopAuthPlugin.java:245)
   [junit4]   2> 	at org.apache.solr.servlet.SolrDispatchFilter.authenticateRequest(SolrDispatchFilter.java:451)
   [junit4]   2> 	at org.apache.solr.servlet.SolrDispatchFilter.doFilter(SolrDispatchFilter.java:347)
   [junit4]   2> 	at org.apache.solr.servlet.SolrDispatchFilter.doFilter(SolrDispatchFilter.java:326)
   [junit4]   2> 	at org.eclipse.jetty.servlet.ServletHandler$CachedChain.doFilter(ServletHandler.java:1759)
   [junit4]   2> 	at org.apache.solr.client.solrj.embedded.JettySolrRunner$DebugFilter.doFilter(JettySolrRunner.java:139)
   [junit4]   2> 	at org.eclipse.jetty.servlet.ServletHandler$CachedChain.doFilter(ServletHandler.java:1759)
   [junit4]   2> 	at org.eclipse.jetty.servlet.ServletHandler.doHandle(ServletHandler.java:582)
   [junit4]   2> 	at org.eclipse.jetty.server.session.SessionHandler.doHandle(SessionHandler.java:224)
   [junit4]   2> 	at org.eclipse.jetty.server.handler.ContextHandler.doHandle(ContextHandler.java:1180)
   [junit4]   2> 	at org.eclipse.jetty.servlet.ServletHandler.doScope(ServletHandler.java:512)
   [junit4]   2> 	at org.eclipse.jetty.server.session.SessionHandler.doScope(SessionHandler.java:185)
   [junit4]   2> 	at org.eclipse.jetty.server.handler.ContextHandler.doScope(ContextHandler.java:1112)
   [junit4]   2> 	at org.eclipse.jetty.server.handler.ScopedHandler.handle(ScopedHandler.java:141)
   [junit4]   2> 	at org.eclipse.jetty.server.handler.gzip.GzipHandler.handle(GzipHandler.java:493)
   [junit4]   2> 	at org.eclipse.jetty.server.handler.HandlerWrapper.handle(HandlerWrapper.java:134)
   [junit4]   2> 	at org.eclipse.jetty.server.Server.handle(Server.java:534)
   [junit4]   2> 	at org.eclipse.jetty.server.HttpChannel.handle(HttpChannel.java:320)
   [junit4]   2> 	at org.eclipse.jetty.server.HttpConnection.onFillable(HttpConnection.java:251)
   [junit4]   2> 	at org.eclipse.jetty.io.AbstractConnection$ReadCallback.succeeded(AbstractConnection.java:283)
   [junit4]   2> 	at org.eclipse.jetty.io.FillInterest.fillable(FillInterest.java:108)
   [junit4]   2> 	at org.eclipse.jetty.io.ssl.SslConnection.onFillable(SslConnection.java:251)
   [junit4]   2> 	at org.eclipse.jetty.io.AbstractConnection$ReadCallback.succeeded(AbstractConnection.java:283)
   [junit4]   2> 	at org.eclipse.jetty.io.FillInterest.fillable(FillInterest.java:108)
   [junit4]   2> 	at org.eclipse.jetty.io.SelectChannelEndPoint$2.run(SelectChannelEndPoint.java:93)
   [junit4]   2> 	at org.eclipse.jetty.util.thread.strategy.ExecuteProduceConsume.executeProduceConsume(ExecuteProduceConsume.java:303)
   [junit4]   2> 	at org.eclipse.jetty.util.thread.strategy.ExecuteProduceConsume.produceConsume(ExecuteProduceConsume.java:148)
   [junit4]   2> 	at org.eclipse.jetty.util.thread.strategy.ExecuteProduceConsume.run(ExecuteProduceConsume.java:136)
   [junit4]   2> 	at org.eclipse.jetty.util.thread.QueuedThreadPool.runJob(QueuedThreadPool.java:671)
   [junit4]   2> 	at org.eclipse.jetty.util.thread.QueuedThreadPool$2.run(QueuedThreadPool.java:589)
   [junit4]   2> 	at java.lang.Thread.run(Thread.java:748)
   [junit4]   2> 2883291 WARN  (zkCallback-6172-thread-1-processing-n:127.0.0.1:42617_solr) [n:127.0.0.1:42617_solr    ] o.a.s.c.c.ConnectionManager Watcher org.apache.solr.common.cloud.ConnectionManager@30b99de name: ZooKeeperConnection Watcher:127.0.0.1:42069/solr got event WatchedEvent state:Disconnected type:None path:null path: null type: None
   [junit4]   2> 2883291 WARN  (qtp1962895672-32624) [n:127.0.0.1:42617_solr    ] o.e.j.s.ServletHandler /solr/admin/collections
   [junit4]   2> org.apache.solr.common.SolrException: Error during request authentication, 
   [junit4]   2> 	at org.apache.solr.servlet.SolrDispatchFilter.authenticateRequest(SolrDispatchFilter.java:457)
   [junit4]   2> 	at org.apache.solr.servlet.SolrDispatchFilter.doFilter(SolrDispatchFilter.java:347)
   [junit4]   2> 	at org.apache.solr.servlet.SolrDispatchFilter.doFilter(SolrDispatchFilter.java:326)
   [junit4]   2> 	at org.eclipse.jetty.servlet.ServletHandler$CachedChain.doFilter(ServletHandler.java:1759)
   [junit4]   2> 	at org.apache.solr.client.solrj.embedded.JettySolrRunner$DebugFilter.doFilter(JettySolrRunner.java:139)
   [junit4]   2> 	at org.eclipse.jetty.servlet.ServletHandler$CachedChain.doFilter(ServletHandler.java:1759)
   [junit4]   2> 	at org.eclipse.jetty.servlet.ServletHandler.doHandle(ServletHandler.java:582)
   [junit4]   2> 	at org.eclipse.jetty.server.session.SessionHandler.doHandle(SessionHandler.java:224)
   [junit4]   2> 	at org.eclipse.jetty.server.handler.ContextHandler.doHandle(ContextHandler.java:1180)
   [junit4]   2> 	at org.eclipse.jetty.servlet.ServletHandler.doScope(ServletHandler.java:512)
   [junit4]   2> 	at org.eclipse.jetty.server.session.SessionHandler.doScope(SessionHandler.java:185)
   [junit4]   2> 	at org.eclipse.jetty.server.handler.ContextHandler.doScope(ContextHandler.java:1112)
   [junit4]   2> 	at org.eclipse.jetty.server.handler.ScopedHandler.handle(ScopedHandler.java:141)
   [junit4]   2> 	at org.eclipse.jetty.server.handler.gzip.GzipHandler.handle(GzipHandler.java:493)
   [junit4]   2> 	at org.eclipse.jetty.server.handler.HandlerWrapper.handle(HandlerWrapper.java:134)
   [junit4]   2> 	at org.eclipse.jetty.server.Server.handle(Server.java:534)
   [junit4]   2> 	at org.eclipse.jetty.server.HttpChannel.handle(HttpChannel.java:320)
   [junit4]   2> 	at org.eclipse.jetty.server.HttpConnection.onFillable(HttpConnection.java:251)
   [junit4]   2> 	at org.eclipse.jetty.io.AbstractConnection$ReadCallback.succeeded(AbstractConnection.java:283)
   [junit4]   2> 	at org.eclipse.jetty.io.FillInterest.fillable(FillInterest.java:108)
   [junit4]   2> 	at org.eclipse.jetty.io.ssl.SslConnection.onFillable(SslConnection.java:251)
   [junit4]   2> 	at org.eclipse.jetty.io.AbstractConnection$ReadCallback.succeeded(AbstractConnection.java:283)
   [junit4]   2> 	at org.eclipse.jetty.io.FillInterest.fillable(FillInterest.java:108)
   [junit4]   2> 	at org.eclipse.jetty.io.SelectChannelEndPoint$2.run(SelectChannelEndPoint.java:93)
   [junit4]   2> 	at org.eclipse.jetty.util.thread.strategy.ExecuteProduceConsume.executeProduceConsume(ExecuteProduceConsume.java:303)
   [junit4]   2> 	at org.eclipse.jetty.util.thread.strategy.ExecuteProduceConsume.produceConsume(ExecuteProduceConsume.java:148)
   [junit4]   2> 	at org.eclipse.jetty.util.thread.strategy.ExecuteProduceConsume.run(ExecuteProduceConsume.java:136)
   [junit4]   2> 	at org.eclipse.jetty.util.thread.QueuedThreadPool.runJob(QueuedThreadPool.java:671)
   [junit4]   2> 	at org.eclipse.jetty.util.thread.QueuedThreadPool$2.run(QueuedThreadPool.java:589)
   [junit4]   2> 	at java.lang.Thread.run(Thread.java:748)
   [junit4]   2> Caused by: java.lang.IllegalArgumentException: userName is NULL, empty or contains a '&'
   [junit4]   2> 	at org.apache.hadoop.security.authentication.util.AuthToken.checkForIllegalArgument(AuthToken.java:87)
   [junit4]   2> 	at org.apache.hadoop.security.authentication.util.AuthToken.<init>(AuthToken.java:70)
   [junit4]   2> 	at org.apache.hadoop.security.authentication.server.AuthenticationToken.<init>(AuthenticationToken.java:58)
   [junit4]   2> 	at org.apache.hadoop.security.authentication.server.PseudoAuthenticationHandler.authenticate(PseudoAuthenticationHandler.java:195)
   [junit4]   2> 	at org.apache.hadoop.security.token.delegation.web.DelegationTokenAuthenticationHandler.authenticate(DelegationTokenAuthenticationHandler.java:348)
   [junit4]   2> 	at org.apache.solr.security.RequestContinuesRecorderAuthenticationHandler.authenticate(RequestContinuesRecorderAuthenticationHandler.java:69)
   [junit4]   2> 	at org.apache.hadoop.security.authentication.server.AuthenticationFilter.doFilter(AuthenticationFilter.java:518)
   [junit4]   2> 	at org.apache.solr.security.HadoopAuthFilter.doFilter(HadoopAuthFilter.java:110)
   [junit4]   2> 	at org.apache.solr.security.HadoopAuthPlugin.doAuthenticate(HadoopAuthPlugin.java:245)
   [junit4]   2> 	at org.apache.solr.servlet.SolrDispatchFilter.authenticateRequest(SolrDispatchFilter.java:451)
   [junit4]   2> 	... 29 more
   [junit4]   2> 2883291 WARN  (zkCallback-6172-thread-1-processing-n:127.0.0.1:42617_solr) [n:127.0.0.1:42617_solr    ] o.a.s.c.c.ConnectionManager zkClient has disconnected
   [junit4]   2> 2883291 INFO  (jetty-launcher-6160-thread-1-EventThread) [n:127.0.0.1:44947_solr    ] o.a.c.f.s.ConnectionStateManager State change: SUSPENDED
   [junit4]   2> 2883290 WARN  (zkCallback-6178-thread-1) [    ] o.a.s.c.c.ConnectionManager Watcher org.apache.solr.common.cloud.ConnectionManager@52df2fc1 name: ZooKeeperConnection Watcher:127.0.0.1:42069/solr got event WatchedEvent state:Disconnected type:None path:null path: null type: None
   [junit4]   2> 2883292 WARN  (zkCallback-6178-thread-1) [    ] o.a.s.c.c.ConnectionManager zkClient has disconnected
   [junit4]   2> 2883292 INFO  (jetty-launcher-6160-thread-2-EventThread) [n:127.0.0.1:42617_solr    ] o.a.c.f.s.ConnectionStateManager State change: SUSPENDED
   [junit4]   2> 2883292 INFO  (TEST-TestImpersonationWithHadoopAuth.testProxyNullProxyUser-seed#[1C9A0069B95234A]) [    ] o.a.s.SolrTestCaseJ4 ###Ending testProxyNullProxyUser
   [junit4]   2> 2883296 WARN  (zkCallback-6171-thread-1-processing-n:127.0.0.1:44947_solr) [n:127.0.0.1:44947_solr    ] o.a.s.c.c.ConnectionManager Watcher org.apache.solr.common.cloud.ConnectionManager@1d4ffa46 name: ZooKeeperConnection Watcher:127.0.0.1:42069/solr got event WatchedEvent state:Disconnected type:None path:null path: null type: None
   [junit4]   2> 2883297 WARN  (zkCallback-6171-thread-1-processing-n:127.0.0.1:44947_solr) [n:127.0.0.1:44947_solr    ] o.a.s.c.c.ConnectionManager zkClient has disconnected
   [junit4]   2> 2883315 INFO  (TEST-TestImpersonationWithHadoopAuth.testProxyNoConfigHosts-seed#[1C9A0069B95234A]) [    ] o.a.s.SolrTestCaseJ4 ###Starting testProxyNoConfigHosts
   [junit4]   2> 2883318 INFO  (TEST-TestImpersonationWithHadoopAuth.testProxyNoConfigHosts-seed#[1C9A0069B95234A]) [    ] o.a.s.SolrTestCaseJ4 ###Ending testProxyNoConfigHosts
   [junit4] IGNOR/A 0.00s J1 | TestImpersonationWithHadoopAuth.testForwarding
   [junit4]    > Assumption #1: 'awaitsfix' test group is disabled (@AwaitsFix(bugUrl=https://issues.apache.org/jira/browse/HADOOP-9893))
   [junit4]   2> 2883660 INFO  (jetty-closer-6161-thread-1) [    ] o.e.j.s.AbstractConnector Stopped ServerConnector@26f435ab{SSL,[ssl, http/1.1]}{127.0.0.1:0}
   [junit4]   2> 2883661 INFO  (jetty-closer-6161-thread-1) [    ] o.a.s.c.CoreContainer Shutting down CoreContainer instance=1234501973
   [junit4]   2> 2883661 INFO  (jetty-closer-6161-thread-2) [    ] o.e.j.s.AbstractConnector Stopped ServerConnector@5d53a9f8{SSL,[ssl, http/1.1]}{127.0.0.1:0}
   [junit4]   2> 2883661 INFO  (jetty-closer-6161-thread-1) [    ] o.a.s.m.SolrMetricManager Closing metric reporters for registry=solr.node, tag=null
   [junit4]   2> 2883662 INFO  (jetty-closer-6161-thread-2) [    ] o.a.s.c.CoreContainer Shutting down CoreContainer instance=17451432
   [junit4]   2> 2883662 INFO  (jetty-closer-6161-thread-1) [    ] o.a.s.m.r.SolrJmxReporter Closing reporter [org.apache.solr.metrics.reporters.SolrJmxReporter@5e84aa60: rootName = solr_42617, domain = solr.node, service url = null, agent id = null] for registry solr.node / com.codahale.metrics.MetricRegistry@7ef38a0f
   [junit4]   2> 2883662 INFO  (jetty-closer-6161-thread-2) [    ] o.a.s.m.SolrMetricManager Closing metric reporters for registry=solr.node, tag=null
   [junit4]   2> 2883662 INFO  (jetty-closer-6161-thread-2) [    ] o.a.s.m.r.SolrJmxReporter Closing reporter [org.apache.solr.metrics.reporters.SolrJmxReporter@7886dd55: rootName = solr_44947, domain = solr.node, service url = null, agent id = null] for registry solr.node / com.codahale.metrics.MetricRegistry@7160d912
   [junit4]   2> 2883669 INFO  (jetty-closer-6161-thread-1) [    ] o.a.s.m.SolrMetricManager Closing metric reporters for registry=solr.jvm, tag=null
   [junit4]   2> 2883669 INFO  (jetty-closer-6161-thread-1) [    ] o.a.s.m.r.SolrJmxReporter Closing reporter [org.apache.solr.metrics.reporters.SolrJmxReporter@164f60c6: rootName = solr_42617, domain = solr.jvm, service url = null, agent id = null] for registry solr.jvm / com.codahale.metrics.MetricRegistry@eca84e4
   [junit4]   2> 2883669 INFO  (jetty-closer-6161-thread-2) [    ] o.a.s.m.SolrMetricManager Closing metric reporters for registry=solr.jvm, tag=null
   [junit4]   2> 2883669 INFO  (jetty-closer-6161-thread-2) [    ] o.a.s.m.r.SolrJmxReporter Closing reporter [org.apache.solr.metrics.reporters.SolrJmxReporter@475e5a75: rootName = solr_44947, domain = solr.jvm, service url = null, agent id = null] for registry solr.jvm / com.codahale.metrics.MetricRegistry@eca84e4
   [junit4]   2> 2883674 INFO  (jetty-closer-6161-thread-1) [    ] o.a.s.m.SolrMetricManager Closing metric reporters for registry=solr.jetty, tag=null
   [junit4]   2> 2883674 INFO  (jetty-closer-6161-thread-1) [    ] o.a.s.m.r.SolrJmxReporter Closing reporter [org.apache.solr.metrics.reporters.SolrJmxReporter@10d4d282: rootName = solr_42617, domain = solr.jetty, service url = null, agent id = null] for registry solr.jetty / com.codahale.metrics.MetricRegistry@16f24672
   [junit4]   2> 2883675 INFO  (jetty-closer-6161-thread-2) [    ] o.a.s.m.SolrMetricManager Closing metric reporters for registry=solr.jetty, tag=null
   [junit4]   2> 2883675 INFO  (jetty-closer-6161-thread-2) [    ] o.a.s.m.r.SolrJmxReporter Closing reporter [org.apache.solr.metrics.reporters.SolrJmxReporter@719e3450: rootName = solr_44947, domain = solr.jetty, service url = null, agent id = null] for registry solr.jetty / com.codahale.metrics.MetricRegistry@16f24672
   [junit4]   2> 2884698 INFO  (jetty-closer-6161-thread-1) [    ] o.a.s.m.SolrMetricManager Closing metric reporters for registry=solr.cluster, tag=null
   [junit4]   2> 2884699 INFO  (jetty-closer-6161-thread-1) [    ] o.a.s.c.TransientSolrCoreCacheDefault Allocating transient cache for 2147483647 transient cores
   [junit4]   2> 2884700 WARN  (zkCallback-6172-thread-5-processing-n:127.0.0.1:42617_solr) [n:127.0.0.1:42617_solr    ] o.a.s.c.c.ZkStateReader ZooKeeper watch triggered, but Solr cannot talk to ZK: [KeeperErrorCode = Session expired for /live_nodes]
   [junit4]   2> 2884700 ERROR (Thread[Thread-6722,5,TGRP-TestImpersonationWithHadoopAuth]) [n:127.0.0.1:42617_solr    ] o.a.h.s.t.d.AbstractDelegationTokenSecretManager ExpiredTokenRemover received java.lang.InterruptedException: sleep interrupted
   [junit4]   2> 2884800 INFO  (jetty-closer-6161-thread-1) [    ] o.e.j.s.h.ContextHandler Stopped o.e.j.s.ServletContextHandler@7dc0542{/solr,null,UNAVAILABLE}
   [junit4]   2> 2885074 INFO  (zkCallback-6171-thread-2-processing-n:127.0.0.1:44947_solr) [n:127.0.0.1:44947_solr    ] o.a.s.c.c.ZkStateReader Updated live nodes from ZooKeeper... (2) -> (1)
   [junit4]   2> 2885074 INFO  (jetty-closer-6161-thread-2) [    ] o.a.s.m.SolrMetricManager Closing metric reporters for registry=solr.cluster, tag=null
   [junit4]   2> 2885075 INFO  (jetty-closer-6161-thread-2) [    ] o.a.s.c.TransientSolrCoreCacheDefault Allocating transient cache for 2147483647 transient cores
   [junit4]   2> 2885075 INFO  (jetty-closer-6161-thread-2) [    ] o.a.s.c.Overseer Overseer (id=98769582543667206-127.0.0.1:44947_solr-n_0000000000) closing
   [junit4]   2> 2885075 INFO  (OverseerStateUpdate-98769582543667206-127.0.0.1:44947_solr-n_0000000000) [n:127.0.0.1:44947_solr    ] o.a.s.c.Overseer Overseer Loop exiting : 127.0.0.1:44947_solr
   [junit4]   2> 2885077 WARN  (zkCallback-6171-thread-2-processing-n:127.0.0.1:44947_solr) [n:127.0.0.1:44947_solr    ] o.a.s.c.c.ZkStateReader ZooKeeper watch triggered, but Solr cannot talk to ZK: [KeeperErrorCode = Session expired for /live_nodes]
   [junit4]   2> 2885077 ERROR (Thread[Thread-6725,5,TGRP-TestImpersonationWithHadoopAuth]) [n:127.0.0.1:44947_solr    ] o.a.h.s.t.d.AbstractDelegationTokenSecretManager ExpiredTokenRemover received java.lang.InterruptedException: sleep interrupted
   [junit4]   2> 2885079 INFO  (jetty-closer-6161-thread-2) [    ] o.e.j.s.h.ContextHandler Stopped o.e.j.s.ServletContextHandler@49459248{/solr,null,UNAVAILABLE}
   [junit4]   2> 2885080 ERROR (SUITE-TestImpersonationWithHadoopAuth-seed#[1C9A0069B95234A]-worker) [    ] o.a.z.s.ZooKeeperServer ZKShutdownHandler is not registered, so ZooKeeper server won't take any action on ERROR or SHUTDOWN server state changes
   [junit4]   2> 2885080 INFO  (SUITE-TestImpersonationWithHadoopAuth-seed#[1C9A0069B95234A]-worker) [    ] o.a.s.c.ZkTestServer connecting to 127.0.0.1:42069 42069
   [junit4]   2> 2892356 INFO  (Thread-6705) [    ] o.a.s.c.ZkTestServer connecting to 127.0.0.1:42069 42069
   [junit4]   2> 2892358 WARN  (Thread-6705) [    ] o.a.s.c.ZkTestServer Watch limit violations: 
   [junit4]   2> Maximum concurrent create/delete watches above limit:
   [junit4]   2> 
   [junit4]   2> 	3	/solr/aliases.json
   [junit4]   2> 	2	/solr/security.json
   [junit4]   2> 
   [junit4]   2> Maximum concurrent data watches above limit:
   [junit4]   2> 
   [junit4]   2> 	3	/solr/clusterstate.json
   [junit4]   2> 	3	/solr/clusterprops.json
   [junit4]   2> 	2	/solr/security/zkdtsm/ZKDTSMRoot/ZKDTSMKeyIdRoot
   [junit4]   2> 	2	/solr/security/zkdtsm/ZKDTSMRoot/ZKDTSMMasterKeyRoot/DK_1
   [junit4]   2> 	2	/solr/security/zkdtsm/ZKDTSMRoot/ZKDTSMMasterKeyRoot/DK_3
   [junit4]   2> 	2	/solr/security/zkdtsm/ZKDTSMRoot/ZKDTSMMasterKeyRoot/DK_2
   [junit4]   2> 	2	/solr/security/zkdtsm/ZKDTSMRoot/ZKDTSMMasterKeyRoot/DK_4
   [junit4]   2> 	2	/solr/security/zkdtsm/ZKDTSMRoot/ZKDTSMSeqNumRoot
   [junit4]   2> 
   [junit4]   2> Maximum concurrent children watches above limit:
   [junit4]   2> 
   [junit4]   2> 	3	/solr/live_nodes
   [junit4]   2> 	3	/solr/collections
   [junit4]   2> 	3	/solr/security/zkdtsm/ZKDTSMRoot/ZKDTSMTokensRoot
   [junit4]   2> 	2	/solr/security/zkdtsm/ZKDTSMRoot/ZKDTSMMasterKeyRoot
   [junit4]   2> 
   [junit4]   2> 2892358 INFO  (SUITE-TestImpersonationWithHadoopAuth-seed#[1C9A0069B95234A]-worker) [    ] o.a.s.SolrTestCaseJ4 ------------------------------------------------------- Done waiting for tracked resources to be released
   [junit4]   2> Oct 04, 2017 8:04:11 AM com.carrotsearch.randomizedtesting.ThreadLeakControl checkThreadLeaks
   [junit4]   2> WARNING: Will linger awaiting termination of 2 leaked thread(s).
   [junit4]   2> Oct 04, 2017 8:04:31 AM com.carrotsearch.randomizedtesting.ThreadLeakControl checkThreadLeaks
   [junit4]   2> SEVERE: 2 threads leaked from SUITE scope at org.apache.solr.security.hadoop.TestImpersonationWithHadoopAuth: 
   [junit4]   2>    1) Thread[id=32676, name=jetty-launcher-6160-thread-1-EventThread, state=TIMED_WAITING, group=TGRP-TestImpersonationWithHadoopAuth]
   [junit4]   2>         at sun.misc.Unsafe.park(Native Method)
   [junit4]   2>         at java.util.concurrent.locks.LockSupport.parkNanos(LockSupport.java:215)
   [junit4]   2>         at java.util.concurrent.locks.AbstractQueuedSynchronizer.doAcquireSharedNanos(AbstractQueuedSynchronizer.java:1037)
   [junit4]   2>         at java.util.concurrent.locks.AbstractQueuedSynchronizer.tryAcquireSharedNanos(AbstractQueuedSynchronizer.java:1328)
   [junit4]   2>         at java.util.concurrent.CountDownLatch.await(CountDownLatch.java:277)
   [junit4]   2>         at org.apache.curator.CuratorZookeeperClient.internalBlockUntilConnectedOrTimedOut(CuratorZookeeperClient.java:323)
   [junit4]   2>         at org.apache.curator.RetryLoop.callWithRetry(RetryLoop.java:105)
   [junit4]   2>         at org.apache.curator.framework.imps.GetDataBuilderImpl.pathInForeground(GetDataBuilderImpl.java:288)
   [junit4]   2>         at org.apache.curator.framework.imps.GetDataBuilderImpl.forPath(GetDataBuilderImpl.java:279)
   [junit4]   2>         at org.apache.curator.framework.imps.GetDataBuilderImpl.forPath(GetDataBuilderImpl.java:41)
   [junit4]   2>         at org.apache.curator.framework.recipes.shared.SharedValue.readValue(SharedValue.java:244)
   [junit4]   2>         at org.apache.curator.framework.recipes.shared.SharedValue.access$100(SharedValue.java:44)
   [junit4]   2>         at org.apache.curator.framework.recipes.shared.SharedValue$1.process(SharedValue.java:61)
   [junit4]   2>         at org.apache.curator.framework.imps.NamespaceWatcher.process(NamespaceWatcher.java:67)
   [junit4]   2>         at org.apache.zookeeper.ClientCnxn$EventThread.processEvent(ClientCnxn.java:530)
   [junit4]   2>         at org.apache.zookeeper.ClientCnxn$EventThread.run(ClientCnxn.java:505)
   [junit4]   2>    2) Thread[id=32666, name=jetty-launcher-6160-thread-2-EventThread, state=TIMED_WAITING, group=TGRP-TestImpersonationWithHadoopAuth]
   [junit4]   2>         at sun.misc.Unsafe.park(Native Method)
   [junit4]   2>         at java.util.concurrent.locks.LockSupport.parkNanos(LockSupport.java:215)
   [junit4]   2>         at java.util.concurrent.locks.AbstractQueuedSynchronizer.doAcquireSharedNanos(AbstractQueuedSynchronizer.java:1037)
   [junit4]   2>         at java.util.concurrent.locks.AbstractQueuedSynchronizer.tryAcquireSharedNanos(AbstractQueuedSynchronizer.java:1328)
   [junit4]   2>         at java.util.concurrent.CountDownLatch.await(CountDownLatch.java:277)
   [junit4]   2>         at org.apache.curator.CuratorZookeeperClient.internalBlockUntilConnectedOrTimedOut(CuratorZookeeperClient.java:323)
   [junit4]   2>         at org.apache.curator.RetryLoop.callWithRetry(RetryLoop.java:105)
   [junit4]   2>         at org.apache.curator.framework.imps.GetDataBuilderImpl.pathInForeground(GetDataBuilderImpl.java:288)
   [junit4]   2>         at org.apache.curator.framework.imps.GetDataBuilderImpl.forPath(GetDataBuilderImpl.java:279)
   [junit4]   2>         at org.apache.curator.framework.imps.GetDataBuilderImpl.forPath(GetDataBuilderImpl.java:41)
   [junit4]   2>         at org.apache.curator.framework.recipes.shared.SharedValue.readValue(SharedValue.java:244)
   [junit4]   2>         at org.apache.curator.framework.recipes.shared.SharedValue.access$100(SharedValue.java:44)
   [junit4]   2>         at org.apache.curator.framework.recipes.shared.SharedValue$1.process(SharedValue.java:61)
   [junit4]   2>         at org.apache.curator.framework.imps.NamespaceWatcher.process(NamespaceWatcher.java:67)
   [junit4]   2>         at org.apache.zookeeper.ClientCnxn$EventThread.processEvent(ClientCnxn.java:530)
   [junit4]   2>         at org.apache.zookeeper.ClientCnxn$EventThread.run(ClientCnxn.java:505)
   [junit4]   2> Oct 04, 2017 8:04:31 AM com.carrotsearch.randomizedtesting.ThreadLeakControl tryToInterruptAll
   [junit4]   2> INFO: Starting to interrupt leaked threads:
   [junit4]   2>    1) Thread[id=32676, name=jetty-launcher-6160-thread-1-EventThread, state=TIMED_WAITING, group=TGRP-TestImpersonationWithHadoopAuth]
   [junit4]   2>    2) Thread[id=32666, name=jetty-launcher-6160-thread-2-EventThread, state=TIMED_WAITING, group=TGRP-TestImpersonationWithHadoopAuth]
   [junit4]   2> 2912593 ERROR (jetty-launcher-6160-thread-1-EventThread) [n:127.0.0.1:44947_solr    ] o.a.c.f.i.CuratorFrameworkImpl Watcher exception
   [junit4]   2> java.lang.InterruptedException
   [junit4]   2> 	at java.util.concurrent.locks.AbstractQueuedSynchronizer.doAcquireSharedNanos(AbstractQueuedSynchronizer.java:1039)
   [junit4]   2> 	at java.util.concurrent.locks.AbstractQueuedSynchronizer.tryAcquireSharedNanos(AbstractQueuedSynchronizer.java:1328)
   [junit4]   2> 	at java.util.concurrent.CountDownLatch.await(CountDownLatch.java:277)
   [junit4]   2> 	at org.apache.curator.CuratorZookeeperClient.internalBlockUntilConnectedOrTimedOut(CuratorZookeeperClient.java:323)
   [junit4]   2> 	at org.apache.curator.RetryLoop.callWithRetry(RetryLoop.java:105)
   [junit4]   2> 	at org.apache.curator.framework.imps.GetDataBuilderImpl.pathInForeground(GetDataBuilderImpl.java:288)
   [junit4]   2> 	at org.apache.curator.framework.imps.GetDataBuilderImpl.forPath(GetDataBuilderImpl.java:279)
   [junit4]   2> 	at org.apache.curator.framework.imps.GetDataBuilderImpl.forPath(GetDataBuilderImpl.java:41)
   [junit4]   2> 	at org.apache.curator.framework.recipes.shared.SharedValue.readValue(SharedValue.java:244)
   [junit4]   2> 	at org.apache.curator.framework.recipes.shared.SharedValue.access$100(SharedValue.java:44)
   [junit4]   2> 	at org.apache.curator.framework.recipes.shared.SharedValue$1.process(SharedValue.java:61)
   [junit4]   2> 	at org.apache.curator.framework.imps.NamespaceWatcher.process(NamespaceWatcher.java:67)
   [junit4]   2> 	at org.apache.zookeeper.ClientCnxn$EventThread.processEvent(ClientCnxn.java:530)
   [junit4]   2> 	at org.apache.zookeeper.ClientCnxn$EventThread.run(ClientCnxn.java:505)
   [junit4]   2> 2912593 ERROR (jetty-launcher-6160-thread-2-EventThread) [n:127.0.0.1:42617_solr    ] o.a.c.f.i.CuratorFrameworkImpl Watcher exception
   [junit4]   2> java.lang.InterruptedException
   [junit4]   2> 	at java.util.concurrent.locks.AbstractQueuedSynchronizer.doAcquireSharedNanos(AbstractQueuedSynchronizer.java:1039)
   [junit4]   2> 	at java.util.concurrent.locks.AbstractQueuedSynchronizer.tryAcquireSharedNanos(AbstractQueuedSynchronizer.java:1328)
   [junit4]   2> 	at java.util.concurrent.CountDownLatch.await(CountDownLatch.java:277)
   [junit4]   2> 	at org.apache.curator.CuratorZookeeperClient.internalBlockUntilConnectedOrTimedOut(CuratorZookeeperClient.java:323)
   [junit4]   2> 	at org.apache.curator.RetryLoop.callWithRetry(RetryLoop.java:105)
   [junit4]   2> 	at org.apache.curator.framework.imps.GetDataBuilderImpl.pathInForeground(GetDataBuilderImpl.java:288)
   [junit4]   2> 	at org.apache.curator.framework.imps.GetDataBuilderImpl.forPath(GetDataBuilderImpl.java:279)
   [junit4]   2> 	at org.apache.curator.framework.imps.GetDataBuilderImpl.forPath(GetDataBuilderImpl.java:41)
   [junit4]   2> 	at org.apache.curator.framework.recipes.shared.SharedValue.readValue(SharedValue.java:244)
   [junit4]   2> 	at org.apache.curator.framework.recipes.shared.SharedValue.access$100(SharedValue.java:44)
   [junit4]   2> 	at org.apache.curator.framework.recipes.shared.SharedValue$1.process(SharedValue.java:61)
   [junit4]   2> 	at org.apache.curator.framework.imps.NamespaceWatcher.process(NamespaceWatcher.java:67)
   [junit4]   2> 	at org.apache.zookeeper.ClientCnxn$EventThread.processEvent(ClientCnxn.java:530)
   [junit4]   2> 	at org.apache.zookeeper.ClientCnxn$EventThread.run(ClientCnxn.java:505)
   [junit4]   2> Oct 04, 2017 8:04:31 AM com.carrotsearch.randomizedtesting.ThreadLeakControl tryToInterruptAll
   [junit4]   2> INFO: All leaked threads terminated.
   [junit4]   2> NOTE: test params are: codec=CheapBastard, sim=RandomSimilarity(queryNorm=false): {}, locale=en-GB, timezone=Pacific/Nauru
   [junit4]   2> NOTE: Linux 4.10.0-33-generic amd64/Oracle Corporation 1.8.0_144 (64-bit)/cpus=8,threads=1,free=252103744,total=536870912
   [junit4]   2> NOTE: All tests run in this JVM: [TestCloudSearcherWarming, TestPivotHelperCode, TestFuzzyAnalyzedSuggestions, TestBM25SimilarityFactory, RemoteQueryErrorTest, TemplateUpdateProcessorTest, LeaderElectionContextKeyTest, TestInPlaceUpdatesStandalone, JvmMetricsTest, TestStressLiveNodes, DocValuesMultiTest, TestMissingGroups, ClassificationUpdateProcessorFactoryTest, TestManagedSchema, DistributedTermsComponentTest, TestJsonFacets, AnalyticsQueryTest, CloneFieldUpdateProcessorFactoryTest, TestFieldCacheSort, TestPullReplica, SolrGangliaReporterTest, TestExactStatsCache, AsyncCallRequestStatusResponseTest, TestBinaryResponseWriter, QueryResultKeyTest, OutOfBoxZkACLAndCredentialsProvidersTest, TestPostingsSolrHighlighter, ConvertedLegacyTest, TestStressRecovery, TestDefaultStatsCache, ExplicitHLLTest, TestSolrConfigHandlerCloud, InfixSuggestersTest, SharedFSAutoReplicaFailoverUtilsTest, ShardRoutingTest, TestDistributedStatsComponentCardinality, TestHdfsCloudBackupRestore, TestIntervalFaceting, TestManagedSynonymFilterFactory, TestBulkSchemaAPI, JsonLoaderTest, CollectionReloadTest, BlockJoinFacetRandomTest, TestCloudPivotFacet, TestAtomicUpdateErrorCases, SoftAutoCommitTest, CachingDirectoryFactoryTest, QueryParsingTest, TestAddFieldRealTimeGet, ConjunctionSolrSpellCheckerTest, DirectSolrSpellCheckerTest, UninvertDocValuesMergePolicyTest, TestLRUCache, TestPKIAuthenticationPlugin, OverseerModifyCollectionTest, TestSolrCloudSnapshots, TestStressVersions, SpatialFilterTest, TestSizeLimitedDistributedMap, TestJettySolrRunner, SimpleMLTQParserTest, HLLUtilTest, TestXIncludeConfig, OverseerTaskQueueTest, StressHdfsTest, BadComponentTest, TestObjectReleaseTracker, TestGeoJSONResponseWriter, HdfsTlogReplayBufferedWhileIndexingTest, SolrShardReporterTest, TestSearcherReuse, TestNumericTerms64, TestHighFrequencyDictionaryFactory, RestartWhileUpdatingTest, SOLR749Test, TestTestInjection, TestNonDefinedSimilarityFactory, CdcrReplicationDistributedZkTest, ResourceLoaderTest, DeleteStatusTest, TestReRankQParserPlugin, TestMiniSolrCloudClusterSSL, TestDistribDocBasedVersion, MissingSegmentRecoveryTest, SystemInfoHandlerTest, TestSimpleTextCodec, TestRequestForwarding, TestCollectionAPIs, ParsingFieldUpdateProcessorsTest, TestSimpleTrackingShardHandler, TestSolrJ, ShardRoutingCustomTest, LukeRequestHandlerTest, ZkCLITest, TestDocTermOrds, TestSerializedLuceneMatchVersion, AlternateDirectoryTest, SpatialHeatmapFacetsTest, SpellCheckComponentTest, TestHdfsBackupRestoreCore, TermVectorComponentTest, ConfigSetsAPITest, TestXmlQParser, DistributedIntervalFacetingTest, TestRTGBase, TestExceedMaxTermLength, TestNumericRangeQuery64, AnalysisErrorHandlingTest, TestCoreContainer, SampleTest, DirectoryFactoryTest, TestCharFilters, TestDelegationWithHadoopAuth, TestQueryTypes, TestSortByMinMaxFunction, NoCacheHeaderTest, TestSweetSpotSimilarityFactory, MergeStrategyTest, CoreAdminRequestStatusTest, StatelessScriptUpdateProcessorFactoryTest, TestNRTOpen, AnalysisAfterCoreReloadTest, ChaosMonkeySafeLeaderTest, UnloadDistributedZkTest, SyncSliceTest, LeaderElectionIntegrationTest, BasicZkTest, RecoveryZkTest, ZkSolrClientTest, TestRangeQuery, TestAnalyzedSuggestions, BinaryUpdateRequestHandlerTest, TestPHPSerializedResponseWriter, SearchHandlerTest, HighlighterConfigTest, TestSolrIndexConfig, TestDocSet, TestSearchPerf, NumericFieldsTest, MinimalSchemaTest, TestElisionMultitermQuery, ExternalFileFieldSortTest, DirectSolrConnectionTest, TestLuceneMatchVersion, SynonymTokenizerTest, EchoParamsTest, TestDFRSimilarityFactory, TestPerFieldSimilarity, TimeZoneUtilsTest, TestFastOutputStream, ScriptEngineTest, TestFastLRUCache, DateMathParserTest, ChaosMonkeyNothingIsSafeTest, BaseCdcrDistributedZkTest, CdcrBootstrapTest, CollectionTooManyReplicasTest, CollectionsAPISolrJTest, DeleteLastCustomShardedReplicaTest, DeleteShardTest, DistribJoinFromCollectionTest, DistributedQueueTest, DocValuesNotIndexedTest, ForceLeaderTest, LeaderInitiatedRecoveryOnShardRestartTest, MoveReplicaHDFSTest, OverseerStatusTest, PeerSyncReplicationTest, SaslZkACLProviderTest, SharedFSAutoReplicaFailoverTest, SimpleCollectionCreateDeleteTest, SolrCLIZkUtilsTest, SolrCloudExampleTest, TestCloudDeleteByQuery, TestCloudPseudoReturnFields, TestCloudRecovery, TestCollectionAPI, TestCollectionsAPIViaSolrCloudCluster, TestConfigSetsAPI, TestPullReplicaErrorHandling, TestRandomRequestDistribution, TestSolrCloudWithKerberosAlt, TestSolrCloudWithSecureImpersonation, TestTolerantUpdateProcessorCloud, TestTolerantUpdateProcessorRandomCloud, VMParamsZkACLAndCredentialsProvidersTest, HdfsBasicDistributedZkTest, HdfsChaosMonkeyNothingIsSafeTest, HdfsCollectionsAPIDistributedZkTest, HdfsNNFailoverTest, HdfsRecoveryZkTest, CoreSorterTest, ExitableDirectoryReaderTest, TestBackupRepositoryFactory, TestConfigOverlay, TestConfigSetImmutable, TestConfigSetProperties, TestCorePropertiesReload, TestCustomStream, RequestLoggingTest, SearchHandlerTest, TestBlobHandler, TestSQLHandlerNonCloud, V2ApiIntegrationTest, DistributedFacetPivotSmallAdvancedTest, DistributedFacetPivotWhiteBoxTest, DistributedSuggestComponentTest, SolrJmxReporterTest, TestMacroExpander, TestMacros, JSONWriterTest, TestCustomDocTransformer, TestGraphMLResponseWriter, TestRawResponseWriter, TestManagedResource, TestManagedResourceStorage, TestDynamicFieldCollectionResource, TestFieldTypeCollectionResource, TestSchemaVersionResource, TestManagedStopFilterFactory, DocValuesMissingTest, SpatialRPTFieldTypeTest, TestCollationFieldDocValues, TestPointFields, AnalyticsMergeStrategyTest, LargeFieldTest, SortSpecParsingTest, TestCollapseQParserPlugin, TestComplexPhraseQParserPlugin, TestFieldSortValues, TestFilteredDocIdSet, TestGraphTermsQParserPlugin, TestInitQParser, TestMultiWordSynonyms, TestOverriddenPrefixQueryForCustomFieldType, TestQueryWrapperFilter, TestRandomCollapseQParserPlugin, TestImpersonationWithHadoopAuth]
   [junit4]   2> NOTE: reproduce with: ant test  -Dtestcase=TestImpersonationWithHadoopAuth -Dtests.seed=1C9A0069B95234A -Dtests.multiplier=3 -Dtests.slow=true -Dtests.locale=en-GB -Dtests.timezone=Pacific/Nauru -Dtests.asserts=true -Dtests.file.encoding=UTF-8
   [junit4] ERROR   0.00s J1 | TestImpersonationWithHadoopAuth (suite) <<<
   [junit4]    > Throwable #1: com.carrotsearch.randomizedtesting.ThreadLeakError: 2 threads leaked from SUITE scope at org.apache.solr.security.hadoop.TestImpersonationWithHadoopAuth: 
   [junit4]    >    1) Thread[id=32676, name=jetty-launcher-6160-thread-1-EventThread, state=TIMED_WAITING, group=TGRP-TestImpersonationWithHadoopAuth]
   [junit4]    >         at sun.misc.Unsafe.park(Native Method)
   [junit4]    >         at java.util.concurrent.locks.LockSupport.parkNanos(LockSupport.java:215)
   [junit4]    >         at java.util.concurrent.locks.AbstractQueuedSynchronizer.doAcquireSharedNanos(AbstractQueuedSynchronizer.java:1037)
   [junit4]    >         at java.util.concurrent.locks.AbstractQueuedSynchronizer.tryAcquireSharedNanos(AbstractQueuedSynchronizer.java:1328)
   [junit4]    >         at java.util.concurrent.CountDownLatch.await(CountDownLatch.java:277)
   [junit4]    >         at org.apache.curator.CuratorZookeeperClient.internalBlockUntilConnectedOrTimedOut(CuratorZookeeperClient.java:323)
   [junit4]    >         at org.apache.curator.RetryLoop.callWithRetry(RetryLoop.java:105)
   [junit4]    >         at org.apache.curator.framework.imps.GetDataBuilderImpl.pathInForeground(GetDataBuilderImpl.java:288)
   [junit4]    >         at org.apache.curator.framework.imps.GetDataBuilderImpl.forPath(GetDataBuilderImpl.java:279)
   [junit4]    >         at org.apache.curator.framework.imps.GetDataBuilderImpl.forPath(GetDataBuilderImpl.java:41)
   [junit4]    >         at org.apache.curator.framework.recipes.shared.SharedValue.readValue(SharedValue.java:244)
   [junit4]    >         at org.apache.curator.framework.recipes.shared.SharedValue.access$100(SharedValue.java:44)
   [junit4]    >         at org.apache.curator.framework.recipes.shared.SharedValue$1.process(SharedValue.java:61)
   [junit4]    >         at org.apache.curator.framework.imps.NamespaceWatcher.process(NamespaceWatcher.java:67)
   [junit4]    >         at org.apache.zookeeper.ClientCnxn$EventThread.processEvent(ClientCnxn.java:530)
   [junit4]    >         at org.apache.zookeeper.ClientCnxn$EventThread.run(ClientCnxn.java:505)
   [junit4]    >    2) Thread[id=32666, name=jetty-launcher-6160-thread-2-EventThread, state=TIMED_WAITING, group=TGRP-TestImpersonationWithHadoopAuth]
   [junit4]    >         at sun.misc.Unsafe.park(Native Method)
   [junit4]    >         at java.util.concurrent.locks.LockSupport.parkNanos(LockSupport.java:215)
   [junit4]    >         at java.util.concurrent.locks.AbstractQueuedSynchronizer.doAcquireSharedNanos(AbstractQueuedSynchronizer.java:1037)
   [junit4]    >         at java.util.concurrent.locks.AbstractQueuedSynchronizer.tryAcquireSharedNanos(AbstractQueuedSynchronizer.java:1328)
   [junit4]    >         at java.util.concurrent.CountDownLatch.await(CountDownLatch.java:277)
   [junit4]    >         at org.apache.curator.CuratorZookeeperClient.internalBlockUntilConnectedOrTimedOut(CuratorZookeeperClient.java:323)
   [junit4]    >         at org.apache.curator.RetryLoop.callWithRetry(RetryLoop.java:105)
   [junit4]    >         at org.apache.curator.framework.imps.GetDataBuilderImpl.pathInForeground(GetDataBuilderImpl.java:288)
   [junit4]    >         at org.apache.curator.framework.imps.GetDataBuilderImpl.forPath(GetDataBuilderImpl.java:279)
   [junit4]    >         at org.apache.curator.framework.imps.GetDataBuilderImpl.forPath(GetDataBuilderImpl.java:41)
   [junit4]    >         at org.apache.curator.framework.recipes.shared.SharedValue.readValue(SharedValue.java:244)
   [junit4]    >         at org.apache.curator.framework.recipes.shared.SharedValue.access$100(SharedValue.java:44)
   [junit4]    >         at org.apache.curator.framework.recipes.shared.SharedValue$1.process(SharedValue.java:61)
   [junit4]    >         at org.apache.curator.framework.imps.NamespaceWatcher.process(NamespaceWatcher.java:67)
   [junit4]    >         at org.apache.zookeeper.ClientCnxn$EventThread.processEvent(ClientCnxn.java:530)
   [junit4]    >         at org.apache.zookeeper.ClientCnxn$EventThread.run(ClientCnxn.java:505)
   [junit4]    > 	at __randomizedtesting.SeedInfo.seed([1C9A0069B95234A]:0)
   [junit4] Completed [712/734 (1!)] on J1 in 46.01s, 10 tests, 1 error, 1 skipped <<< FAILURES!

[...truncated 46547 lines...]
-documentation-lint:
    [jtidy] Checking for broken html (such as invalid tags)...
   [delete] Deleting directory /home/jenkins/workspace/Lucene-Solr-7.x-Linux/lucene/build/jtidy_tmp
     [echo] Checking for broken links...
     [exec] 
     [exec] Crawl/parse...
     [exec] 
     [exec] Verify...
     [exec] 
     [exec] file:///home/jenkins/workspace/Lucene-Solr-7.x-Linux/solr/build/docs/quickstart.html
     [exec]   BAD EXTERNAL LINK: https://lucene.apache.org/solr/guide/solr-tutorial.html
     [exec] 
     [exec] Broken javadocs links were found! Common root causes:
     [exec] * A typo of some sort for manually created links.
     [exec] * Public methods referencing non-public classes in their signature.

BUILD FAILED
/home/jenkins/workspace/Lucene-Solr-7.x-Linux/build.xml:826: The following error occurred while executing this line:
/home/jenkins/workspace/Lucene-Solr-7.x-Linux/build.xml:101: The following error occurred while executing this line:
/home/jenkins/workspace/Lucene-Solr-7.x-Linux/solr/build.xml:669: The following error occurred while executing this line:
/home/jenkins/workspace/Lucene-Solr-7.x-Linux/solr/build.xml:682: The following error occurred while executing this line:
/home/jenkins/workspace/Lucene-Solr-7.x-Linux/lucene/common-build.xml:2570: exec returned: 1

Total time: 86 minutes 55 seconds
Build step 'Invoke Ant' marked build as failure
Archiving artifacts
[WARNINGS] Skipping publisher since build result is FAILURE
Recording test results
Email was triggered for: Failure - Any
Sending email for trigger: Failure - Any