You are viewing a plain text version of this content. The canonical link for it is here.
Posted to dev@poi.apache.org by Apache Jenkins Server <je...@builds.apache.org> on 2024/12/15 11:47:47 UTC
Build failed in Jenkins: POI » POI-DSL-1.24 #3
See <https://ci-builds.apache.org/job/POI/job/POI-DSL-1.24/3/display/redirect?page=changes>
Changes:
[Dominik Stadler] Adjust for removed locale provider in JDK 23 and newer
JDK 23 removes the COMPAT/JRE locale provider
which causes some changes to string formatting
Default German data format changed and thus we
need to introduce a custom format.
Also the US format uses some non-breaking spaces now
which we need to handle properly in tests.
------------------------------------------
[...truncated 187.94 KiB...]
[junitlauncher] Tests run: 5, Failures: 0, Aborted: 0, Skipped: 0, Time elapsed: 0.002000 sec
[junitlauncher] Running org.apache.poi.hslf.record.TestComment2000
[junitlauncher]
[junitlauncher] Running org.apache.poi.hslf.record.TestComment2000
[junitlauncher] Tests run: 8, Failures: 0, Aborted: 0, Skipped: 0, Time elapsed: 0.007000 sec
[junitlauncher] Running org.apache.poi.hslf.record.TestComment2000Atom
[junitlauncher]
[junitlauncher] Running org.apache.poi.hslf.record.TestComment2000Atom
[junitlauncher] Tests run: 7, Failures: 0, Aborted: 0, Skipped: 0, Time elapsed: 0.004000 sec
[junitlauncher] Running org.apache.poi.hslf.record.TestCurrentUserAtom
[junitlauncher]
[junitlauncher] Running org.apache.poi.hslf.record.TestCurrentUserAtom
[junitlauncher] Tests run: 3, Failures: 0, Aborted: 0, Skipped: 0, Time elapsed: 0.004000 sec
[junitlauncher] Running org.apache.poi.hslf.record.TestDocument
[junitlauncher]
[junitlauncher] Running org.apache.poi.hslf.record.TestDocument
[junitlauncher] Tests run: 3, Failures: 0, Aborted: 0, Skipped: 0, Time elapsed: 0.005000 sec
[junitlauncher] Running org.apache.poi.hslf.record.TestDocumentAtom
[junitlauncher]
[junitlauncher] Running org.apache.poi.hslf.record.TestDocumentAtom
[junitlauncher] Tests run: 6, Failures: 0, Aborted: 0, Skipped: 0, Time elapsed: 0.003000 sec
[junitlauncher] Running org.apache.poi.hslf.record.TestDocumentEncryption
[junitlauncher]
[junitlauncher] Running org.apache.poi.hslf.record.TestDocumentEncryption
[junitlauncher] Tests run: 7, Failures: 0, Aborted: 0, Skipped: 0, Time elapsed: 0.378000 sec
[junitlauncher] Running org.apache.poi.hslf.record.TestDocumentEncryptionAtom
[junitlauncher]
[junitlauncher] Running org.apache.poi.hslf.record.TestDocumentEncryptionAtom
[junitlauncher] Tests run: 2, Failures: 0, Aborted: 0, Skipped: 0, Time elapsed: 0.001000 sec
[junitlauncher] Running org.apache.poi.hslf.record.TestExControl
[junitlauncher]
[junitlauncher] Running org.apache.poi.hslf.record.TestExControl
[junitlauncher] Tests run: 3, Failures: 0, Aborted: 0, Skipped: 0, Time elapsed: 0.054000 sec
[junitlauncher] Running org.apache.poi.hslf.record.TestExHyperlink
[junitlauncher]
[junitlauncher] Running org.apache.poi.hslf.record.TestExHyperlink
[junitlauncher] Tests run: 2, Failures: 0, Aborted: 0, Skipped: 0, Time elapsed: 0.003000 sec
[junitlauncher] Running org.apache.poi.hslf.record.TestExHyperlinkAtom
[junitlauncher]
[junitlauncher] Running org.apache.poi.hslf.record.TestExHyperlinkAtom
[junitlauncher] Tests run: 5, Failures: 0, Aborted: 0, Skipped: 0, Time elapsed: 0.002000 sec
[junitlauncher] Running org.apache.poi.hslf.record.TestExMediaAtom
[junitlauncher]
[junitlauncher] Running org.apache.poi.hslf.record.TestExMediaAtom
[junitlauncher] Tests run: 4, Failures: 0, Aborted: 0, Skipped: 0, Time elapsed: 0.001000 sec
[junitlauncher] Running org.apache.poi.hslf.record.TestExObjList
[junitlauncher]
[junitlauncher] Running org.apache.poi.hslf.record.TestExObjList
[junitlauncher] Tests run: 1, Failures: 0, Aborted: 0, Skipped: 0, Time elapsed: 0.002000 sec
[junitlauncher] Running org.apache.poi.hslf.record.TestExObjListAtom
[junitlauncher]
[junitlauncher] Running org.apache.poi.hslf.record.TestExObjListAtom
[junitlauncher] Tests run: 5, Failures: 0, Aborted: 0, Skipped: 0, Time elapsed: 0.003000 sec
[junitlauncher] Running org.apache.poi.hslf.record.TestExOleObjAtom
[junitlauncher]
[junitlauncher] Running org.apache.poi.hslf.record.TestExOleObjAtom
[junitlauncher] Tests run: 3, Failures: 0, Aborted: 0, Skipped: 0, Time elapsed: 0.001000 sec
[junitlauncher] Running org.apache.poi.hslf.record.TestExOleObjStg
[junitlauncher]
[junitlauncher] Running org.apache.poi.hslf.record.TestExOleObjStg
[junitlauncher] Tests run: 3, Failures: 0, Aborted: 0, Skipped: 0, Time elapsed: 0.002000 sec
[junitlauncher] Running org.apache.poi.hslf.record.TestExVideoContainer
[junitlauncher]
[junitlauncher] Running org.apache.poi.hslf.record.TestExVideoContainer
[junitlauncher] Tests run: 3, Failures: 0, Aborted: 0, Skipped: 0, Time elapsed: 0.002000 sec
[junitlauncher] Running org.apache.poi.hslf.record.TestFontCollection
[junitlauncher]
[junitlauncher] Running org.apache.poi.hslf.record.TestFontCollection
[junitlauncher] Tests run: 4, Failures: 0, Aborted: 0, Skipped: 0, Time elapsed: 0.025000 sec
[junitlauncher] Running org.apache.poi.hslf.record.TestHeadersFootersAtom
[junitlauncher]
[junitlauncher] Running org.apache.poi.hslf.record.TestHeadersFootersAtom
[junitlauncher] Tests run: 4, Failures: 0, Aborted: 0, Skipped: 0, Time elapsed: 0.002000 sec
[junitlauncher] Running org.apache.poi.hslf.record.TestHeadersFootersContainer
[junitlauncher]
[junitlauncher] Running org.apache.poi.hslf.record.TestHeadersFootersContainer
[junitlauncher] Tests run: 6, Failures: 0, Aborted: 0, Skipped: 0, Time elapsed: 0.002000 sec
[junitlauncher] Running org.apache.poi.hslf.record.TestInteractiveInfo
[junitlauncher]
[junitlauncher] Running org.apache.poi.hslf.record.TestInteractiveInfo
[junitlauncher] Tests run: 4, Failures: 0, Aborted: 0, Skipped: 0, Time elapsed: 0.002000 sec
[junitlauncher] Running org.apache.poi.hslf.record.TestInteractiveInfoAtom
[junitlauncher]
[junitlauncher] Running org.apache.poi.hslf.record.TestInteractiveInfoAtom
[junitlauncher] Tests run: 6, Failures: 0, Aborted: 0, Skipped: 0, Time elapsed: 0.003000 sec
[junitlauncher] Running org.apache.poi.hslf.record.TestNotesAtom
[junitlauncher]
[junitlauncher] Running org.apache.poi.hslf.record.TestNotesAtom
[junitlauncher] Tests run: 3, Failures: 0, Aborted: 0, Skipped: 0, Time elapsed: 0.001000 sec
[junitlauncher] Running org.apache.poi.hslf.record.TestRecordContainer
[junitlauncher]
[junitlauncher] Running org.apache.poi.hslf.record.TestRecordContainer
[junitlauncher] Tests run: 5, Failures: 0, Aborted: 0, Skipped: 0, Time elapsed: 0.007000 sec
[junitlauncher] Running org.apache.poi.hslf.record.TestRecordTypes
[junitlauncher]
[junitlauncher] Running org.apache.poi.hslf.record.TestRecordTypes
[junitlauncher] Tests run: 3, Failures: 0, Aborted: 0, Skipped: 0, Time elapsed: 0.001000 sec
[junitlauncher] Running org.apache.poi.hslf.record.TestSlideAtom
[junitlauncher]
[junitlauncher] Running org.apache.poi.hslf.record.TestSlideAtom
[junitlauncher] Tests run: 5, Failures: 0, Aborted: 0, Skipped: 0, Time elapsed: 0.013000 sec
[junitlauncher] Running org.apache.poi.hslf.record.TestSlidePersistAtom
[junitlauncher]
[junitlauncher] Running org.apache.poi.hslf.record.TestSlidePersistAtom
[junitlauncher] Tests run: 3, Failures: 0, Aborted: 0, Skipped: 0, Time elapsed: 0.001000 sec
[junitlauncher] Running org.apache.poi.hslf.record.TestSound
[junitlauncher]
[junitlauncher] Running org.apache.poi.hslf.record.TestSound
[junitlauncher] Tests run: 1, Failures: 0, Aborted: 0, Skipped: 0, Time elapsed: 0.022000 sec
[junitlauncher] Running org.apache.poi.hslf.record.TestStyleTextPropAtom
[junitlauncher]
[junitlauncher] Running org.apache.poi.hslf.record.TestStyleTextPropAtom
[junitlauncher] Tests run: 20, Failures: 0, Aborted: 0, Skipped: 0, Time elapsed: 0.007000 sec
[junitlauncher] Running org.apache.poi.hslf.record.TestTextBytesAtom
[junitlauncher]
[junitlauncher] Running org.apache.poi.hslf.record.TestTextBytesAtom
[junitlauncher] Tests run: 5, Failures: 0, Aborted: 0, Skipped: 0, Time elapsed: 0.002000 sec
[junitlauncher] Running org.apache.poi.hslf.record.TestTextCharsAtom
[junitlauncher]
[junitlauncher] Running org.apache.poi.hslf.record.TestTextCharsAtom
[junitlauncher] Tests run: 6, Failures: 0, Aborted: 0, Skipped: 0, Time elapsed: 0.002000 sec
[junitlauncher] Running org.apache.poi.hslf.record.TestTextHeaderAtom
[junitlauncher]
[junitlauncher] Running org.apache.poi.hslf.record.TestTextHeaderAtom
[junitlauncher] Tests run: 3, Failures: 0, Aborted: 0, Skipped: 0, Time elapsed: 0.001000 sec
[junitlauncher] Running org.apache.poi.hslf.record.TestTextRulerAtom
[junitlauncher]
[junitlauncher] Running org.apache.poi.hslf.record.TestTextRulerAtom
[junitlauncher] Tests run: 3, Failures: 0, Aborted: 0, Skipped: 0, Time elapsed: 0.001000 sec
[junitlauncher] Running org.apache.poi.hslf.record.TestTextSpecInfoAtom
[junitlauncher]
[junitlauncher] Running org.apache.poi.hslf.record.TestTextSpecInfoAtom
[junitlauncher] Tests run: 3, Failures: 0, Aborted: 0, Skipped: 0, Time elapsed: 0.003000 sec
[junitlauncher] Running org.apache.poi.hslf.record.TestTxInteractiveInfoAtom
[junitlauncher]
[junitlauncher] Running org.apache.poi.hslf.record.TestTxInteractiveInfoAtom
[junitlauncher] Tests run: 4, Failures: 0, Aborted: 0, Skipped: 0, Time elapsed: 0.001000 sec
[junitlauncher] Running org.apache.poi.hslf.record.TestTxMasterStyleAtom
[junitlauncher]
[junitlauncher] Running org.apache.poi.hslf.record.TestTxMasterStyleAtom
[junitlauncher] Tests run: 1, Failures: 0, Aborted: 0, Skipped: 0, Time elapsed: 0.002000 sec
[junitlauncher] Running org.apache.poi.hslf.record.TestUserEditAtom
[junitlauncher]
[junitlauncher] Running org.apache.poi.hslf.record.TestUserEditAtom
[junitlauncher] Tests run: 3, Failures: 0, Aborted: 0, Skipped: 0, Time elapsed: 0.001000 sec
[junitlauncher] Running org.apache.poi.hslf.usermodel.TestAddingSlides
[junitlauncher]
[junitlauncher] Running org.apache.poi.hslf.usermodel.TestAddingSlides
[junitlauncher] Tests run: 5, Failures: 0, Aborted: 0, Skipped: 0, Time elapsed: 0.093000 sec
[junitlauncher] Running org.apache.poi.hslf.usermodel.TestBackground
[junitlauncher]
[junitlauncher] Running org.apache.poi.hslf.usermodel.TestBackground
[junitlauncher] Tests run: 3, Failures: 0, Aborted: 0, Skipped: 0, Time elapsed: 0.015000 sec
[junitlauncher] Running org.apache.poi.hslf.usermodel.TestBugs
[junitlauncher]
[junitlauncher] Running org.apache.poi.hslf.usermodel.TestBugs
[junitlauncher] Tests run: 46, Failures: 0, Aborted: 0, Skipped: 0, Time elapsed: 1.548000 sec
[junitlauncher] Running org.apache.poi.hslf.usermodel.TestCounts
[junitlauncher]
[junitlauncher] Running org.apache.poi.hslf.usermodel.TestCounts
[junitlauncher] Tests run: 2, Failures: 0, Aborted: 0, Skipped: 0, Time elapsed: 0.003000 sec
[junitlauncher] Running org.apache.poi.hslf.usermodel.TestFontRendering
[junitlauncher]
[junitlauncher] Running org.apache.poi.hslf.usermodel.TestFontRendering
[junitlauncher] Aborted: bug55902mixedFontWithChineseCharacters(): org.opentest4j.TestAbortedException: Assumption failed: necessary font file Cabin-Regular.ttf not downloaded.
[junitlauncher] Tests run: 1, Failures: 0, Aborted: 1, Skipped: 0, Time elapsed: 0.011000 sec
[junitlauncher] Running org.apache.poi.hslf.usermodel.TestHSLFSlideShow
[junitlauncher]
[junitlauncher] Running org.apache.poi.hslf.usermodel.TestHSLFSlideShow
[junitlauncher] Tests run: 9, Failures: 0, Aborted: 0, Skipped: 0, Time elapsed: 0.060000 sec
[junitlauncher] Running org.apache.poi.hslf.usermodel.TestHSLFSlideShowFactory
[junitlauncher]
[junitlauncher] Running org.apache.poi.hslf.usermodel.TestHSLFSlideShowFactory
[junitlauncher] Tests run: 2, Failures: 0, Aborted: 0, Skipped: 0, Time elapsed: 0.014000 sec
[junitlauncher] Running org.apache.poi.hslf.usermodel.TestMostRecentRecords
[junitlauncher]
[junitlauncher] Running org.apache.poi.hslf.usermodel.TestMostRecentRecords
[junitlauncher] Tests run: 3, Failures: 0, Aborted: 0, Skipped: 0, Time elapsed: 0.003000 sec
[junitlauncher] Running org.apache.poi.hslf.usermodel.TestNotesText
[junitlauncher]
[junitlauncher] Running org.apache.poi.hslf.usermodel.TestNotesText
[junitlauncher] Tests run: 2, Failures: 0, Aborted: 0, Skipped: 0, Time elapsed: 0.004000 sec
[junitlauncher] Running org.apache.poi.hslf.usermodel.TestNumberedList
[junitlauncher]
[junitlauncher] Running org.apache.poi.hslf.usermodel.TestNumberedList
[junitlauncher] Tests run: 1, Failures: 0, Aborted: 0, Skipped: 0, Time elapsed: 0.003000 sec
[junitlauncher] Running org.apache.poi.hslf.usermodel.TestNumberedList2
[junitlauncher]
[junitlauncher] Running org.apache.poi.hslf.usermodel.TestNumberedList2
[junitlauncher] Tests run: 1, Failures: 0, Aborted: 0, Skipped: 0, Time elapsed: 0.012000 sec
[junitlauncher] Running org.apache.poi.hslf.usermodel.TestNumberedList3
[junitlauncher]
[junitlauncher] Running org.apache.poi.hslf.usermodel.TestNumberedList3
[junitlauncher] Tests run: 1, Failures: 0, Aborted: 0, Skipped: 0, Time elapsed: 0.006000 sec
[junitlauncher] Running org.apache.poi.hslf.usermodel.TestPicture
[junitlauncher]
[junitlauncher] Running org.apache.poi.hslf.usermodel.TestPicture
[junitlauncher] Tests run: 3, Failures: 0, Aborted: 0, Skipped: 0, Time elapsed: 0.133000 sec
[junitlauncher] Running org.apache.poi.hslf.usermodel.TestPictures
[junitlauncher]
[junitlauncher] Running org.apache.poi.hslf.usermodel.TestPictures
[junitlauncher] Tests run: 18, Failures: 0, Aborted: 0, Skipped: 1, Time elapsed: 0.192000 sec
[junitlauncher] Running org.apache.poi.hslf.usermodel.TestReOrderingSlides
[junitlauncher]
[junitlauncher] Running org.apache.poi.hslf.usermodel.TestReOrderingSlides
[junitlauncher] Tests run: 5, Failures: 0, Aborted: 0, Skipped: 0, Time elapsed: 0.027000 sec
[junitlauncher] Running org.apache.poi.hslf.usermodel.TestRecordSetup
[junitlauncher]
[junitlauncher] Running org.apache.poi.hslf.usermodel.TestRecordSetup
[junitlauncher] Tests run: 1, Failures: 0, Aborted: 0, Skipped: 0, Time elapsed: 0.002000 sec
[junitlauncher] Running org.apache.poi.hslf.usermodel.TestRichTextRun
[junitlauncher]
[junitlauncher] Running org.apache.poi.hslf.usermodel.TestRichTextRun
[junitlauncher] Tests run: 11, Failures: 0, Aborted: 0, Skipped: 0, Time elapsed: 0.288000 sec
[junitlauncher] Running org.apache.poi.hslf.usermodel.TestSheetText
[junitlauncher]
[junitlauncher] Running org.apache.poi.hslf.usermodel.TestSheetText
[junitlauncher] Tests run: 1, Failures: 0, Aborted: 0, Skipped: 0, Time elapsed: 0.002000 sec
[junitlauncher] Running org.apache.poi.hslf.usermodel.TestSlideOrdering
[junitlauncher]
[junitlauncher] Running org.apache.poi.hslf.usermodel.TestSlideOrdering
[junitlauncher] Tests run: 3, Failures: 0, Aborted: 0, Skipped: 0, Time elapsed: 0.011000 sec
[junitlauncher] Running org.apache.poi.hslf.usermodel.TestSoundData
[junitlauncher]
[junitlauncher] Running org.apache.poi.hslf.usermodel.TestSoundData
[junitlauncher] Tests run: 1, Failures: 0, Aborted: 0, Skipped: 0, Time elapsed: 0.002000 sec
[junitlauncher] Running org.apache.poi.hslf.usermodel.TestTable
[junitlauncher]
[junitlauncher] Running org.apache.poi.hslf.usermodel.TestTable
[junitlauncher] Tests run: 3, Failures: 0, Aborted: 0, Skipped: 0, Time elapsed: 0.021000 sec
[junitlauncher] Running org.apache.poi.hslf.usermodel.TestTextRun
[junitlauncher]
[junitlauncher] Running org.apache.poi.hslf.usermodel.TestTextRun
[junitlauncher] Failed: datetimeFormats(): org.opentest4j.AssertionFailedError: While handling local de_DE ==> array contents differ at index [1], expected: <Sonntag, 4. März 2012> but was: <Sonntag, März 4, 2012>
[junitlauncher] Tests run: 15, Failures: 1, Aborted: 0, Skipped: 0, Time elapsed: 0.184000 sec
BUILD FAILED
<https://ci-builds.apache.org/job/POI/job/POI-DSL-1.24/ws/build.xml>:1749: The following error occurred while executing this line:
<https://ci-builds.apache.org/job/POI/job/POI-DSL-1.24/ws/build.xml>:1387: Some test(s) have failure(s)
Total time: 6 minutes 22 seconds
Build step 'Invoke Ant' marked build as failure
ERROR: Not all environment variables could be successfully injected. Check for similarly-named environment variables.
Archiving artifacts
ERROR: Not all environment variables could be successfully injected. Check for similarly-named environment variables.
Recording test results
ERROR: Not all environment variables could be successfully injected. Check for similarly-named environment variables.
[Checks API] No suitable checks publisher found.
ERROR: Not all environment variables could be successfully injected. Check for similarly-named environment variables.
---------------------------------------------------------------------
To unsubscribe, e-mail: dev-unsubscribe@poi.apache.org
For additional commands, e-mail: dev-help@poi.apache.org
Build failed in Jenkins: POI » POI-DSL-1.24 #5
Posted by Apache Jenkins Server <je...@builds.apache.org>.
See <https://ci-builds.apache.org/job/POI/job/POI-DSL-1.24/5/display/redirect?page=changes>
Changes:
[PJ Fanning] use downloads.apache.org
------------------------------------------
[...truncated 9.38 MiB...]
[spotbugs] At edu.umd.cs.findbugs.FindBugs2.execute(FindBugs2.java:252)
[spotbugs] At edu.umd.cs.findbugs.FindBugs.runMain(FindBugs.java:395)
[spotbugs] At edu.umd.cs.findbugs.FindBugs2.main(FindBugs2.java:1231)
[spotbugs] Couldn't get class info for java/util/regex/MatchResult
[spotbugs] java.lang.IllegalArgumentException: Unsupported class file major version 68
[spotbugs] At org.objectweb.asm.ClassReader.<init>(ClassReader.java:200)
[spotbugs] At org.objectweb.asm.ClassReader.<init>(ClassReader.java:180)
[spotbugs] At org.objectweb.asm.ClassReader.<init>(ClassReader.java:166)
[spotbugs] At edu.umd.cs.findbugs.asm.FBClassReader.<init>(FBClassReader.java:35)
[spotbugs] At edu.umd.cs.findbugs.classfile.engine.asm.ClassReaderAnalysisEngine.analyze(ClassReaderAnalysisEngine.java:48)
[spotbugs] At edu.umd.cs.findbugs.classfile.engine.asm.ClassReaderAnalysisEngine.analyze(ClassReaderAnalysisEngine.java:34)
[spotbugs] At edu.umd.cs.findbugs.classfile.impl.AnalysisCache.getClassAnalysis(AnalysisCache.java:261)
[spotbugs] At edu.umd.cs.findbugs.classfile.engine.ClassInfoAnalysisEngine.analyze(ClassInfoAnalysisEngine.java:75)
[spotbugs] At edu.umd.cs.findbugs.classfile.engine.ClassInfoAnalysisEngine.analyze(ClassInfoAnalysisEngine.java:38)
[spotbugs] At edu.umd.cs.findbugs.classfile.impl.AnalysisCache.getClassAnalysis(AnalysisCache.java:261)
[spotbugs] At edu.umd.cs.findbugs.ba.XFactory.getXClass(XFactory.java:693)
[spotbugs] At edu.umd.cs.findbugs.ba.AnalysisContext.setAppClassList(AnalysisContext.java:975)
[spotbugs] At edu.umd.cs.findbugs.FindBugs2.setAppClassList(FindBugs2.java:909)
[spotbugs] At edu.umd.cs.findbugs.FindBugs2.execute(FindBugs2.java:252)
[spotbugs] At edu.umd.cs.findbugs.FindBugs.runMain(FindBugs.java:395)
[spotbugs] At edu.umd.cs.findbugs.FindBugs2.main(FindBugs2.java:1231)
[spotbugs] Couldn't get class info for javax/xml/crypto/dsig/spec/SignatureMethodParameterSpec
[spotbugs] java.lang.IllegalArgumentException: Unsupported class file major version 68
[spotbugs] At org.objectweb.asm.ClassReader.<init>(ClassReader.java:200)
[spotbugs] At org.objectweb.asm.ClassReader.<init>(ClassReader.java:180)
[spotbugs] At org.objectweb.asm.ClassReader.<init>(ClassReader.java:166)
[spotbugs] At edu.umd.cs.findbugs.asm.FBClassReader.<init>(FBClassReader.java:35)
[spotbugs] At edu.umd.cs.findbugs.classfile.engine.asm.ClassReaderAnalysisEngine.analyze(ClassReaderAnalysisEngine.java:48)
[spotbugs] At edu.umd.cs.findbugs.classfile.engine.asm.ClassReaderAnalysisEngine.analyze(ClassReaderAnalysisEngine.java:34)
[spotbugs] At edu.umd.cs.findbugs.classfile.impl.AnalysisCache.getClassAnalysis(AnalysisCache.java:261)
[spotbugs] At edu.umd.cs.findbugs.classfile.engine.ClassInfoAnalysisEngine.analyze(ClassInfoAnalysisEngine.java:75)
[spotbugs] At edu.umd.cs.findbugs.classfile.engine.ClassInfoAnalysisEngine.analyze(ClassInfoAnalysisEngine.java:38)
[spotbugs] At edu.umd.cs.findbugs.classfile.impl.AnalysisCache.getClassAnalysis(AnalysisCache.java:261)
[spotbugs] At edu.umd.cs.findbugs.ba.XFactory.getXClass(XFactory.java:693)
[spotbugs] At edu.umd.cs.findbugs.ba.AnalysisContext.setAppClassList(AnalysisContext.java:975)
[spotbugs] At edu.umd.cs.findbugs.FindBugs2.setAppClassList(FindBugs2.java:909)
[spotbugs] At edu.umd.cs.findbugs.FindBugs2.execute(FindBugs2.java:252)
[spotbugs] At edu.umd.cs.findbugs.FindBugs.runMain(FindBugs.java:395)
[spotbugs] At edu.umd.cs.findbugs.FindBugs2.main(FindBugs2.java:1231)
[spotbugs] Couldn't get class info for java/util/Random
[spotbugs] java.lang.IllegalArgumentException: Unsupported class file major version 68
[spotbugs] At org.objectweb.asm.ClassReader.<init>(ClassReader.java:200)
[spotbugs] At org.objectweb.asm.ClassReader.<init>(ClassReader.java:180)
[spotbugs] At org.objectweb.asm.ClassReader.<init>(ClassReader.java:166)
[spotbugs] At edu.umd.cs.findbugs.asm.FBClassReader.<init>(FBClassReader.java:35)
[spotbugs] At edu.umd.cs.findbugs.classfile.engine.asm.ClassReaderAnalysisEngine.analyze(ClassReaderAnalysisEngine.java:48)
[spotbugs] At edu.umd.cs.findbugs.classfile.engine.asm.ClassReaderAnalysisEngine.analyze(ClassReaderAnalysisEngine.java:34)
[spotbugs] At edu.umd.cs.findbugs.classfile.impl.AnalysisCache.getClassAnalysis(AnalysisCache.java:261)
[spotbugs] At edu.umd.cs.findbugs.classfile.engine.ClassInfoAnalysisEngine.analyze(ClassInfoAnalysisEngine.java:75)
[spotbugs] At edu.umd.cs.findbugs.classfile.engine.ClassInfoAnalysisEngine.analyze(ClassInfoAnalysisEngine.java:38)
[spotbugs] At edu.umd.cs.findbugs.classfile.impl.AnalysisCache.getClassAnalysis(AnalysisCache.java:261)
[spotbugs] At edu.umd.cs.findbugs.ba.XFactory.getXClass(XFactory.java:693)
[spotbugs] At edu.umd.cs.findbugs.ba.AnalysisContext.setAppClassList(AnalysisContext.java:975)
[spotbugs] At edu.umd.cs.findbugs.FindBugs2.setAppClassList(FindBugs2.java:909)
[spotbugs] At edu.umd.cs.findbugs.FindBugs2.execute(FindBugs2.java:252)
[spotbugs] At edu.umd.cs.findbugs.FindBugs.runMain(FindBugs.java:395)
[spotbugs] At edu.umd.cs.findbugs.FindBugs2.main(FindBugs2.java:1231)
[spotbugs] Couldn't get class info for java/nio/file/attribute/BasicFileAttributes
[spotbugs] java.lang.IllegalArgumentException: Unsupported class file major version 68
[spotbugs] At org.objectweb.asm.ClassReader.<init>(ClassReader.java:200)
[spotbugs] At org.objectweb.asm.ClassReader.<init>(ClassReader.java:180)
[spotbugs] At org.objectweb.asm.ClassReader.<init>(ClassReader.java:166)
[spotbugs] At edu.umd.cs.findbugs.asm.FBClassReader.<init>(FBClassReader.java:35)
[spotbugs] At edu.umd.cs.findbugs.classfile.engine.asm.ClassReaderAnalysisEngine.analyze(ClassReaderAnalysisEngine.java:48)
[spotbugs] At edu.umd.cs.findbugs.classfile.engine.asm.ClassReaderAnalysisEngine.analyze(ClassReaderAnalysisEngine.java:34)
[spotbugs] At edu.umd.cs.findbugs.classfile.impl.AnalysisCache.getClassAnalysis(AnalysisCache.java:261)
[spotbugs] At edu.umd.cs.findbugs.classfile.engine.ClassInfoAnalysisEngine.analyze(ClassInfoAnalysisEngine.java:75)
[spotbugs] At edu.umd.cs.findbugs.classfile.engine.ClassInfoAnalysisEngine.analyze(ClassInfoAnalysisEngine.java:38)
[spotbugs] At edu.umd.cs.findbugs.classfile.impl.AnalysisCache.getClassAnalysis(AnalysisCache.java:261)
[spotbugs] At edu.umd.cs.findbugs.ba.XFactory.getXClass(XFactory.java:693)
[spotbugs] At edu.umd.cs.findbugs.ba.AnalysisContext.setAppClassList(AnalysisContext.java:975)
[spotbugs] At edu.umd.cs.findbugs.FindBugs2.setAppClassList(FindBugs2.java:909)
[spotbugs] At edu.umd.cs.findbugs.FindBugs2.execute(FindBugs2.java:252)
[spotbugs] At edu.umd.cs.findbugs.FindBugs.runMain(FindBugs.java:395)
[spotbugs] At edu.umd.cs.findbugs.FindBugs2.main(FindBugs2.java:1231)
[spotbugs] Couldn't get class info for java/util/Locale
[spotbugs] java.lang.IllegalArgumentException: Unsupported class file major version 68
[spotbugs] At org.objectweb.asm.ClassReader.<init>(ClassReader.java:200)
[spotbugs] At org.objectweb.asm.ClassReader.<init>(ClassReader.java:180)
[spotbugs] At org.objectweb.asm.ClassReader.<init>(ClassReader.java:166)
[spotbugs] At edu.umd.cs.findbugs.asm.FBClassReader.<init>(FBClassReader.java:35)
[spotbugs] At edu.umd.cs.findbugs.classfile.engine.asm.ClassReaderAnalysisEngine.analyze(ClassReaderAnalysisEngine.java:48)
[spotbugs] At edu.umd.cs.findbugs.classfile.engine.asm.ClassReaderAnalysisEngine.analyze(ClassReaderAnalysisEngine.java:34)
[spotbugs] At edu.umd.cs.findbugs.classfile.impl.AnalysisCache.getClassAnalysis(AnalysisCache.java:261)
[spotbugs] At edu.umd.cs.findbugs.classfile.engine.ClassInfoAnalysisEngine.analyze(ClassInfoAnalysisEngine.java:75)
[spotbugs] At edu.umd.cs.findbugs.classfile.engine.ClassInfoAnalysisEngine.analyze(ClassInfoAnalysisEngine.java:38)
[spotbugs] At edu.umd.cs.findbugs.classfile.impl.AnalysisCache.getClassAnalysis(AnalysisCache.java:261)
[spotbugs] At edu.umd.cs.findbugs.ba.XFactory.getXClass(XFactory.java:693)
[spotbugs] At edu.umd.cs.findbugs.ba.AnalysisContext.setAppClassList(AnalysisContext.java:975)
[spotbugs] At edu.umd.cs.findbugs.FindBugs2.setAppClassList(FindBugs2.java:909)
[spotbugs] At edu.umd.cs.findbugs.FindBugs2.execute(FindBugs2.java:252)
[spotbugs] At edu.umd.cs.findbugs.FindBugs.runMain(FindBugs.java:395)
[spotbugs] At edu.umd.cs.findbugs.FindBugs2.main(FindBugs2.java:1231)
[spotbugs] Couldn't get class info for java/util/zip/Deflater
[spotbugs] java.lang.IllegalArgumentException: Unsupported class file major version 68
[spotbugs] At org.objectweb.asm.ClassReader.<init>(ClassReader.java:200)
[spotbugs] At org.objectweb.asm.ClassReader.<init>(ClassReader.java:180)
[spotbugs] At org.objectweb.asm.ClassReader.<init>(ClassReader.java:166)
[spotbugs] At edu.umd.cs.findbugs.asm.FBClassReader.<init>(FBClassReader.java:35)
[spotbugs] At edu.umd.cs.findbugs.classfile.engine.asm.ClassReaderAnalysisEngine.analyze(ClassReaderAnalysisEngine.java:48)
[spotbugs] At edu.umd.cs.findbugs.classfile.engine.asm.ClassReaderAnalysisEngine.analyze(ClassReaderAnalysisEngine.java:34)
[spotbugs] At edu.umd.cs.findbugs.classfile.impl.AnalysisCache.getClassAnalysis(AnalysisCache.java:261)
[spotbugs] At edu.umd.cs.findbugs.classfile.engine.ClassInfoAnalysisEngine.analyze(ClassInfoAnalysisEngine.java:75)
[spotbugs] At edu.umd.cs.findbugs.classfile.engine.ClassInfoAnalysisEngine.analyze(ClassInfoAnalysisEngine.java:38)
[spotbugs] At edu.umd.cs.findbugs.classfile.impl.AnalysisCache.getClassAnalysis(AnalysisCache.java:261)
[spotbugs] At edu.umd.cs.findbugs.ba.XFactory.getXClass(XFactory.java:693)
[spotbugs] At edu.umd.cs.findbugs.ba.AnalysisContext.setAppClassList(AnalysisContext.java:975)
[spotbugs] At edu.umd.cs.findbugs.FindBugs2.setAppClassList(FindBugs2.java:909)
[spotbugs] At edu.umd.cs.findbugs.FindBugs2.execute(FindBugs2.java:252)
[spotbugs] At edu.umd.cs.findbugs.FindBugs.runMain(FindBugs.java:395)
[spotbugs] At edu.umd.cs.findbugs.FindBugs2.main(FindBugs2.java:1231)
[spotbugs] Couldn't get class info for java/lang/AssertionError
[spotbugs] java.lang.IllegalArgumentException: Unsupported class file major version 68
[spotbugs] At org.objectweb.asm.ClassReader.<init>(ClassReader.java:200)
[spotbugs] At org.objectweb.asm.ClassReader.<init>(ClassReader.java:180)
[spotbugs] At org.objectweb.asm.ClassReader.<init>(ClassReader.java:166)
[spotbugs] At edu.umd.cs.findbugs.asm.FBClassReader.<init>(FBClassReader.java:35)
[spotbugs] At edu.umd.cs.findbugs.classfile.engine.asm.ClassReaderAnalysisEngine.analyze(ClassReaderAnalysisEngine.java:48)
[spotbugs] At edu.umd.cs.findbugs.classfile.engine.asm.ClassReaderAnalysisEngine.analyze(ClassReaderAnalysisEngine.java:34)
[spotbugs] At edu.umd.cs.findbugs.classfile.impl.AnalysisCache.getClassAnalysis(AnalysisCache.java:261)
[spotbugs] At edu.umd.cs.findbugs.classfile.engine.ClassInfoAnalysisEngine.analyze(ClassInfoAnalysisEngine.java:75)
[spotbugs] At edu.umd.cs.findbugs.classfile.engine.ClassInfoAnalysisEngine.analyze(ClassInfoAnalysisEngine.java:38)
[spotbugs] At edu.umd.cs.findbugs.classfile.impl.AnalysisCache.getClassAnalysis(AnalysisCache.java:261)
[spotbugs] At edu.umd.cs.findbugs.ba.XFactory.getXClass(XFactory.java:693)
[spotbugs] At edu.umd.cs.findbugs.ba.AnalysisContext.setAppClassList(AnalysisContext.java:975)
[spotbugs] At edu.umd.cs.findbugs.FindBugs2.setAppClassList(FindBugs2.java:909)
[spotbugs] At edu.umd.cs.findbugs.FindBugs2.execute(FindBugs2.java:252)
[spotbugs] At edu.umd.cs.findbugs.FindBugs.runMain(FindBugs.java:395)
[spotbugs] At edu.umd.cs.findbugs.FindBugs2.main(FindBugs2.java:1231)
[spotbugs] Couldn't get class info for java/util/Set
[spotbugs] java.lang.IllegalArgumentException: Unsupported class file major version 68
[spotbugs] At org.objectweb.asm.ClassReader.<init>(ClassReader.java:200)
[spotbugs] At org.objectweb.asm.ClassReader.<init>(ClassReader.java:180)
[spotbugs] At org.objectweb.asm.ClassReader.<init>(ClassReader.java:166)
[spotbugs] At edu.umd.cs.findbugs.asm.FBClassReader.<init>(FBClassReader.java:35)
[spotbugs] At edu.umd.cs.findbugs.classfile.engine.asm.ClassReaderAnalysisEngine.analyze(ClassReaderAnalysisEngine.java:48)
[spotbugs] At edu.umd.cs.findbugs.classfile.engine.asm.ClassReaderAnalysisEngine.analyze(ClassReaderAnalysisEngine.java:34)
[spotbugs] At edu.umd.cs.findbugs.classfile.impl.AnalysisCache.getClassAnalysis(AnalysisCache.java:261)
[spotbugs] At edu.umd.cs.findbugs.classfile.engine.ClassInfoAnalysisEngine.analyze(ClassInfoAnalysisEngine.java:75)
[spotbugs] At edu.umd.cs.findbugs.classfile.engine.ClassInfoAnalysisEngine.analyze(ClassInfoAnalysisEngine.java:38)
[spotbugs] At edu.umd.cs.findbugs.classfile.impl.AnalysisCache.getClassAnalysis(AnalysisCache.java:261)
[spotbugs] At edu.umd.cs.findbugs.ba.XFactory.getXClass(XFactory.java:693)
[spotbugs] At edu.umd.cs.findbugs.ba.AnalysisContext.setAppClassList(AnalysisContext.java:975)
[spotbugs] At edu.umd.cs.findbugs.FindBugs2.setAppClassList(FindBugs2.java:909)
[spotbugs] At edu.umd.cs.findbugs.FindBugs2.execute(FindBugs2.java:252)
[spotbugs] At edu.umd.cs.findbugs.FindBugs.runMain(FindBugs.java:395)
[spotbugs] At edu.umd.cs.findbugs.FindBugs2.main(FindBugs2.java:1231)
[spotbugs] Couldn't get class info for java/io/FilterInputStream
[spotbugs] java.lang.IllegalArgumentException: Unsupported class file major version 68
[spotbugs] At org.objectweb.asm.ClassReader.<init>(ClassReader.java:200)
[spotbugs] At org.objectweb.asm.ClassReader.<init>(ClassReader.java:180)
[spotbugs] At org.objectweb.asm.ClassReader.<init>(ClassReader.java:166)
[spotbugs] At edu.umd.cs.findbugs.asm.FBClassReader.<init>(FBClassReader.java:35)
[spotbugs] At edu.umd.cs.findbugs.classfile.engine.asm.ClassReaderAnalysisEngine.analyze(ClassReaderAnalysisEngine.java:48)
[spotbugs] At edu.umd.cs.findbugs.classfile.engine.asm.ClassReaderAnalysisEngine.analyze(ClassReaderAnalysisEngine.java:34)
[spotbugs] At edu.umd.cs.findbugs.classfile.impl.AnalysisCache.getClassAnalysis(AnalysisCache.java:261)
[spotbugs] At edu.umd.cs.findbugs.classfile.engine.ClassInfoAnalysisEngine.analyze(ClassInfoAnalysisEngine.java:75)
[spotbugs] At edu.umd.cs.findbugs.classfile.engine.ClassInfoAnalysisEngine.analyze(ClassInfoAnalysisEngine.java:38)
[spotbugs] At edu.umd.cs.findbugs.classfile.impl.AnalysisCache.getClassAnalysis(AnalysisCache.java:261)
[spotbugs] At edu.umd.cs.findbugs.FindBugs2.buildReferencedClassSet(FindBugs2.java:806)
[spotbugs] At edu.umd.cs.findbugs.FindBugs2.execute(FindBugs2.java:249)
[spotbugs] At edu.umd.cs.findbugs.FindBugs.runMain(FindBugs.java:395)
[spotbugs] At edu.umd.cs.findbugs.FindBugs2.main(FindBugs2.java:1231)
[spotbugs] Couldn't get class info for java/awt/AlphaComposite
[spotbugs] java.lang.IllegalArgumentException: Unsupported class file major version 68
[spotbugs] At org.objectweb.asm.ClassReader.<init>(ClassReader.java:200)
[spotbugs] At org.objectweb.asm.ClassReader.<init>(ClassReader.java:180)
[spotbugs] At org.objectweb.asm.ClassReader.<init>(ClassReader.java:166)
[spotbugs] At edu.umd.cs.findbugs.asm.FBClassReader.<init>(FBClassReader.java:35)
[spotbugs] At edu.umd.cs.findbugs.classfile.engine.asm.ClassReaderAnalysisEngine.analyze(ClassReaderAnalysisEngine.java:48)
[spotbugs] At edu.umd.cs.findbugs.classfile.engine.asm.ClassReaderAnalysisEngine.analyze(ClassReaderAnalysisEngine.java:34)
[spotbugs] At edu.umd.cs.findbugs.classfile.impl.AnalysisCache.getClassAnalysis(AnalysisCache.java:261)
[spotbugs] At edu.umd.cs.findbugs.classfile.engine.ClassInfoAnalysisEngine.analyze(ClassInfoAnalysisEngine.java:75)
[spotbugs] At edu.umd.cs.findbugs.classfile.engine.ClassInfoAnalysisEngine.analyze(ClassInfoAnalysisEngine.java:38)
[spotbugs] At edu.umd.cs.findbugs.classfile.impl.AnalysisCache.getClassAnalysis(AnalysisCache.java:261)
[spotbugs] At edu.umd.cs.findbugs.ba.XFactory.getXClass(XFactory.java:693)
[spotbugs] At edu.umd.cs.findbugs.ba.AnalysisContext.setAppClassList(AnalysisContext.java:975)
[spotbugs] At edu.umd.cs.findbugs.FindBugs2.setAppClassList(FindBugs2.java:909)
[spotbugs] At edu.umd.cs.findbugs.FindBugs2.execute(FindBugs2.java:252)
[spotbugs] At edu.umd.cs.findbugs.FindBugs.runMain(FindBugs.java:395)
[spotbugs] At edu.umd.cs.findbugs.FindBugs2.main(FindBugs2.java:1231)
[spotbugs] Couldn't get class info for java/awt/geom/Arc2D
[spotbugs] java.lang.IllegalArgumentException: Unsupported class file major version 68
[spotbugs] At org.objectweb.asm.ClassReader.<init>(ClassReader.java:200)
[spotbugs] At org.objectweb.asm.ClassReader.<init>(ClassReader.java:180)
[spotbugs] At org.objectweb.asm.ClassReader.<init>(ClassReader.java:166)
[spotbugs] At edu.umd.cs.findbugs.asm.FBClassReader.<init>(FBClassReader.java:35)
[spotbugs] At edu.umd.cs.findbugs.classfile.engine.asm.ClassReaderAnalysisEngine.analyze(ClassReaderAnalysisEngine.java:48)
[spotbugs] At edu.umd.cs.findbugs.classfile.engine.asm.ClassReaderAnalysisEngine.analyze(ClassReaderAnalysisEngine.java:34)
[spotbugs] At edu.umd.cs.findbugs.classfile.impl.AnalysisCache.getClassAnalysis(AnalysisCache.java:261)
[spotbugs] At edu.umd.cs.findbugs.classfile.engine.ClassInfoAnalysisEngine.analyze(ClassInfoAnalysisEngine.java:75)
[spotbugs] At edu.umd.cs.findbugs.classfile.engine.ClassInfoAnalysisEngine.analyze(ClassInfoAnalysisEngine.java:38)
[spotbugs] At edu.umd.cs.findbugs.classfile.impl.AnalysisCache.getClassAnalysis(AnalysisCache.java:261)
[spotbugs] At edu.umd.cs.findbugs.ba.XFactory.getXClass(XFactory.java:693)
[spotbugs] At edu.umd.cs.findbugs.ba.AnalysisContext.setAppClassList(AnalysisContext.java:975)
[spotbugs] At edu.umd.cs.findbugs.FindBugs2.setAppClassList(FindBugs2.java:909)
[spotbugs] At edu.umd.cs.findbugs.FindBugs2.execute(FindBugs2.java:252)
[spotbugs] At edu.umd.cs.findbugs.FindBugs.runMain(FindBugs.java:395)
[spotbugs] At edu.umd.cs.findbugs.FindBugs2.main(FindBugs2.java:1231)
[spotbugs] Couldn't get class info for java/security/DigestException
[spotbugs] java.lang.IllegalArgumentException: Unsupported class file major version 68
[spotbugs] At org.objectweb.asm.ClassReader.<init>(ClassReader.java:200)
[spotbugs] At org.objectweb.asm.ClassReader.<init>(ClassReader.java:180)
[spotbugs] At org.objectweb.asm.ClassReader.<init>(ClassReader.java:166)
[spotbugs] At edu.umd.cs.findbugs.asm.FBClassReader.<init>(FBClassReader.java:35)
[spotbugs] At edu.umd.cs.findbugs.classfile.engine.asm.ClassReaderAnalysisEngine.analyze(ClassReaderAnalysisEngine.java:48)
[spotbugs] At edu.umd.cs.findbugs.classfile.engine.asm.ClassReaderAnalysisEngine.analyze(ClassReaderAnalysisEngine.java:34)
[spotbugs] At edu.umd.cs.findbugs.classfile.impl.AnalysisCache.getClassAnalysis(AnalysisCache.java:261)
[spotbugs] At edu.umd.cs.findbugs.classfile.engine.ClassInfoAnalysisEngine.analyze(ClassInfoAnalysisEngine.java:75)
[spotbugs] At edu.umd.cs.findbugs.classfile.engine.ClassInfoAnalysisEngine.analyze(ClassInfoAnalysisEngine.java:38)
[spotbugs] At edu.umd.cs.findbugs.classfile.impl.AnalysisCache.getClassAnalysis(AnalysisCache.java:261)
[spotbugs] At edu.umd.cs.findbugs.ba.XFactory.getXClass(XFactory.java:693)
[spotbugs] At edu.umd.cs.findbugs.ba.AnalysisContext.setAppClassList(AnalysisContext.java:975)
[spotbugs] At edu.umd.cs.findbugs.FindBugs2.setAppClassList(FindBugs2.java:909)
[spotbugs] At edu.umd.cs.findbugs.FindBugs2.execute(FindBugs2.java:252)
[spotbugs] At edu.umd.cs.findbugs.FindBugs.runMain(FindBugs.java:395)
[spotbugs] At edu.umd.cs.findbugs.FindBugs2.main(FindBugs2.java:1231)
[spotbugs]
[spotbugs] java.lang.IllegalArgumentException: Unsupported class file major version 68
[spotbugs] at org.objectweb.asm.ClassReader.<init>(ClassReader.java:200)
[spotbugs] at org.objectweb.asm.ClassReader.<init>(ClassReader.java:180)
[spotbugs] at org.objectweb.asm.ClassReader.<init>(ClassReader.java:166)
[spotbugs] at edu.umd.cs.findbugs.asm.FBClassReader.<init>(FBClassReader.java:35)
[spotbugs] at edu.umd.cs.findbugs.classfile.engine.asm.ClassReaderAnalysisEngine.analyze(ClassReaderAnalysisEngine.java:48)
[spotbugs] at edu.umd.cs.findbugs.classfile.engine.asm.ClassReaderAnalysisEngine.analyze(ClassReaderAnalysisEngine.java:34)
[spotbugs] at edu.umd.cs.findbugs.classfile.impl.AnalysisCache.getClassAnalysis(AnalysisCache.java:261)
[spotbugs] at edu.umd.cs.findbugs.classfile.engine.ClassInfoAnalysisEngine.analyze(ClassInfoAnalysisEngine.java:75)
[spotbugs] at edu.umd.cs.findbugs.classfile.engine.ClassInfoAnalysisEngine.analyze(ClassInfoAnalysisEngine.java:38)
[spotbugs] at edu.umd.cs.findbugs.classfile.impl.AnalysisCache.getClassAnalysis(AnalysisCache.java:261)
[spotbugs] at edu.umd.cs.findbugs.ba.XFactory.getXClass(XFactory.java:693)
[spotbugs] at edu.umd.cs.findbugs.ba.AnalysisContext.setAppClassList(AnalysisContext.java:975)
[spotbugs] at edu.umd.cs.findbugs.FindBugs2.setAppClassList(FindBugs2.java:909)
[spotbugs] at edu.umd.cs.findbugs.FindBugs2.execute(FindBugs2.java:252)
[spotbugs] at edu.umd.cs.findbugs.FindBugs.runMain(FindBugs.java:395)
[spotbugs] at edu.umd.cs.findbugs.FindBugs2.main(FindBugs2.java:1231)
[spotbugs] Java Result: 4
BUILD FAILED
<https://ci-builds.apache.org/job/POI/job/POI-DSL-1.24/ws/build.xml>:2650: Execution of SpotBugs failed.
Total time: 29 minutes 51 seconds
Build step 'Invoke Ant' marked build as failure
ERROR: Not all environment variables could be successfully injected. Check for similarly-named environment variables.
Archiving artifacts
ERROR: Not all environment variables could be successfully injected. Check for similarly-named environment variables.
Recording test results
ERROR: Not all environment variables could be successfully injected. Check for similarly-named environment variables.
[Checks API] No suitable checks publisher found.
ERROR: Not all environment variables could be successfully injected. Check for similarly-named environment variables.
---------------------------------------------------------------------
To unsubscribe, e-mail: dev-unsubscribe@poi.apache.org
For additional commands, e-mail: dev-help@poi.apache.org
Build failed in Jenkins: POI » POI-DSL-1.24 #4
Posted by Apache Jenkins Server <je...@builds.apache.org>.
See <https://ci-builds.apache.org/job/POI/job/POI-DSL-1.24/4/display/redirect?page=changes>
Changes:
[Dominik Stadler] Adjust some more for JDK 23/24
There are more date-formats which need to be
defined manually for the German locale now
to work without the COMPAT locale provider
in JDK 23+
[PJ Fanning] log4j 2.24.3
[PJ Fanning] log4j 2.24.3
------------------------------------------
[...truncated 9.39 MiB...]
[spotbugs] At edu.umd.cs.findbugs.FindBugs2.execute(FindBugs2.java:252)
[spotbugs] At edu.umd.cs.findbugs.FindBugs.runMain(FindBugs.java:395)
[spotbugs] At edu.umd.cs.findbugs.FindBugs2.main(FindBugs2.java:1231)
[spotbugs] Couldn't get class info for java/util/regex/MatchResult
[spotbugs] java.lang.IllegalArgumentException: Unsupported class file major version 68
[spotbugs] At org.objectweb.asm.ClassReader.<init>(ClassReader.java:200)
[spotbugs] At org.objectweb.asm.ClassReader.<init>(ClassReader.java:180)
[spotbugs] At org.objectweb.asm.ClassReader.<init>(ClassReader.java:166)
[spotbugs] At edu.umd.cs.findbugs.asm.FBClassReader.<init>(FBClassReader.java:35)
[spotbugs] At edu.umd.cs.findbugs.classfile.engine.asm.ClassReaderAnalysisEngine.analyze(ClassReaderAnalysisEngine.java:48)
[spotbugs] At edu.umd.cs.findbugs.classfile.engine.asm.ClassReaderAnalysisEngine.analyze(ClassReaderAnalysisEngine.java:34)
[spotbugs] At edu.umd.cs.findbugs.classfile.impl.AnalysisCache.getClassAnalysis(AnalysisCache.java:261)
[spotbugs] At edu.umd.cs.findbugs.classfile.engine.ClassInfoAnalysisEngine.analyze(ClassInfoAnalysisEngine.java:75)
[spotbugs] At edu.umd.cs.findbugs.classfile.engine.ClassInfoAnalysisEngine.analyze(ClassInfoAnalysisEngine.java:38)
[spotbugs] At edu.umd.cs.findbugs.classfile.impl.AnalysisCache.getClassAnalysis(AnalysisCache.java:261)
[spotbugs] At edu.umd.cs.findbugs.ba.XFactory.getXClass(XFactory.java:693)
[spotbugs] At edu.umd.cs.findbugs.ba.AnalysisContext.setAppClassList(AnalysisContext.java:975)
[spotbugs] At edu.umd.cs.findbugs.FindBugs2.setAppClassList(FindBugs2.java:909)
[spotbugs] At edu.umd.cs.findbugs.FindBugs2.execute(FindBugs2.java:252)
[spotbugs] At edu.umd.cs.findbugs.FindBugs.runMain(FindBugs.java:395)
[spotbugs] At edu.umd.cs.findbugs.FindBugs2.main(FindBugs2.java:1231)
[spotbugs] Couldn't get class info for javax/xml/crypto/dsig/spec/SignatureMethodParameterSpec
[spotbugs] java.lang.IllegalArgumentException: Unsupported class file major version 68
[spotbugs] At org.objectweb.asm.ClassReader.<init>(ClassReader.java:200)
[spotbugs] At org.objectweb.asm.ClassReader.<init>(ClassReader.java:180)
[spotbugs] At org.objectweb.asm.ClassReader.<init>(ClassReader.java:166)
[spotbugs] At edu.umd.cs.findbugs.asm.FBClassReader.<init>(FBClassReader.java:35)
[spotbugs] At edu.umd.cs.findbugs.classfile.engine.asm.ClassReaderAnalysisEngine.analyze(ClassReaderAnalysisEngine.java:48)
[spotbugs] At edu.umd.cs.findbugs.classfile.engine.asm.ClassReaderAnalysisEngine.analyze(ClassReaderAnalysisEngine.java:34)
[spotbugs] At edu.umd.cs.findbugs.classfile.impl.AnalysisCache.getClassAnalysis(AnalysisCache.java:261)
[spotbugs] At edu.umd.cs.findbugs.classfile.engine.ClassInfoAnalysisEngine.analyze(ClassInfoAnalysisEngine.java:75)
[spotbugs] At edu.umd.cs.findbugs.classfile.engine.ClassInfoAnalysisEngine.analyze(ClassInfoAnalysisEngine.java:38)
[spotbugs] At edu.umd.cs.findbugs.classfile.impl.AnalysisCache.getClassAnalysis(AnalysisCache.java:261)
[spotbugs] At edu.umd.cs.findbugs.ba.XFactory.getXClass(XFactory.java:693)
[spotbugs] At edu.umd.cs.findbugs.ba.AnalysisContext.setAppClassList(AnalysisContext.java:975)
[spotbugs] At edu.umd.cs.findbugs.FindBugs2.setAppClassList(FindBugs2.java:909)
[spotbugs] At edu.umd.cs.findbugs.FindBugs2.execute(FindBugs2.java:252)
[spotbugs] At edu.umd.cs.findbugs.FindBugs.runMain(FindBugs.java:395)
[spotbugs] At edu.umd.cs.findbugs.FindBugs2.main(FindBugs2.java:1231)
[spotbugs] Couldn't get class info for java/util/Random
[spotbugs] java.lang.IllegalArgumentException: Unsupported class file major version 68
[spotbugs] At org.objectweb.asm.ClassReader.<init>(ClassReader.java:200)
[spotbugs] At org.objectweb.asm.ClassReader.<init>(ClassReader.java:180)
[spotbugs] At org.objectweb.asm.ClassReader.<init>(ClassReader.java:166)
[spotbugs] At edu.umd.cs.findbugs.asm.FBClassReader.<init>(FBClassReader.java:35)
[spotbugs] At edu.umd.cs.findbugs.classfile.engine.asm.ClassReaderAnalysisEngine.analyze(ClassReaderAnalysisEngine.java:48)
[spotbugs] At edu.umd.cs.findbugs.classfile.engine.asm.ClassReaderAnalysisEngine.analyze(ClassReaderAnalysisEngine.java:34)
[spotbugs] At edu.umd.cs.findbugs.classfile.impl.AnalysisCache.getClassAnalysis(AnalysisCache.java:261)
[spotbugs] At edu.umd.cs.findbugs.classfile.engine.ClassInfoAnalysisEngine.analyze(ClassInfoAnalysisEngine.java:75)
[spotbugs] At edu.umd.cs.findbugs.classfile.engine.ClassInfoAnalysisEngine.analyze(ClassInfoAnalysisEngine.java:38)
[spotbugs] At edu.umd.cs.findbugs.classfile.impl.AnalysisCache.getClassAnalysis(AnalysisCache.java:261)
[spotbugs] At edu.umd.cs.findbugs.ba.XFactory.getXClass(XFactory.java:693)
[spotbugs] At edu.umd.cs.findbugs.ba.AnalysisContext.setAppClassList(AnalysisContext.java:975)
[spotbugs] At edu.umd.cs.findbugs.FindBugs2.setAppClassList(FindBugs2.java:909)
[spotbugs] At edu.umd.cs.findbugs.FindBugs2.execute(FindBugs2.java:252)
[spotbugs] At edu.umd.cs.findbugs.FindBugs.runMain(FindBugs.java:395)
[spotbugs] At edu.umd.cs.findbugs.FindBugs2.main(FindBugs2.java:1231)
[spotbugs] Couldn't get class info for java/nio/file/attribute/BasicFileAttributes
[spotbugs] java.lang.IllegalArgumentException: Unsupported class file major version 68
[spotbugs] At org.objectweb.asm.ClassReader.<init>(ClassReader.java:200)
[spotbugs] At org.objectweb.asm.ClassReader.<init>(ClassReader.java:180)
[spotbugs] At org.objectweb.asm.ClassReader.<init>(ClassReader.java:166)
[spotbugs] At edu.umd.cs.findbugs.asm.FBClassReader.<init>(FBClassReader.java:35)
[spotbugs] At edu.umd.cs.findbugs.classfile.engine.asm.ClassReaderAnalysisEngine.analyze(ClassReaderAnalysisEngine.java:48)
[spotbugs] At edu.umd.cs.findbugs.classfile.engine.asm.ClassReaderAnalysisEngine.analyze(ClassReaderAnalysisEngine.java:34)
[spotbugs] At edu.umd.cs.findbugs.classfile.impl.AnalysisCache.getClassAnalysis(AnalysisCache.java:261)
[spotbugs] At edu.umd.cs.findbugs.classfile.engine.ClassInfoAnalysisEngine.analyze(ClassInfoAnalysisEngine.java:75)
[spotbugs] At edu.umd.cs.findbugs.classfile.engine.ClassInfoAnalysisEngine.analyze(ClassInfoAnalysisEngine.java:38)
[spotbugs] At edu.umd.cs.findbugs.classfile.impl.AnalysisCache.getClassAnalysis(AnalysisCache.java:261)
[spotbugs] At edu.umd.cs.findbugs.ba.XFactory.getXClass(XFactory.java:693)
[spotbugs] At edu.umd.cs.findbugs.ba.AnalysisContext.setAppClassList(AnalysisContext.java:975)
[spotbugs] At edu.umd.cs.findbugs.FindBugs2.setAppClassList(FindBugs2.java:909)
[spotbugs] At edu.umd.cs.findbugs.FindBugs2.execute(FindBugs2.java:252)
[spotbugs] At edu.umd.cs.findbugs.FindBugs.runMain(FindBugs.java:395)
[spotbugs] At edu.umd.cs.findbugs.FindBugs2.main(FindBugs2.java:1231)
[spotbugs] Couldn't get class info for java/util/Locale
[spotbugs] java.lang.IllegalArgumentException: Unsupported class file major version 68
[spotbugs] At org.objectweb.asm.ClassReader.<init>(ClassReader.java:200)
[spotbugs] At org.objectweb.asm.ClassReader.<init>(ClassReader.java:180)
[spotbugs] At org.objectweb.asm.ClassReader.<init>(ClassReader.java:166)
[spotbugs] At edu.umd.cs.findbugs.asm.FBClassReader.<init>(FBClassReader.java:35)
[spotbugs] At edu.umd.cs.findbugs.classfile.engine.asm.ClassReaderAnalysisEngine.analyze(ClassReaderAnalysisEngine.java:48)
[spotbugs] At edu.umd.cs.findbugs.classfile.engine.asm.ClassReaderAnalysisEngine.analyze(ClassReaderAnalysisEngine.java:34)
[spotbugs] At edu.umd.cs.findbugs.classfile.impl.AnalysisCache.getClassAnalysis(AnalysisCache.java:261)
[spotbugs] At edu.umd.cs.findbugs.classfile.engine.ClassInfoAnalysisEngine.analyze(ClassInfoAnalysisEngine.java:75)
[spotbugs] At edu.umd.cs.findbugs.classfile.engine.ClassInfoAnalysisEngine.analyze(ClassInfoAnalysisEngine.java:38)
[spotbugs] At edu.umd.cs.findbugs.classfile.impl.AnalysisCache.getClassAnalysis(AnalysisCache.java:261)
[spotbugs] At edu.umd.cs.findbugs.ba.XFactory.getXClass(XFactory.java:693)
[spotbugs] At edu.umd.cs.findbugs.ba.AnalysisContext.setAppClassList(AnalysisContext.java:975)
[spotbugs] At edu.umd.cs.findbugs.FindBugs2.setAppClassList(FindBugs2.java:909)
[spotbugs] At edu.umd.cs.findbugs.FindBugs2.execute(FindBugs2.java:252)
[spotbugs] At edu.umd.cs.findbugs.FindBugs.runMain(FindBugs.java:395)
[spotbugs] At edu.umd.cs.findbugs.FindBugs2.main(FindBugs2.java:1231)
[spotbugs] Couldn't get class info for java/util/zip/Deflater
[spotbugs] java.lang.IllegalArgumentException: Unsupported class file major version 68
[spotbugs] At org.objectweb.asm.ClassReader.<init>(ClassReader.java:200)
[spotbugs] At org.objectweb.asm.ClassReader.<init>(ClassReader.java:180)
[spotbugs] At org.objectweb.asm.ClassReader.<init>(ClassReader.java:166)
[spotbugs] At edu.umd.cs.findbugs.asm.FBClassReader.<init>(FBClassReader.java:35)
[spotbugs] At edu.umd.cs.findbugs.classfile.engine.asm.ClassReaderAnalysisEngine.analyze(ClassReaderAnalysisEngine.java:48)
[spotbugs] At edu.umd.cs.findbugs.classfile.engine.asm.ClassReaderAnalysisEngine.analyze(ClassReaderAnalysisEngine.java:34)
[spotbugs] At edu.umd.cs.findbugs.classfile.impl.AnalysisCache.getClassAnalysis(AnalysisCache.java:261)
[spotbugs] At edu.umd.cs.findbugs.classfile.engine.ClassInfoAnalysisEngine.analyze(ClassInfoAnalysisEngine.java:75)
[spotbugs] At edu.umd.cs.findbugs.classfile.engine.ClassInfoAnalysisEngine.analyze(ClassInfoAnalysisEngine.java:38)
[spotbugs] At edu.umd.cs.findbugs.classfile.impl.AnalysisCache.getClassAnalysis(AnalysisCache.java:261)
[spotbugs] At edu.umd.cs.findbugs.ba.XFactory.getXClass(XFactory.java:693)
[spotbugs] At edu.umd.cs.findbugs.ba.AnalysisContext.setAppClassList(AnalysisContext.java:975)
[spotbugs] At edu.umd.cs.findbugs.FindBugs2.setAppClassList(FindBugs2.java:909)
[spotbugs] At edu.umd.cs.findbugs.FindBugs2.execute(FindBugs2.java:252)
[spotbugs] At edu.umd.cs.findbugs.FindBugs.runMain(FindBugs.java:395)
[spotbugs] At edu.umd.cs.findbugs.FindBugs2.main(FindBugs2.java:1231)
[spotbugs] Couldn't get class info for java/lang/AssertionError
[spotbugs] java.lang.IllegalArgumentException: Unsupported class file major version 68
[spotbugs] At org.objectweb.asm.ClassReader.<init>(ClassReader.java:200)
[spotbugs] At org.objectweb.asm.ClassReader.<init>(ClassReader.java:180)
[spotbugs] At org.objectweb.asm.ClassReader.<init>(ClassReader.java:166)
[spotbugs] At edu.umd.cs.findbugs.asm.FBClassReader.<init>(FBClassReader.java:35)
[spotbugs] At edu.umd.cs.findbugs.classfile.engine.asm.ClassReaderAnalysisEngine.analyze(ClassReaderAnalysisEngine.java:48)
[spotbugs] At edu.umd.cs.findbugs.classfile.engine.asm.ClassReaderAnalysisEngine.analyze(ClassReaderAnalysisEngine.java:34)
[spotbugs] At edu.umd.cs.findbugs.classfile.impl.AnalysisCache.getClassAnalysis(AnalysisCache.java:261)
[spotbugs] At edu.umd.cs.findbugs.classfile.engine.ClassInfoAnalysisEngine.analyze(ClassInfoAnalysisEngine.java:75)
[spotbugs] At edu.umd.cs.findbugs.classfile.engine.ClassInfoAnalysisEngine.analyze(ClassInfoAnalysisEngine.java:38)
[spotbugs] At edu.umd.cs.findbugs.classfile.impl.AnalysisCache.getClassAnalysis(AnalysisCache.java:261)
[spotbugs] At edu.umd.cs.findbugs.ba.XFactory.getXClass(XFactory.java:693)
[spotbugs] At edu.umd.cs.findbugs.ba.AnalysisContext.setAppClassList(AnalysisContext.java:975)
[spotbugs] At edu.umd.cs.findbugs.FindBugs2.setAppClassList(FindBugs2.java:909)
[spotbugs] At edu.umd.cs.findbugs.FindBugs2.execute(FindBugs2.java:252)
[spotbugs] At edu.umd.cs.findbugs.FindBugs.runMain(FindBugs.java:395)
[spotbugs] At edu.umd.cs.findbugs.FindBugs2.main(FindBugs2.java:1231)
[spotbugs] Couldn't get class info for java/util/Set
[spotbugs] java.lang.IllegalArgumentException: Unsupported class file major version 68
[spotbugs] At org.objectweb.asm.ClassReader.<init>(ClassReader.java:200)
[spotbugs] At org.objectweb.asm.ClassReader.<init>(ClassReader.java:180)
[spotbugs] At org.objectweb.asm.ClassReader.<init>(ClassReader.java:166)
[spotbugs] At edu.umd.cs.findbugs.asm.FBClassReader.<init>(FBClassReader.java:35)
[spotbugs] At edu.umd.cs.findbugs.classfile.engine.asm.ClassReaderAnalysisEngine.analyze(ClassReaderAnalysisEngine.java:48)
[spotbugs] At edu.umd.cs.findbugs.classfile.engine.asm.ClassReaderAnalysisEngine.analyze(ClassReaderAnalysisEngine.java:34)
[spotbugs] At edu.umd.cs.findbugs.classfile.impl.AnalysisCache.getClassAnalysis(AnalysisCache.java:261)
[spotbugs] At edu.umd.cs.findbugs.classfile.engine.ClassInfoAnalysisEngine.analyze(ClassInfoAnalysisEngine.java:75)
[spotbugs] At edu.umd.cs.findbugs.classfile.engine.ClassInfoAnalysisEngine.analyze(ClassInfoAnalysisEngine.java:38)
[spotbugs] At edu.umd.cs.findbugs.classfile.impl.AnalysisCache.getClassAnalysis(AnalysisCache.java:261)
[spotbugs] At edu.umd.cs.findbugs.ba.XFactory.getXClass(XFactory.java:693)
[spotbugs] At edu.umd.cs.findbugs.ba.AnalysisContext.setAppClassList(AnalysisContext.java:975)
[spotbugs] At edu.umd.cs.findbugs.FindBugs2.setAppClassList(FindBugs2.java:909)
[spotbugs] At edu.umd.cs.findbugs.FindBugs2.execute(FindBugs2.java:252)
[spotbugs] At edu.umd.cs.findbugs.FindBugs.runMain(FindBugs.java:395)
[spotbugs] At edu.umd.cs.findbugs.FindBugs2.main(FindBugs2.java:1231)
[spotbugs] Couldn't get class info for java/io/FilterInputStream
[spotbugs] java.lang.IllegalArgumentException: Unsupported class file major version 68
[spotbugs] At org.objectweb.asm.ClassReader.<init>(ClassReader.java:200)
[spotbugs] At org.objectweb.asm.ClassReader.<init>(ClassReader.java:180)
[spotbugs] At org.objectweb.asm.ClassReader.<init>(ClassReader.java:166)
[spotbugs] At edu.umd.cs.findbugs.asm.FBClassReader.<init>(FBClassReader.java:35)
[spotbugs] At edu.umd.cs.findbugs.classfile.engine.asm.ClassReaderAnalysisEngine.analyze(ClassReaderAnalysisEngine.java:48)
[spotbugs] At edu.umd.cs.findbugs.classfile.engine.asm.ClassReaderAnalysisEngine.analyze(ClassReaderAnalysisEngine.java:34)
[spotbugs] At edu.umd.cs.findbugs.classfile.impl.AnalysisCache.getClassAnalysis(AnalysisCache.java:261)
[spotbugs] At edu.umd.cs.findbugs.classfile.engine.ClassInfoAnalysisEngine.analyze(ClassInfoAnalysisEngine.java:75)
[spotbugs] At edu.umd.cs.findbugs.classfile.engine.ClassInfoAnalysisEngine.analyze(ClassInfoAnalysisEngine.java:38)
[spotbugs] At edu.umd.cs.findbugs.classfile.impl.AnalysisCache.getClassAnalysis(AnalysisCache.java:261)
[spotbugs] At edu.umd.cs.findbugs.FindBugs2.buildReferencedClassSet(FindBugs2.java:806)
[spotbugs] At edu.umd.cs.findbugs.FindBugs2.execute(FindBugs2.java:249)
[spotbugs] At edu.umd.cs.findbugs.FindBugs.runMain(FindBugs.java:395)
[spotbugs] At edu.umd.cs.findbugs.FindBugs2.main(FindBugs2.java:1231)
[spotbugs] Couldn't get class info for java/awt/AlphaComposite
[spotbugs] java.lang.IllegalArgumentException: Unsupported class file major version 68
[spotbugs] At org.objectweb.asm.ClassReader.<init>(ClassReader.java:200)
[spotbugs] At org.objectweb.asm.ClassReader.<init>(ClassReader.java:180)
[spotbugs] At org.objectweb.asm.ClassReader.<init>(ClassReader.java:166)
[spotbugs] At edu.umd.cs.findbugs.asm.FBClassReader.<init>(FBClassReader.java:35)
[spotbugs] At edu.umd.cs.findbugs.classfile.engine.asm.ClassReaderAnalysisEngine.analyze(ClassReaderAnalysisEngine.java:48)
[spotbugs] At edu.umd.cs.findbugs.classfile.engine.asm.ClassReaderAnalysisEngine.analyze(ClassReaderAnalysisEngine.java:34)
[spotbugs] At edu.umd.cs.findbugs.classfile.impl.AnalysisCache.getClassAnalysis(AnalysisCache.java:261)
[spotbugs] At edu.umd.cs.findbugs.classfile.engine.ClassInfoAnalysisEngine.analyze(ClassInfoAnalysisEngine.java:75)
[spotbugs] At edu.umd.cs.findbugs.classfile.engine.ClassInfoAnalysisEngine.analyze(ClassInfoAnalysisEngine.java:38)
[spotbugs] At edu.umd.cs.findbugs.classfile.impl.AnalysisCache.getClassAnalysis(AnalysisCache.java:261)
[spotbugs] At edu.umd.cs.findbugs.ba.XFactory.getXClass(XFactory.java:693)
[spotbugs] At edu.umd.cs.findbugs.ba.AnalysisContext.setAppClassList(AnalysisContext.java:975)
[spotbugs] At edu.umd.cs.findbugs.FindBugs2.setAppClassList(FindBugs2.java:909)
[spotbugs] At edu.umd.cs.findbugs.FindBugs2.execute(FindBugs2.java:252)
[spotbugs] At edu.umd.cs.findbugs.FindBugs.runMain(FindBugs.java:395)
[spotbugs] At edu.umd.cs.findbugs.FindBugs2.main(FindBugs2.java:1231)
[spotbugs] Couldn't get class info for java/awt/geom/Arc2D
[spotbugs] java.lang.IllegalArgumentException: Unsupported class file major version 68
[spotbugs] At org.objectweb.asm.ClassReader.<init>(ClassReader.java:200)
[spotbugs] At org.objectweb.asm.ClassReader.<init>(ClassReader.java:180)
[spotbugs] At org.objectweb.asm.ClassReader.<init>(ClassReader.java:166)
[spotbugs] At edu.umd.cs.findbugs.asm.FBClassReader.<init>(FBClassReader.java:35)
[spotbugs] At edu.umd.cs.findbugs.classfile.engine.asm.ClassReaderAnalysisEngine.analyze(ClassReaderAnalysisEngine.java:48)
[spotbugs] At edu.umd.cs.findbugs.classfile.engine.asm.ClassReaderAnalysisEngine.analyze(ClassReaderAnalysisEngine.java:34)
[spotbugs] At edu.umd.cs.findbugs.classfile.impl.AnalysisCache.getClassAnalysis(AnalysisCache.java:261)
[spotbugs] At edu.umd.cs.findbugs.classfile.engine.ClassInfoAnalysisEngine.analyze(ClassInfoAnalysisEngine.java:75)
[spotbugs] At edu.umd.cs.findbugs.classfile.engine.ClassInfoAnalysisEngine.analyze(ClassInfoAnalysisEngine.java:38)
[spotbugs] At edu.umd.cs.findbugs.classfile.impl.AnalysisCache.getClassAnalysis(AnalysisCache.java:261)
[spotbugs] At edu.umd.cs.findbugs.ba.XFactory.getXClass(XFactory.java:693)
[spotbugs] At edu.umd.cs.findbugs.ba.AnalysisContext.setAppClassList(AnalysisContext.java:975)
[spotbugs] At edu.umd.cs.findbugs.FindBugs2.setAppClassList(FindBugs2.java:909)
[spotbugs] At edu.umd.cs.findbugs.FindBugs2.execute(FindBugs2.java:252)
[spotbugs] At edu.umd.cs.findbugs.FindBugs.runMain(FindBugs.java:395)
[spotbugs] At edu.umd.cs.findbugs.FindBugs2.main(FindBugs2.java:1231)
[spotbugs] Couldn't get class info for java/security/DigestException
[spotbugs] java.lang.IllegalArgumentException: Unsupported class file major version 68
[spotbugs] At org.objectweb.asm.ClassReader.<init>(ClassReader.java:200)
[spotbugs] At org.objectweb.asm.ClassReader.<init>(ClassReader.java:180)
[spotbugs] At org.objectweb.asm.ClassReader.<init>(ClassReader.java:166)
[spotbugs] At edu.umd.cs.findbugs.asm.FBClassReader.<init>(FBClassReader.java:35)
[spotbugs] At edu.umd.cs.findbugs.classfile.engine.asm.ClassReaderAnalysisEngine.analyze(ClassReaderAnalysisEngine.java:48)
[spotbugs] At edu.umd.cs.findbugs.classfile.engine.asm.ClassReaderAnalysisEngine.analyze(ClassReaderAnalysisEngine.java:34)
[spotbugs] At edu.umd.cs.findbugs.classfile.impl.AnalysisCache.getClassAnalysis(AnalysisCache.java:261)
[spotbugs] At edu.umd.cs.findbugs.classfile.engine.ClassInfoAnalysisEngine.analyze(ClassInfoAnalysisEngine.java:75)
[spotbugs] At edu.umd.cs.findbugs.classfile.engine.ClassInfoAnalysisEngine.analyze(ClassInfoAnalysisEngine.java:38)
[spotbugs] At edu.umd.cs.findbugs.classfile.impl.AnalysisCache.getClassAnalysis(AnalysisCache.java:261)
[spotbugs] At edu.umd.cs.findbugs.ba.XFactory.getXClass(XFactory.java:693)
[spotbugs] At edu.umd.cs.findbugs.ba.AnalysisContext.setAppClassList(AnalysisContext.java:975)
[spotbugs] At edu.umd.cs.findbugs.FindBugs2.setAppClassList(FindBugs2.java:909)
[spotbugs] At edu.umd.cs.findbugs.FindBugs2.execute(FindBugs2.java:252)
[spotbugs] At edu.umd.cs.findbugs.FindBugs.runMain(FindBugs.java:395)
[spotbugs] At edu.umd.cs.findbugs.FindBugs2.main(FindBugs2.java:1231)
[spotbugs]
[spotbugs] java.lang.IllegalArgumentException: Unsupported class file major version 68
[spotbugs] at org.objectweb.asm.ClassReader.<init>(ClassReader.java:200)
[spotbugs] at org.objectweb.asm.ClassReader.<init>(ClassReader.java:180)
[spotbugs] at org.objectweb.asm.ClassReader.<init>(ClassReader.java:166)
[spotbugs] at edu.umd.cs.findbugs.asm.FBClassReader.<init>(FBClassReader.java:35)
[spotbugs] at edu.umd.cs.findbugs.classfile.engine.asm.ClassReaderAnalysisEngine.analyze(ClassReaderAnalysisEngine.java:48)
[spotbugs] at edu.umd.cs.findbugs.classfile.engine.asm.ClassReaderAnalysisEngine.analyze(ClassReaderAnalysisEngine.java:34)
[spotbugs] at edu.umd.cs.findbugs.classfile.impl.AnalysisCache.getClassAnalysis(AnalysisCache.java:261)
[spotbugs] at edu.umd.cs.findbugs.classfile.engine.ClassInfoAnalysisEngine.analyze(ClassInfoAnalysisEngine.java:75)
[spotbugs] at edu.umd.cs.findbugs.classfile.engine.ClassInfoAnalysisEngine.analyze(ClassInfoAnalysisEngine.java:38)
[spotbugs] at edu.umd.cs.findbugs.classfile.impl.AnalysisCache.getClassAnalysis(AnalysisCache.java:261)
[spotbugs] at edu.umd.cs.findbugs.ba.XFactory.getXClass(XFactory.java:693)
[spotbugs] at edu.umd.cs.findbugs.ba.AnalysisContext.setAppClassList(AnalysisContext.java:975)
[spotbugs] at edu.umd.cs.findbugs.FindBugs2.setAppClassList(FindBugs2.java:909)
[spotbugs] at edu.umd.cs.findbugs.FindBugs2.execute(FindBugs2.java:252)
[spotbugs] at edu.umd.cs.findbugs.FindBugs.runMain(FindBugs.java:395)
[spotbugs] at edu.umd.cs.findbugs.FindBugs2.main(FindBugs2.java:1231)
[spotbugs] Java Result: 4
BUILD FAILED
<https://ci-builds.apache.org/job/POI/job/POI-DSL-1.24/ws/build.xml>:2650: Execution of SpotBugs failed.
Total time: 29 minutes 30 seconds
Build step 'Invoke Ant' marked build as failure
ERROR: Not all environment variables could be successfully injected. Check for similarly-named environment variables.
Archiving artifacts
ERROR: Not all environment variables could be successfully injected. Check for similarly-named environment variables.
Recording test results
ERROR: Not all environment variables could be successfully injected. Check for similarly-named environment variables.
[Checks API] No suitable checks publisher found.
ERROR: Not all environment variables could be successfully injected. Check for similarly-named environment variables.
---------------------------------------------------------------------
To unsubscribe, e-mail: dev-unsubscribe@poi.apache.org
For additional commands, e-mail: dev-help@poi.apache.org