You are viewing a plain text version of this content. The canonical link for it is here.
Posted to dev@geronimo.apache.org by ga...@apache.org on 2010/04/09 09:44:43 UTC
[BUILD] branches/2.1: Failed for Revision: 932256
Geronimo Revision: 932256 built with tests included
See the full build-0200.log file at http://people.apache.org/builds/geronimo/server/binaries/2.1/20100409/build-0200.log
Download the binaries from http://people.apache.org/builds/geronimo/server/binaries/2.1/20100409
[INFO] BUILD SUCCESSFUL
[INFO] ------------------------------------------------------------------------
[INFO] Total time: 29 minutes 57 seconds
[INFO] Finished at: Fri Apr 09 02:36:44 EDT 2010
[INFO] Final Memory: 300M/1012M
[INFO] ------------------------------------------------------------------------
TESTSUITE RESULTS (Failures only)
=================================
Assembly: tomcat
=================================
See full test results and logs at http://people.apache.org/builds/geronimo/server/binaries/2.1/20100409/logs-0200-tomcat/
[INFO] Running commands-testsuite.gshell
[INFO] Tests run: 4, Failures: 3, Errors: 0, Skipped: 0, Time elapsed: 0.769 sec <<< FAILURE!
Assembly: jetty
=================================
See full test results and logs at http://people.apache.org/builds/geronimo/server/binaries/2.1/20100409/logs-0200-jetty/
[INFO] Running commands-testsuite.gshell
[INFO] Tests run: 4, Failures: 3, Errors: 0, Skipped: 0, Time elapsed: 0.821 sec <<< FAILURE!
Samples: branches/2.1
=================================
Log: http://people.apache.org/builds/geronimo/server/binaries/2.1/20100409/samples-0200.log
Build status: FAILED