You are viewing a plain text version of this content. The canonical link for it is here.
Posted to dev@jmeter.apache.org by Apache Jenkins Server <je...@builds.apache.org> on 2018/02/15 14:01:53 UTC
Build failed in Jenkins: JMeter Windows #1014
See <https://builds.apache.org/job/JMeter%20Windows/1014/display/redirect?page=changes>
Changes:
[fschumacher] Don't start a new JVM for each junit test when using complete-junit
This cuts down the time to complete the junit tests considerably. It
takes less then two minutes on my machine.
[fschumacher] Update JTable in Aggregate Report only when new data has arrived.
That way selections of rows will be kept longer around.
Bugzilla Id: 62097
[fschumacher] Don't use isEmpty when comparing size to greater than one
Not really part of #356 on Github. Follow up to r1824035
[fschumacher] Use simpler variable names
Part of #356 on Github. Based on contribution by Graham Russell (graham at ham1.co.uk)
[fschumacher] Extract duplicate code in helper method
[fschumacher] Use StringUtils
Part of #356 on Github. Based on contribution by Graham Russell (graham at ham1.co.uk)
[fschumacher] Extract logic in smaller methods and local variables
Part of #356 on Github. Based on contribution by Graham Russell (graham at ham1.co.uk)
[fschumacher] No need to cast here.
[fschumacher] Use isEmpty instead of comparing to size
Part of #356 on Github. Based on contribution by Graham Russell (graham at ham1.co.uk)
[fschumacher] No need to cast here
Part of #356 on Github. Contributed by Graham Russell (graham at ham1.co.uk)
[fschumacher] Return values directly
Part of #356 on Github. Contributed by Graham Russell (graham at ham1.co.uk)
[fschumacher] Remove useless assignment. Part of #356
[fschumacher] Use string concatenation as it is easier to read and results in the same bytecode
Part of #356 on Github. Contributed by Graham Russell (graham at ham1.co.uk)
[fschumacher] Remove useless assignment
Part of #356 on Github. Contributed by Graham Russell (graham at ham1.co.uk)
[fschumacher] Spacepolice
[fschumacher] Convert to lambda expression
Part of #356 on Github. Contributed by Graham Russell (graham at ham1.co.uk)
[fschumacher] Return a singleton list instead of allocating a new array and wrapping that
Part of #356 on Github. Contributed by Graham Russell (graham at ham1.co.uk)
[fschumacher] No need for explicit type here
Part of #356 on Github. Contributed by Graham Russell (graham at ham1.co.uk)
[fschumacher] Use char instead of string to search for
Part of #356 on Github. Contributed by Graham Russell (graham at ham1.co.uk)
[fschumacher] Spacepolice
[fschumacher] Join if statements
Part of #356 on Github. Contributed by Graham Russell (graham at ham1.co.uk)
[fschumacher] Name part of the logic by assigning it to a variable
Part of #356 on Github. Contributed by Graham Russell (graham at ham1.co.uk)
[fschumacher] Use System.arraycopy
Part of #356 on Github. Contributed by Graham Russell (graham at ham1.co.uk)
[fschumacher] No need to cast here
Part of #356 on Github. Contributed by Graham Russell (graham at ham1.co.uk)
[fschumacher] Simplify logic (re-arrange it)
Part of #356 on Github. Contributed by Graham Russell (graham at ham1.co.uk)
[fschumacher] Use lambda instead of subclassing Thread.
Part of #356 on Github. Contributed by Graham Russell (graham at ham1.co.uk)
[fschumacher] Use Deque instead of stack
Part of #356 on Github. Contributed by Graham Russell (graham at ham1.co.uk)
[fschumacher] Use java 8 stream features to collect data
Part of #356 on Github. Based on contribution by Graham Russell (graham at ham1.co.uk)
[fschumacher] Spacepolice
Part of #356 on Github. Contributed by Graham Russell (graham at ham1.co.uk)
[fschumacher] Reduce scope of variables
Part of #356 on Github. Contributed by Graham Russell (graham at ham1.co.uk)
[fschumacher] Spacepolice
Part of #356 on Github. Contributed by Graham Russell (graham at ham1.co.uk)
[fschumacher] Extract lengthy if statement in private method.
Part of #356 on Github. Contributed by Graham Russell (graham at ham1.co.uk)
[fschumacher] spacepolice. Closes #358
[fschumacher] No need to explicitly create an array for the arguments.
This is the last part of the Checkstyle pull requests #358, #365, #366 and #375.
It closes #366 and #358 on github.
Based on contribution by Graham Russell (graham at ham1.co.uk)
[milamber] Fix little issue with default French work (défaut)
[fschumacher] Fix Typo, use method reference and re-format a log-message. Part of #358
[fschumacher] Use new ThreadLocal#withInitial. Part of (or rather hidden in) #358
[fschumacher] Directly return result. Part of #358
[fschumacher] Give the colors names. Part of #358 on github
[fschumacher] Get down to a maximum length of 160 chars
Part of #358 on github. Based on contribution by Graham Russell (graham at ham1.co.uk)
[fschumacher] Refactor common code into private helper.
Preparation for #358 on github.
[fschumacher] Refactor common code into private helper.
As a bonus re-format a small if clause.
Preparation for #358 on github.
[fschumacher] Use log format strings.
[fschumacher] Correct typo from old code. We create a table model for objects.
[fschumacher] Extract common code into a private helper.
Preparation to get line length down to 160 chars.
In preparation for #358 on github
[fschumacher] Use string formats for log messages
[fschumacher] Get down to a maximum length of 165 chars
Part of #358 on github. Based on contribution by Graham Russell (graham at ham1.co.uk)
[pmouawad] Fix typo
[fschumacher] Use try-with syntax, convert to stream usage and return early when no file was given.
[fschumacher] Correct indentation (was four characters off)
[fschumacher] Use try-with construct and get rid of call to deprecated method
[fschumacher] Get down to a maximum length of 170 chars
Part of #358 on github. Based on contribution by Graham Russell (graham at ham1.co.uk)
[pmouawad] Add javadocs badge
[fschumacher] Get down to a maximum length of 175 chars
Part of #358 on github. Based on contribution by Graham Russell (graham at ham1.co.uk)
[fschumacher] Get down to a maximum length of 200 chars
Part of #358 on github. Based on contribution by Graham Russell (graham at ham1.co.uk)
[fschumacher] Enforce max anon inner length of 45 lines
Part of #358 on github. Based on contribution by Graham Russell (graham at ham1.co.uk)
[fschumacher] Start with enforcing a maximum length of 200 chars
Part of #358 on github. Based on contribution by Graham Russell (graham at ham1.co.uk)
[fschumacher] Enable NoLineWrap
Part of #358 on github. Based on contribution by Graham Russell (graham at ham1.co.uk)
[fschumacher] Use empty for initializer pad
Part of #358 on github. Based on contribution by Graham Russell (graham at ham1.co.uk)
[fschumacher] Use empty for iterator pad
Part of #358 on github. Based on contribution by Graham Russell (graham at ham1.co.uk)
[fschumacher] Correct method param pad
plus some other whitespace policing.
Part of #358 on github. Based on contribution by Graham Russell (graham at ham1.co.uk)
[fschumacher] Correct typecast paren padding
Part of #358 on github. Based on contribution by Graham Russell (graham at ham1.co.uk)
[fschumacher] Get rid of call to a deprecated method.
Use try-with instead and convert to stream/collector.
[fschumacher] Try to use a more current java 9 for travis ci
[fschumacher] Check if the bound networks contain the "localhost" address
Exclude IPv6 networks, as those are not supported by commons net;
see https://issues.apache.org/jira/browse/NET-405
[fschumacher] Use https to download checkstyle jars. Relates to #375 on github
[fschumacher] Update to newer ant version for travis ci
[fschumacher] Expanded Checkstyle to files in src and test.
Based on contribution by Graham Russell (graham at ham1.co.uk)
Closes #365 on github
[fschumacher] Add newline at end of file
In preparation for #365 on github. Contributed by Graham Russell (graham at ham1.co.uk)
[fschumacher] Reduce nested try depth
In preparation for #365 on github.
[fschumacher] Set eol-style to native
In preparation for #365 on github.
[fschumacher] Remove unnecessary empty lines
In preparation for #365 on github. Contributed by Graham Russell (graham at ham1.co.uk)
[fschumacher] Don't use multiple variable declarations
In preparation for #365 on github. Contributed by Graham Russell (graham at ham1.co.uk)
[fschumacher] Use one statement per line
In preparation for #365 on github. Contributed by Graham Russell (graham at ham1.co.uk)
[fschumacher] Convert tabs to spaces
In preparation for #365 on github. Contributed by Graham Russell (graham at ham1.co.uk)
[fschumacher] Correct use of array type style
In preparation for #365 on github. Contributed by Graham Russell (graham at ham1.co.uk)
[fschumacher] Remove unnecessary parentheses
In preparation for #365 on github. Contributed by Graham Russell (graham at ham1.co.uk)
[fschumacher] Organize imports.
In preparation for #365 on github. Contributed by Graham Russell (graham at ham1.co.uk)
[fschumacher] Correct typo in component reference for Boundary Extractor
Contributed by orimarko at gmail.com
Bugzilla Id: 62095
[fschumacher] Updated to latest checkstyle (v8.8).
Contributed by Graham Russell (graham at ham1.co.uk)
Closes #375 on github
[fschumacher] Next dev version (4.1-SNAPSHOT currently)
Move 4.0 release notes to changes_history. Start 4.1 release notes.
------------------------------------------
[...truncated 198.14 KB...]
[jmeter] summary + 1 in 00:00:01 = 2.0/s Avg: 187 Min: 187 Max: 187 Err: 0 (0.00%) Active: 1 Started: 1 Finished: 0
[jmeter] summary + 1 in 00:00:30 = 0.0/s Avg: 30084 Min: 30084 Max: 30084 Err: 0 (0.00%) Active: 1 Started: 2 Finished: 1
[jmeter] summary = 2 in 00:00:31 = 0.1/s Avg: 15135 Min: 187 Max: 30084 Err: 0 (0.00%)
[jmeter] summary = 2 in 00:00:31 = 0.1/s Avg: 15135 Min: 187 Max: 30084 Err: 0 (0.00%)
[jmeter] Tidying up ... @ Thu Feb 15 13:58:31 UTC 2018 (1518703111529)
[jmeter] ... end of run
[echo] Bug60607 output files compared OK
batchtest:
[echo] Starting SlowCharsFeature_HttpClient4 with file SlowCharsFeature.jmx using -X -Jdummy=dummy
[jmeter] SLF4J: Class path contains multiple SLF4J bindings.
[jmeter] SLF4J: Found binding in [jar:file:/F:/jenkins/jenkins-slave/workspace/JMeter%20Windows/trunk/lib/log4j-slf4j-impl-2.10.0.jar!/org/slf4j/impl/StaticLoggerBinder.class]
[jmeter] SLF4J: Found binding in [jar:file:/F:/jenkins/jenkins-slave/workspace/JMeter%20Windows/trunk/lib/opt/activemq-all-5.15.2.jar!/org/slf4j/impl/StaticLoggerBinder.class]
[jmeter] SLF4J: See http://www.slf4j.org/codes.html#multiple_bindings for an explanation.
[jmeter] SLF4J: Actual binding is of type [org.apache.logging.slf4j.Log4jLoggerFactory]
[jmeter] Creating summariser <summary>
[jmeter] Created the tree successfully using testfiles/SlowCharsFeature.jmx
[jmeter] Starting the test @ Thu Feb 15 13:58:35 UTC 2018 (1518703115385)
[jmeter] Waiting for possible Shutdown/StopTestNow/Heapdump message on port 4445
[jmeter] summary = 3 in 00:00:18 = 0.2/s Avg: 5764 Min: 562 Max: 10969 Err: 0 (0.00%)
[jmeter] Tidying up ... @ Thu Feb 15 13:58:54 UTC 2018 (1518703134164)
[jmeter] ... end of run
[echo] SlowCharsFeature_HttpClient4 output files compared OK
batchtest:
[echo] Starting SlowCharsFeature_Java with file SlowCharsFeature.jmx using -X -Jjmeter.httpsampler=Java
[jmeter] SLF4J: Class path contains multiple SLF4J bindings.
[jmeter] SLF4J: Found binding in [jar:file:/F:/jenkins/jenkins-slave/workspace/JMeter%20Windows/trunk/lib/log4j-slf4j-impl-2.10.0.jar!/org/slf4j/impl/StaticLoggerBinder.class]
[jmeter] SLF4J: Found binding in [jar:file:/F:/jenkins/jenkins-slave/workspace/JMeter%20Windows/trunk/lib/opt/activemq-all-5.15.2.jar!/org/slf4j/impl/StaticLoggerBinder.class]
[jmeter] SLF4J: See http://www.slf4j.org/codes.html#multiple_bindings for an explanation.
[jmeter] SLF4J: Actual binding is of type [org.apache.logging.slf4j.Log4jLoggerFactory]
[jmeter] Creating summariser <summary>
[jmeter] Created the tree successfully using testfiles/SlowCharsFeature.jmx
[jmeter] Starting the test @ Thu Feb 15 13:58:58 UTC 2018 (1518703138185)
[jmeter] Waiting for possible Shutdown/StopTestNow/Heapdump message on port 4445
[jmeter] summary = 2 in 00:00:13 = 0.2/s Avg: 6179 Min: 735 Max: 11623 Err: 0 (0.00%)
[jmeter] Tidying up ... @ Thu Feb 15 13:59:11 UTC 2018 (1518703151798)
[jmeter] ... end of run
[echo] SlowCharsFeature_Java output files compared OK
batchtest:
[echo] Starting Http4ImplPreemptiveBasicAuth with file Http4ImplPreemptiveBasicAuth.jmx using -X -Jdummy=dummy
[jmeter] SLF4J: Class path contains multiple SLF4J bindings.
[jmeter] SLF4J: Found binding in [jar:file:/F:/jenkins/jenkins-slave/workspace/JMeter%20Windows/trunk/lib/log4j-slf4j-impl-2.10.0.jar!/org/slf4j/impl/StaticLoggerBinder.class]
[jmeter] SLF4J: Found binding in [jar:file:/F:/jenkins/jenkins-slave/workspace/JMeter%20Windows/trunk/lib/opt/activemq-all-5.15.2.jar!/org/slf4j/impl/StaticLoggerBinder.class]
[jmeter] SLF4J: See http://www.slf4j.org/codes.html#multiple_bindings for an explanation.
[jmeter] SLF4J: Actual binding is of type [org.apache.logging.slf4j.Log4jLoggerFactory]
[jmeter] Creating summariser <summary>
[jmeter] Created the tree successfully using testfiles/Http4ImplPreemptiveBasicAuth.jmx
[jmeter] Starting the test @ Thu Feb 15 13:59:18 UTC 2018 (1518703158459)
[jmeter] Waiting for possible Shutdown/StopTestNow/Heapdump message on port 4445
[jmeter] summary = 12 in 00:00:06 = 1.9/s Avg: 168 Min: 13 Max: 1365 Err: 0 (0.00%)
[jmeter] Tidying up ... @ Thu Feb 15 13:59:27 UTC 2018 (1518703167426)
[jmeter] ... end of run
[echo] Http4ImplPreemptiveBasicAuth output files compared OK
batchtest:
[echo] Starting Http4ImplPreemptiveBasicAuth with file Http4ImplPreemptiveBasicAuth.jmx using -X -Jjmeter.httpsampler=Java
[jmeter] SLF4J: Class path contains multiple SLF4J bindings.
[jmeter] SLF4J: Found binding in [jar:file:/F:/jenkins/jenkins-slave/workspace/JMeter%20Windows/trunk/lib/log4j-slf4j-impl-2.10.0.jar!/org/slf4j/impl/StaticLoggerBinder.class]
[jmeter] SLF4J: Found binding in [jar:file:/F:/jenkins/jenkins-slave/workspace/JMeter%20Windows/trunk/lib/opt/activemq-all-5.15.2.jar!/org/slf4j/impl/StaticLoggerBinder.class]
[jmeter] SLF4J: See http://www.slf4j.org/codes.html#multiple_bindings for an explanation.
[jmeter] SLF4J: Actual binding is of type [org.apache.logging.slf4j.Log4jLoggerFactory]
[jmeter] Creating summariser <summary>
[jmeter] Created the tree successfully using testfiles/Http4ImplPreemptiveBasicAuth.jmx
[jmeter] Starting the test @ Thu Feb 15 13:59:33 UTC 2018 (1518703173753)
[jmeter] Waiting for possible Shutdown/StopTestNow/Heapdump message on port 4445
[jmeter] summary = 12 in 00:00:05 = 2.5/s Avg: 102 Min: 13 Max: 980 Err: 0 (0.00%)
[jmeter] Tidying up ... @ Thu Feb 15 13:59:40 UTC 2018 (1518703180132)
[jmeter] ... end of run
[echo] Http4ImplPreemptiveBasicAuth output files compared OK
batchtest:
[echo] Starting TestKeepAlive with file TestKeepAlive.jmx using -X -Jdummy=dummy
[jmeter] SLF4J: Class path contains multiple SLF4J bindings.
[jmeter] SLF4J: Found binding in [jar:file:/F:/jenkins/jenkins-slave/workspace/JMeter%20Windows/trunk/lib/log4j-slf4j-impl-2.10.0.jar!/org/slf4j/impl/StaticLoggerBinder.class]
[jmeter] SLF4J: Found binding in [jar:file:/F:/jenkins/jenkins-slave/workspace/JMeter%20Windows/trunk/lib/opt/activemq-all-5.15.2.jar!/org/slf4j/impl/StaticLoggerBinder.class]
[jmeter] SLF4J: See http://www.slf4j.org/codes.html#multiple_bindings for an explanation.
[jmeter] SLF4J: Actual binding is of type [org.apache.logging.slf4j.Log4jLoggerFactory]
[jmeter] Creating summariser <summary>
[jmeter] Created the tree successfully using testfiles/TestKeepAlive.jmx
[jmeter] Starting the test @ Thu Feb 15 13:59:44 UTC 2018 (1518703184641)
[jmeter] Waiting for possible Shutdown/StopTestNow/Heapdump message on port 4445
[jmeter] summary = 7 in 00:01:02 = 0.1/s Avg: 207 Min: 17 Max: 1099 Err: 0 (0.00%)
[jmeter] Tidying up ... @ Thu Feb 15 14:00:49 UTC 2018 (1518703249616)
[jmeter] ... end of run
[echo] TestKeepAlive output files compared OK
batchtest:
[echo] Starting ResponseDecompression with file ResponseDecompression.jmx using -X -Jdummy=dummy
[jmeter] SLF4J: Class path contains multiple SLF4J bindings.
[jmeter] SLF4J: Found binding in [jar:file:/F:/jenkins/jenkins-slave/workspace/JMeter%20Windows/trunk/lib/log4j-slf4j-impl-2.10.0.jar!/org/slf4j/impl/StaticLoggerBinder.class]
[jmeter] SLF4J: Found binding in [jar:file:/F:/jenkins/jenkins-slave/workspace/JMeter%20Windows/trunk/lib/opt/activemq-all-5.15.2.jar!/org/slf4j/impl/StaticLoggerBinder.class]
[jmeter] SLF4J: See http://www.slf4j.org/codes.html#multiple_bindings for an explanation.
[jmeter] SLF4J: Actual binding is of type [org.apache.logging.slf4j.Log4jLoggerFactory]
[jmeter] Creating summariser <summary>
[jmeter] Created the tree successfully using testfiles/ResponseDecompression.jmx
[jmeter] Starting the test @ Thu Feb 15 14:00:52 UTC 2018 (1518703252482)
[jmeter] Waiting for possible Shutdown/StopTestNow/Heapdump message on port 4445
[jmeter] summary = 6 in 00:00:02 = 2.4/s Avg: 357 Min: 15 Max: 1147 Err: 0 (0.00%)
[jmeter] Tidying up ... @ Thu Feb 15 14:00:55 UTC 2018 (1518703255714)
[jmeter] ... end of run
[echo] ResponseDecompression output files compared OK
batchtest:
[echo] Starting TestHeaderManager with file TestHeaderManager.jmx using -X -Jdummy=dummy
[jmeter] SLF4J: Class path contains multiple SLF4J bindings.
[jmeter] SLF4J: Found binding in [jar:file:/F:/jenkins/jenkins-slave/workspace/JMeter%20Windows/trunk/lib/log4j-slf4j-impl-2.10.0.jar!/org/slf4j/impl/StaticLoggerBinder.class]
[jmeter] SLF4J: Found binding in [jar:file:/F:/jenkins/jenkins-slave/workspace/JMeter%20Windows/trunk/lib/opt/activemq-all-5.15.2.jar!/org/slf4j/impl/StaticLoggerBinder.class]
[jmeter] SLF4J: See http://www.slf4j.org/codes.html#multiple_bindings for an explanation.
[jmeter] SLF4J: Actual binding is of type [org.apache.logging.slf4j.Log4jLoggerFactory]
[jmeter] Creating summariser <summary>
[jmeter] Created the tree successfully using testfiles/TestHeaderManager.jmx
[jmeter] Starting the test @ Thu Feb 15 14:00:58 UTC 2018 (1518703258637)
[jmeter] Waiting for possible Shutdown/StopTestNow/Heapdump message on port 4445
[jmeter] summary + 1 in 00:00:02 = 0.4/s Avg: 2103 Min: 2103 Max: 2103 Err: 0 (0.00%) Active: 1 Started: 1 Finished: 0
[jmeter] summary + 2 in 00:00:04 = 0.5/s Avg: 2001 Min: 1997 Max: 2005 Err: 0 (0.00%) Active: 0 Started: 2 Finished: 2
[jmeter] summary = 3 in 00:00:06 = 0.5/s Avg: 2035 Min: 1997 Max: 2103 Err: 0 (0.00%)
[jmeter] Tidying up ... @ Thu Feb 15 14:01:05 UTC 2018 (1518703265922)
[jmeter] ... end of run
[echo] TestHeaderManager output files compared OK
batchtest:
[echo] Starting TestHeaderManager with file TestHeaderManager.jmx using -X -Jjmeter.httpsampler=Java
[jmeter] SLF4J: Class path contains multiple SLF4J bindings.
[jmeter] SLF4J: Found binding in [jar:file:/F:/jenkins/jenkins-slave/workspace/JMeter%20Windows/trunk/lib/log4j-slf4j-impl-2.10.0.jar!/org/slf4j/impl/StaticLoggerBinder.class]
[jmeter] SLF4J: Found binding in [jar:file:/F:/jenkins/jenkins-slave/workspace/JMeter%20Windows/trunk/lib/opt/activemq-all-5.15.2.jar!/org/slf4j/impl/StaticLoggerBinder.class]
[jmeter] SLF4J: See http://www.slf4j.org/codes.html#multiple_bindings for an explanation.
[jmeter] SLF4J: Actual binding is of type [org.apache.logging.slf4j.Log4jLoggerFactory]
[jmeter] Creating summariser <summary>
[jmeter] Created the tree successfully using testfiles/TestHeaderManager.jmx
[jmeter] Starting the test @ Thu Feb 15 14:01:08 UTC 2018 (1518703268468)
[jmeter] Waiting for possible Shutdown/StopTestNow/Heapdump message on port 4445
[jmeter] summary = 3 in 00:00:03 = 0.9/s Avg: 1012 Min: 1003 Max: 1031 Err: 0 (0.00%)
[jmeter] Tidying up ... @ Thu Feb 15 14:01:12 UTC 2018 (1518703272355)
[jmeter] ... end of run
[echo] TestHeaderManager output files compared OK
batchtest:
[echo] Starting TEST_HTTP_HttpClient4 with file TEST_HTTP.jmx using -X -Jjmeter.httpsampler=HttpClient4
[jmeter] SLF4J: Class path contains multiple SLF4J bindings.
[jmeter] SLF4J: Found binding in [jar:file:/F:/jenkins/jenkins-slave/workspace/JMeter%20Windows/trunk/lib/log4j-slf4j-impl-2.10.0.jar!/org/slf4j/impl/StaticLoggerBinder.class]
[jmeter] SLF4J: Found binding in [jar:file:/F:/jenkins/jenkins-slave/workspace/JMeter%20Windows/trunk/lib/opt/activemq-all-5.15.2.jar!/org/slf4j/impl/StaticLoggerBinder.class]
[jmeter] SLF4J: See http://www.slf4j.org/codes.html#multiple_bindings for an explanation.
[jmeter] SLF4J: Actual binding is of type [org.apache.logging.slf4j.Log4jLoggerFactory]
[jmeter] Creating summariser <summary>
[jmeter] Created the tree successfully using testfiles/TEST_HTTP.jmx
[jmeter] Starting the test @ Thu Feb 15 14:01:15 UTC 2018 (1518703275827)
[jmeter] Waiting for possible Shutdown/StopTestNow/Heapdump message on port 4445
[jmeter] summary = 22 in 00:00:02 = 10.2/s Avg: 69 Min: 2 Max: 795 Err: 0 (0.00%)
[jmeter] Tidying up ... @ Thu Feb 15 14:01:18 UTC 2018 (1518703278704)
[jmeter] ... end of run
[echo] TEST_HTTP_HttpClient4 output files compared OK
batchtest:
[echo] Starting TEST_HTTP_Java with file TEST_HTTP.jmx using -X -Jjmeter.httpsampler=Java
[jmeter] SLF4J: Class path contains multiple SLF4J bindings.
[jmeter] SLF4J: Found binding in [jar:file:/F:/jenkins/jenkins-slave/workspace/JMeter%20Windows/trunk/lib/log4j-slf4j-impl-2.10.0.jar!/org/slf4j/impl/StaticLoggerBinder.class]
[jmeter] SLF4J: Found binding in [jar:file:/F:/jenkins/jenkins-slave/workspace/JMeter%20Windows/trunk/lib/opt/activemq-all-5.15.2.jar!/org/slf4j/impl/StaticLoggerBinder.class]
[jmeter] SLF4J: See http://www.slf4j.org/codes.html#multiple_bindings for an explanation.
[jmeter] SLF4J: Actual binding is of type [org.apache.logging.slf4j.Log4jLoggerFactory]
[jmeter] Creating summariser <summary>
[jmeter] Created the tree successfully using testfiles/TEST_HTTP.jmx
[jmeter] Starting the test @ Thu Feb 15 14:01:23 UTC 2018 (1518703283125)
[jmeter] Waiting for possible Shutdown/StopTestNow/Heapdump message on port 4445
[jmeter] summary = 20 in 00:00:02 = 12.9/s Avg: 53 Min: 1 Max: 557 Err: 0 (0.00%)
[jmeter] Tidying up ... @ Thu Feb 15 14:01:25 UTC 2018 (1518703285281)
[jmeter] ... end of run
[concat] 2018-02-15 14:01:25,088 ERROR o.a.j.p.h.s.HTTPJavaImpl: readResponse: java.net.ProtocolException: Server redirected too many times (20)
[concat] 2018-02-15 14:01:25,095 ERROR o.a.j.p.h.s.HTTPJavaImpl: Cause: java.net.ProtocolException: Server redirected too many times (20)
[concat] 2018-02-15 14:01:25,096 ERROR o.a.j.p.h.c.HttpMirrorThread: Invalid request received:''
[echo] TEST_HTTP_Java output files compared OK
batchtest:
[echo] Starting TestSchedulerWithTimer with file TestSchedulerWithTimer.jmx using -X -Jdummy=dummy
[jmeter] SLF4J: Class path contains multiple SLF4J bindings.
[jmeter] SLF4J: Found binding in [jar:file:/F:/jenkins/jenkins-slave/workspace/JMeter%20Windows/trunk/lib/log4j-slf4j-impl-2.10.0.jar!/org/slf4j/impl/StaticLoggerBinder.class]
[jmeter] SLF4J: Found binding in [jar:file:/F:/jenkins/jenkins-slave/workspace/JMeter%20Windows/trunk/lib/opt/activemq-all-5.15.2.jar!/org/slf4j/impl/StaticLoggerBinder.class]
[jmeter] SLF4J: See http://www.slf4j.org/codes.html#multiple_bindings for an explanation.
[jmeter] SLF4J: Actual binding is of type [org.apache.logging.slf4j.Log4jLoggerFactory]
[jmeter] Creating summariser <summary>
[jmeter] Created the tree successfully using testfiles/TestSchedulerWithTimer.jmx
[jmeter] Starting the test @ Thu Feb 15 14:01:29 UTC 2018 (1518703289023)
[jmeter] Waiting for possible Shutdown/StopTestNow/Heapdump message on port 4445
[jmeter] summary + 1 in 00:00:01 = 1.5/s Avg: 633 Min: 633 Max: 633 Err: 0 (0.00%) Active: 1 Started: 1 Finished: 0
[jmeter] summary + 5 in 00:00:05 = 1.0/s Avg: 24 Min: 0 Max: 122 Err: 0 (0.00%) Active: 0 Started: 1 Finished: 1
[jmeter] summary = 6 in 00:00:06 = 1.0/s Avg: 126 Min: 0 Max: 633 Err: 0 (0.00%)
[jmeter] Tidying up ... @ Thu Feb 15 14:01:36 UTC 2018 (1518703296331)
[jmeter] ... end of run
[echo] TestSchedulerWithTimer output files compared OK
_allbatchtests:
test:
download_checkstyle:
_process_checkstyle_jars:
_check_exists:
_check_jarfile:
[echo] Checking checkstyle-8.8-all.jar
[echo] Deleting checkstyle-8.8-all.jar (excluding checkstyle-8.8-all.jar)
setproxy:
_get_jarfile:
[echo] Fetching: lib/opt/checkstyle-8.8-all.jar
[get] Getting: https://downloads.sourceforge.net/checkstyle/checkstyle/8.8/checkstyle-8.8-all.jar?ts=1518702679914&use_mirror=autoselect/checkstyle-8.8-all.jar
[get] To: <https://builds.apache.org/job/JMeter%20Windows/ws/trunk\build\checkstyle-8.8-all.jar>
[get] https://downloads.sourceforge.net/checkstyle/checkstyle/8.8/checkstyle-8.8-all.jar?ts=1518702679914&use_mirror=autoselect/checkstyle-8.8-all.jar moved to https://netcologne.dl.sourceforge.net/project/checkstyle/checkstyle/8.8/checkstyle-8.8-all.jar
_checkMD5:
[echo] Checksum OK: checkstyle-8.8-all.jar
[move] Moving 1 file to <https://builds.apache.org/job/JMeter%20Windows/ws/trunk\lib\opt>
[move] Attempting to rename: <https://builds.apache.org/job/JMeter%20Windows/ws/trunk\build\checkstyle-8.8-all.jar> to <https://builds.apache.org/job/JMeter%20Windows/ws/trunk\lib\opt\checkstyle-8.8-all.jar>
setproxy:
_get_zipfile:
checkstyle:
_process_checkstyle_jars:
_check_exists:
_check_jarfile:
[checkstyle] Running Checkstyle 8.8 on 1682 files
[checkstyle] [ERROR] <https://builds.apache.org/job/JMeter%20Windows/ws/trunk\test\src\org\apache\jmeter\assertions\MD5HexAssertionSpec.groovy>:0: File does not end with a newline. [NewlineAtEndOfFile]
[checkstyle] [ERROR] <https://builds.apache.org/job/JMeter%20Windows/ws/trunk\test\src\org\apache\jmeter\control\RandomOrderControllerSpec.groovy>:0: File does not end with a newline. [NewlineAtEndOfFile]
[checkstyle] [ERROR] <https://builds.apache.org/job/JMeter%20Windows/ws/trunk\test\src\org\apache\jmeter\control\TestTransactionController.java>:0: File does not end with a newline. [NewlineAtEndOfFile]
[checkstyle] [ERROR] <https://builds.apache.org/job/JMeter%20Windows/ws/trunk\test\src\org\apache\jmeter\control\ThroughputControllerSpec.groovy>:0: File does not end with a newline. [NewlineAtEndOfFile]
[checkstyle] [ERROR] <https://builds.apache.org/job/JMeter%20Windows/ws/trunk\test\src\org\apache\jmeter\engine\util\PackageSpec.groovy>:0: File does not end with a newline. [NewlineAtEndOfFile]
[checkstyle] [ERROR] <https://builds.apache.org/job/JMeter%20Windows/ws/trunk\test\src\org\apache\jmeter\extractor\BoundaryExtractorSpec.groovy>:0: File does not end with a newline. [NewlineAtEndOfFile]
[checkstyle] [ERROR] <https://builds.apache.org/job/JMeter%20Windows/ws/trunk\test\src\org\apache\jmeter\functions\TestTimeShiftFunction.java>:0: File does not end with a newline. [NewlineAtEndOfFile]
[checkstyle] [ERROR] <https://builds.apache.org/job/JMeter%20Windows/ws/trunk\test\src\org\apache\jmeter\report\core\SampleMetadataParserSpec.groovy>:0: File does not end with a newline. [NewlineAtEndOfFile]
[checkstyle] [ERROR] <https://builds.apache.org/job/JMeter%20Windows/ws/trunk\test\src\org\apache\jmeter\services\FileServerSpec.groovy>:0: File does not end with a newline. [NewlineAtEndOfFile]
[checkstyle] [ERROR] <https://builds.apache.org/job/JMeter%20Windows/ws/trunk\test\src\org\apache\jmeter\visualizers\backend\SamplerMetricFixedModeTest.java>:0: File does not end with a newline. [NewlineAtEndOfFile]
[checkstyle] [ERROR] <https://builds.apache.org/job/JMeter%20Windows/ws/trunk\test\src\org\apache\jmeter\visualizers\backend\SamplerMetricTimedModeTest.java>:0: File does not end with a newline. [NewlineAtEndOfFile]
[checkstyle] [ERROR] <https://builds.apache.org/job/JMeter%20Windows/ws/trunk\test\src\org\apache\jorphan\io\TextFileSpec.groovy>:0: File does not end with a newline. [NewlineAtEndOfFile]
Target 'checkstyle' failed with message 'Got 12 errors and 0 warnings.'.
BUILD FAILED
<https://builds.apache.org/job/JMeter%20Windows/ws/trunk\build.xml>:3577: Got 12 errors and 0 warnings.
Total time: 10 minutes 33 seconds
Build step 'Invoke Ant' marked build as failure
Jenkins build is back to normal : JMeter Windows #1018
Posted by Apache Jenkins Server <je...@builds.apache.org>.
See <https://builds.apache.org/job/JMeter%20Windows/1018/display/redirect?page=changes>
Build failed in Jenkins: JMeter Windows #1017
Posted by Apache Jenkins Server <je...@builds.apache.org>.
See <https://builds.apache.org/job/JMeter%20Windows/1017/display/redirect?page=changes>
Changes:
[pmouawad] Bug 62110 - A broken junit class (due to missing dependency) breaks JMeter menus
Contributed by UbikLoadPack
Bugzilla Id: 62110
------------------------------------------
[...truncated 187.94 KB...]
[jmeter] Tidying up ... @ Fri Feb 16 22:49:52 UTC 2018 (1518821392075)
[jmeter] ... end of run
[echo] FTP_TESTS output files compared OK
batchtest:
[echo] Starting Bug60607 with file Bug60607.jmx using -X -Jdummy=dummy
[jmeter] SLF4J: Class path contains multiple SLF4J bindings.
[jmeter] SLF4J: Found binding in [jar:file:/F:/jenkins/jenkins-slave/workspace/JMeter%20Windows/trunk/lib/log4j-slf4j-impl-2.10.0.jar!/org/slf4j/impl/StaticLoggerBinder.class]
[jmeter] SLF4J: Found binding in [jar:file:/F:/jenkins/jenkins-slave/workspace/JMeter%20Windows/trunk/lib/opt/activemq-all-5.15.2.jar!/org/slf4j/impl/StaticLoggerBinder.class]
[jmeter] SLF4J: See http://www.slf4j.org/codes.html#multiple_bindings for an explanation.
[jmeter] SLF4J: Actual binding is of type [org.apache.logging.slf4j.Log4jLoggerFactory]
[jmeter] Creating summariser <summary>
[jmeter] Created the tree successfully using testfiles/Bug60607.jmx
[jmeter] Starting the test @ Fri Feb 16 22:49:55 UTC 2018 (1518821395036)
[jmeter] Waiting for possible Shutdown/StopTestNow/Heapdump message on port 4445
[jmeter] summary = 2 in 00:00:31 = 0.1/s Avg: 15147 Min: 198 Max: 30096 Err: 0 (0.00%)
[jmeter] Tidying up ... @ Fri Feb 16 22:50:26 UTC 2018 (1518821426508)
[jmeter] ... end of run
[echo] Bug60607 output files compared OK
batchtest:
[echo] Starting SlowCharsFeature_HttpClient4 with file SlowCharsFeature.jmx using -X -Jdummy=dummy
[jmeter] SLF4J: Class path contains multiple SLF4J bindings.
[jmeter] SLF4J: Found binding in [jar:file:/F:/jenkins/jenkins-slave/workspace/JMeter%20Windows/trunk/lib/log4j-slf4j-impl-2.10.0.jar!/org/slf4j/impl/StaticLoggerBinder.class]
[jmeter] SLF4J: Found binding in [jar:file:/F:/jenkins/jenkins-slave/workspace/JMeter%20Windows/trunk/lib/opt/activemq-all-5.15.2.jar!/org/slf4j/impl/StaticLoggerBinder.class]
[jmeter] SLF4J: See http://www.slf4j.org/codes.html#multiple_bindings for an explanation.
[jmeter] SLF4J: Actual binding is of type [org.apache.logging.slf4j.Log4jLoggerFactory]
[jmeter] Creating summariser <summary>
[jmeter] Created the tree successfully using testfiles/SlowCharsFeature.jmx
[jmeter] Starting the test @ Fri Feb 16 22:50:30 UTC 2018 (1518821430227)
[jmeter] Waiting for possible Shutdown/StopTestNow/Heapdump message on port 4445
[jmeter] summary + 1 in 00:00:01 = 1.3/s Avg: 726 Min: 726 Max: 726 Err: 0 (0.00%) Active: 1 Started: 1 Finished: 0
[jmeter] summary + 2 in 00:00:17 = 0.1/s Avg: 8376 Min: 5831 Max: 10921 Err: 0 (0.00%) Active: 0 Started: 1 Finished: 1
[jmeter] summary = 3 in 00:00:18 = 0.2/s Avg: 5826 Min: 726 Max: 10921 Err: 0 (0.00%)
[jmeter] Tidying up ... @ Fri Feb 16 22:50:49 UTC 2018 (1518821449074)
[jmeter] ... end of run
[echo] SlowCharsFeature_HttpClient4 output files compared OK
batchtest:
[echo] Starting SlowCharsFeature_Java with file SlowCharsFeature.jmx using -X -Jjmeter.httpsampler=Java
[jmeter] SLF4J: Class path contains multiple SLF4J bindings.
[jmeter] SLF4J: Found binding in [jar:file:/F:/jenkins/jenkins-slave/workspace/JMeter%20Windows/trunk/lib/log4j-slf4j-impl-2.10.0.jar!/org/slf4j/impl/StaticLoggerBinder.class]
[jmeter] SLF4J: Found binding in [jar:file:/F:/jenkins/jenkins-slave/workspace/JMeter%20Windows/trunk/lib/opt/activemq-all-5.15.2.jar!/org/slf4j/impl/StaticLoggerBinder.class]
[jmeter] SLF4J: See http://www.slf4j.org/codes.html#multiple_bindings for an explanation.
[jmeter] SLF4J: Actual binding is of type [org.apache.logging.slf4j.Log4jLoggerFactory]
[jmeter] Creating summariser <summary>
[jmeter] Created the tree successfully using testfiles/SlowCharsFeature.jmx
[jmeter] Starting the test @ Fri Feb 16 22:50:52 UTC 2018 (1518821452635)
[jmeter] Waiting for possible Shutdown/StopTestNow/Heapdump message on port 4445
[jmeter] summary + 2 in 00:00:13 = 0.2/s Avg: 6086 Min: 699 Max: 11474 Err: 0 (0.00%) Active: 1 Started: 1 Finished: 0
[jmeter] summary = 2 in 00:00:13 = 0.2/s Avg: 6086 Min: 699 Max: 11474 Err: 0 (0.00%)
[jmeter] Tidying up ... @ Fri Feb 16 22:51:05 UTC 2018 (1518821465980)
[jmeter] ... end of run
[echo] SlowCharsFeature_Java output files compared OK
batchtest:
[echo] Starting Http4ImplPreemptiveBasicAuth with file Http4ImplPreemptiveBasicAuth.jmx using -X -Jdummy=dummy
[jmeter] SLF4J: Class path contains multiple SLF4J bindings.
[jmeter] SLF4J: Found binding in [jar:file:/F:/jenkins/jenkins-slave/workspace/JMeter%20Windows/trunk/lib/log4j-slf4j-impl-2.10.0.jar!/org/slf4j/impl/StaticLoggerBinder.class]
[jmeter] SLF4J: Found binding in [jar:file:/F:/jenkins/jenkins-slave/workspace/JMeter%20Windows/trunk/lib/opt/activemq-all-5.15.2.jar!/org/slf4j/impl/StaticLoggerBinder.class]
[jmeter] SLF4J: See http://www.slf4j.org/codes.html#multiple_bindings for an explanation.
[jmeter] SLF4J: Actual binding is of type [org.apache.logging.slf4j.Log4jLoggerFactory]
[jmeter] Creating summariser <summary>
[jmeter] Created the tree successfully using testfiles/Http4ImplPreemptiveBasicAuth.jmx
[jmeter] Starting the test @ Fri Feb 16 22:51:08 UTC 2018 (1518821468815)
[jmeter] Waiting for possible Shutdown/StopTestNow/Heapdump message on port 4445
[jmeter] summary = 12 in 00:00:05 = 2.5/s Avg: 111 Min: 13 Max: 679 Err: 0 (0.00%)
[jmeter] Tidying up ... @ Fri Feb 16 22:51:14 UTC 2018 (1518821474844)
[jmeter] ... end of run
[echo] Http4ImplPreemptiveBasicAuth output files compared OK
batchtest:
[echo] Starting Http4ImplPreemptiveBasicAuth with file Http4ImplPreemptiveBasicAuth.jmx using -X -Jjmeter.httpsampler=Java
[jmeter] SLF4J: Class path contains multiple SLF4J bindings.
[jmeter] SLF4J: Found binding in [jar:file:/F:/jenkins/jenkins-slave/workspace/JMeter%20Windows/trunk/lib/log4j-slf4j-impl-2.10.0.jar!/org/slf4j/impl/StaticLoggerBinder.class]
[jmeter] SLF4J: Found binding in [jar:file:/F:/jenkins/jenkins-slave/workspace/JMeter%20Windows/trunk/lib/opt/activemq-all-5.15.2.jar!/org/slf4j/impl/StaticLoggerBinder.class]
[jmeter] SLF4J: See http://www.slf4j.org/codes.html#multiple_bindings for an explanation.
[jmeter] SLF4J: Actual binding is of type [org.apache.logging.slf4j.Log4jLoggerFactory]
[jmeter] Creating summariser <summary>
[jmeter] Created the tree successfully using testfiles/Http4ImplPreemptiveBasicAuth.jmx
[jmeter] Starting the test @ Fri Feb 16 22:51:17 UTC 2018 (1518821477780)
[jmeter] Waiting for possible Shutdown/StopTestNow/Heapdump message on port 4445
[jmeter] summary = 12 in 00:00:04 = 2.9/s Avg: 69 Min: 17 Max: 599 Err: 0 (0.00%)
[jmeter] Tidying up ... @ Fri Feb 16 22:51:23 UTC 2018 (1518821483028)
[jmeter] ... end of run
[echo] Http4ImplPreemptiveBasicAuth output files compared OK
batchtest:
[echo] Starting TestKeepAlive with file TestKeepAlive.jmx using -X -Jdummy=dummy
[jmeter] SLF4J: Class path contains multiple SLF4J bindings.
[jmeter] SLF4J: Found binding in [jar:file:/F:/jenkins/jenkins-slave/workspace/JMeter%20Windows/trunk/lib/log4j-slf4j-impl-2.10.0.jar!/org/slf4j/impl/StaticLoggerBinder.class]
[jmeter] SLF4J: Found binding in [jar:file:/F:/jenkins/jenkins-slave/workspace/JMeter%20Windows/trunk/lib/opt/activemq-all-5.15.2.jar!/org/slf4j/impl/StaticLoggerBinder.class]
[jmeter] SLF4J: See http://www.slf4j.org/codes.html#multiple_bindings for an explanation.
[jmeter] SLF4J: Actual binding is of type [org.apache.logging.slf4j.Log4jLoggerFactory]
[jmeter] Creating summariser <summary>
[jmeter] Created the tree successfully using testfiles/TestKeepAlive.jmx
[jmeter] Starting the test @ Fri Feb 16 22:51:25 UTC 2018 (1518821485835)
[jmeter] Waiting for possible Shutdown/StopTestNow/Heapdump message on port 4445
[jmeter] summary + 4 in 00:00:03 = 1.3/s Avg: 223 Min: 13 Max: 669 Err: 0 (0.00%) Active: 1 Started: 1 Finished: 0
[jmeter] summary + 3 in 00:00:58 = 0.1/s Avg: 27 Min: 16 Max: 34 Err: 0 (0.00%) Active: 0 Started: 1 Finished: 1
[jmeter] summary = 7 in 00:01:01 = 0.1/s Avg: 139 Min: 13 Max: 669 Err: 0 (0.00%)
[jmeter] Tidying up ... @ Fri Feb 16 22:52:28 UTC 2018 (1518821548563)
[jmeter] ... end of run
[echo] TestKeepAlive output files compared OK
batchtest:
[echo] Starting ResponseDecompression with file ResponseDecompression.jmx using -X -Jdummy=dummy
[jmeter] SLF4J: Class path contains multiple SLF4J bindings.
[jmeter] SLF4J: Found binding in [jar:file:/F:/jenkins/jenkins-slave/workspace/JMeter%20Windows/trunk/lib/log4j-slf4j-impl-2.10.0.jar!/org/slf4j/impl/StaticLoggerBinder.class]
[jmeter] SLF4J: Found binding in [jar:file:/F:/jenkins/jenkins-slave/workspace/JMeter%20Windows/trunk/lib/opt/activemq-all-5.15.2.jar!/org/slf4j/impl/StaticLoggerBinder.class]
[jmeter] SLF4J: See http://www.slf4j.org/codes.html#multiple_bindings for an explanation.
[jmeter] SLF4J: Actual binding is of type [org.apache.logging.slf4j.Log4jLoggerFactory]
[jmeter] Creating summariser <summary>
[jmeter] Created the tree successfully using testfiles/ResponseDecompression.jmx
[jmeter] Starting the test @ Fri Feb 16 22:52:31 UTC 2018 (1518821551692)
[jmeter] Waiting for possible Shutdown/StopTestNow/Heapdump message on port 4445
[jmeter] summary + 1 in 00:00:01 = 0.7/s Avg: 1087 Min: 1087 Max: 1087 Err: 0 (0.00%) Active: 1 Started: 1 Finished: 0
[jmeter] summary + 5 in 00:00:01 = 4.2/s Avg: 229 Min: 18 Max: 515 Err: 0 (0.00%) Active: 0 Started: 1 Finished: 1
[jmeter] summary = 6 in 00:00:03 = 2.3/s Avg: 372 Min: 18 Max: 1087 Err: 0 (0.00%)
[jmeter] Tidying up ... @ Fri Feb 16 22:52:35 UTC 2018 (1518821555115)
[jmeter] ... end of run
[echo] ResponseDecompression output files compared OK
batchtest:
[echo] Starting TestHeaderManager with file TestHeaderManager.jmx using -X -Jdummy=dummy
[jmeter] SLF4J: Class path contains multiple SLF4J bindings.
[jmeter] SLF4J: Found binding in [jar:file:/F:/jenkins/jenkins-slave/workspace/JMeter%20Windows/trunk/lib/log4j-slf4j-impl-2.10.0.jar!/org/slf4j/impl/StaticLoggerBinder.class]
[jmeter] SLF4J: Found binding in [jar:file:/F:/jenkins/jenkins-slave/workspace/JMeter%20Windows/trunk/lib/opt/activemq-all-5.15.2.jar!/org/slf4j/impl/StaticLoggerBinder.class]
[jmeter] SLF4J: See http://www.slf4j.org/codes.html#multiple_bindings for an explanation.
[jmeter] SLF4J: Actual binding is of type [org.apache.logging.slf4j.Log4jLoggerFactory]
[jmeter] Creating summariser <summary>
[jmeter] Created the tree successfully using testfiles/TestHeaderManager.jmx
[jmeter] Starting the test @ Fri Feb 16 22:52:38 UTC 2018 (1518821558011)
[jmeter] Waiting for possible Shutdown/StopTestNow/Heapdump message on port 4445
[jmeter] summary = 3 in 00:00:06 = 0.5/s Avg: 2039 Min: 2003 Max: 2111 Err: 0 (0.00%)
[jmeter] Tidying up ... @ Fri Feb 16 22:52:45 UTC 2018 (1518821565172)
[jmeter] ... end of run
[echo] TestHeaderManager output files compared OK
batchtest:
[echo] Starting TestHeaderManager with file TestHeaderManager.jmx using -X -Jjmeter.httpsampler=Java
[jmeter] SLF4J: Class path contains multiple SLF4J bindings.
[jmeter] SLF4J: Found binding in [jar:file:/F:/jenkins/jenkins-slave/workspace/JMeter%20Windows/trunk/lib/log4j-slf4j-impl-2.10.0.jar!/org/slf4j/impl/StaticLoggerBinder.class]
[jmeter] SLF4J: Found binding in [jar:file:/F:/jenkins/jenkins-slave/workspace/JMeter%20Windows/trunk/lib/opt/activemq-all-5.15.2.jar!/org/slf4j/impl/StaticLoggerBinder.class]
[jmeter] SLF4J: See http://www.slf4j.org/codes.html#multiple_bindings for an explanation.
[jmeter] SLF4J: Actual binding is of type [org.apache.logging.slf4j.Log4jLoggerFactory]
[jmeter] Creating summariser <summary>
[jmeter] Created the tree successfully using testfiles/TestHeaderManager.jmx
[jmeter] Starting the test @ Fri Feb 16 22:52:48 UTC 2018 (1518821568442)
[jmeter] Waiting for possible Shutdown/StopTestNow/Heapdump message on port 4445
[jmeter] summary = 3 in 00:00:03 = 0.9/s Avg: 1008 Min: 1002 Max: 1021 Err: 0 (0.00%)
[jmeter] Tidying up ... @ Fri Feb 16 22:52:52 UTC 2018 (1518821572504)
[jmeter] ... end of run
[echo] TestHeaderManager output files compared OK
batchtest:
[echo] Starting TEST_HTTP_HttpClient4 with file TEST_HTTP.jmx using -X -Jjmeter.httpsampler=HttpClient4
[jmeter] SLF4J: Class path contains multiple SLF4J bindings.
[jmeter] SLF4J: Found binding in [jar:file:/F:/jenkins/jenkins-slave/workspace/JMeter%20Windows/trunk/lib/log4j-slf4j-impl-2.10.0.jar!/org/slf4j/impl/StaticLoggerBinder.class]
[jmeter] SLF4J: Found binding in [jar:file:/F:/jenkins/jenkins-slave/workspace/JMeter%20Windows/trunk/lib/opt/activemq-all-5.15.2.jar!/org/slf4j/impl/StaticLoggerBinder.class]
[jmeter] SLF4J: See http://www.slf4j.org/codes.html#multiple_bindings for an explanation.
[jmeter] SLF4J: Actual binding is of type [org.apache.logging.slf4j.Log4jLoggerFactory]
[jmeter] Creating summariser <summary>
[jmeter] Created the tree successfully using testfiles/TEST_HTTP.jmx
[jmeter] Starting the test @ Fri Feb 16 22:52:55 UTC 2018 (1518821575977)
[jmeter] Waiting for possible Shutdown/StopTestNow/Heapdump message on port 4445
[jmeter] summary = 22 in 00:00:02 = 11.8/s Avg: 57 Min: 1 Max: 572 Err: 0 (0.00%)
[jmeter] Tidying up ... @ Fri Feb 16 22:52:58 UTC 2018 (1518821578484)
[jmeter] ... end of run
[echo] TEST_HTTP_HttpClient4 output files compared OK
batchtest:
[echo] Starting TEST_HTTP_Java with file TEST_HTTP.jmx using -X -Jjmeter.httpsampler=Java
[jmeter] SLF4J: Class path contains multiple SLF4J bindings.
[jmeter] SLF4J: Found binding in [jar:file:/F:/jenkins/jenkins-slave/workspace/JMeter%20Windows/trunk/lib/log4j-slf4j-impl-2.10.0.jar!/org/slf4j/impl/StaticLoggerBinder.class]
[jmeter] SLF4J: Found binding in [jar:file:/F:/jenkins/jenkins-slave/workspace/JMeter%20Windows/trunk/lib/opt/activemq-all-5.15.2.jar!/org/slf4j/impl/StaticLoggerBinder.class]
[jmeter] SLF4J: See http://www.slf4j.org/codes.html#multiple_bindings for an explanation.
[jmeter] SLF4J: Actual binding is of type [org.apache.logging.slf4j.Log4jLoggerFactory]
[jmeter] Creating summariser <summary>
[jmeter] Created the tree successfully using testfiles/TEST_HTTP.jmx
[jmeter] Starting the test @ Fri Feb 16 22:53:02 UTC 2018 (1518821582913)
[jmeter] Waiting for possible Shutdown/StopTestNow/Heapdump message on port 4445
[jmeter] summary + 1 in 00:00:01 = 1.6/s Avg: 597 Min: 597 Max: 597 Err: 0 (0.00%) Active: 1 Started: 1 Finished: 0
[jmeter] summary + 19 in 00:00:01 = 21.2/s Avg: 25 Min: 1 Max: 197 Err: 0 (0.00%) Active: 0 Started: 1 Finished: 1
[jmeter] summary = 20 in 00:00:02 = 13.0/s Avg: 54 Min: 1 Max: 597 Err: 0 (0.00%)
[jmeter] Tidying up ... @ Fri Feb 16 22:53:05 UTC 2018 (1518821585022)
[jmeter] ... end of run
[concat] 2018-02-16 22:53:04,899 ERROR o.a.j.p.h.s.HTTPJavaImpl: readResponse: java.net.ProtocolException: Server redirected too many times (20)
[concat] 2018-02-16 22:53:04,903 ERROR o.a.j.p.h.s.HTTPJavaImpl: Cause: java.net.ProtocolException: Server redirected too many times (20)
[concat] 2018-02-16 22:53:04,905 ERROR o.a.j.p.h.c.HttpMirrorThread: Invalid request received:''
[echo] TEST_HTTP_Java output files compared OK
batchtest:
[echo] Starting TestSchedulerWithTimer with file TestSchedulerWithTimer.jmx using -X -Jdummy=dummy
[jmeter] SLF4J: Class path contains multiple SLF4J bindings.
[jmeter] SLF4J: Found binding in [jar:file:/F:/jenkins/jenkins-slave/workspace/JMeter%20Windows/trunk/lib/log4j-slf4j-impl-2.10.0.jar!/org/slf4j/impl/StaticLoggerBinder.class]
[jmeter] SLF4J: Found binding in [jar:file:/F:/jenkins/jenkins-slave/workspace/JMeter%20Windows/trunk/lib/opt/activemq-all-5.15.2.jar!/org/slf4j/impl/StaticLoggerBinder.class]
[jmeter] SLF4J: See http://www.slf4j.org/codes.html#multiple_bindings for an explanation.
[jmeter] SLF4J: Actual binding is of type [org.apache.logging.slf4j.Log4jLoggerFactory]
[jmeter] Creating summariser <summary>
[jmeter] Created the tree successfully using testfiles/TestSchedulerWithTimer.jmx
[jmeter] Starting the test @ Fri Feb 16 22:53:08 UTC 2018 (1518821588985)
[jmeter] Waiting for possible Shutdown/StopTestNow/Heapdump message on port 4445
[jmeter] summary = 6 in 00:00:06 = 1.0/s Avg: 115 Min: 0 Max: 558 Err: 0 (0.00%)
[jmeter] Tidying up ... @ Fri Feb 16 22:53:15 UTC 2018 (1518821595920)
[jmeter] ... end of run
[echo] TestSchedulerWithTimer output files compared OK
_allbatchtests:
test:
download_checkstyle:
_process_checkstyle_jars:
_check_exists:
_check_jarfile:
[echo] Checking checkstyle-8.8-all.jar
[echo] Deleting checkstyle-8.8-all.jar (excluding checkstyle-8.8-all.jar)
setproxy:
_get_jarfile:
setproxy:
_get_zipfile:
checkstyle:
_process_checkstyle_jars:
_check_exists:
_check_jarfile:
[checkstyle] Running Checkstyle 8.8 on 1682 files
[checkstyle] [ERROR] <https://builds.apache.org/job/JMeter%20Windows/ws/trunk\test\src\org\apache\jmeter\control\TestTransactionController.java>:0: File does not end with a newline. [NewlineAtEndOfFile]
[checkstyle] [ERROR] <https://builds.apache.org/job/JMeter%20Windows/ws/trunk\test\src\org\apache\jmeter\functions\TestTimeShiftFunction.java>:0: File does not end with a newline. [NewlineAtEndOfFile]
[checkstyle] [ERROR] <https://builds.apache.org/job/JMeter%20Windows/ws/trunk\test\src\org\apache\jmeter\visualizers\backend\SamplerMetricFixedModeTest.java>:0: File does not end with a newline. [NewlineAtEndOfFile]
[checkstyle] [ERROR] <https://builds.apache.org/job/JMeter%20Windows/ws/trunk\test\src\org\apache\jmeter\visualizers\backend\SamplerMetricTimedModeTest.java>:0: File does not end with a newline. [NewlineAtEndOfFile]
Target 'checkstyle' failed with message 'Got 4 errors and 0 warnings.'.
BUILD FAILED
<https://builds.apache.org/job/JMeter%20Windows/ws/trunk\build.xml>:3577: Got 4 errors and 0 warnings.
Total time: 10 minutes 16 seconds
Build step 'Invoke Ant' marked build as failure
Build failed in Jenkins: JMeter Windows #1016
Posted by Apache Jenkins Server <je...@builds.apache.org>.
See <https://builds.apache.org/job/JMeter%20Windows/1016/display/redirect?page=changes>
Changes:
[fschumacher] We have three header divs (not four), so space them correctly
[fschumacher] JUnitSampler logs exceptions except assertion-failures from test cases as warnings.
Contributed by Davide Angelocola (davide.angelocola at fisglobal.com)
Closes #376 on github
[fschumacher] Disable JDK9 compilation for travis, as the compiler has problems with some of the jars needed to compile
[fschumacher] JMeter fails to start under Windows when JM_LAUNCH contains spaces
Bugzilla Id: 62107
[fschumacher] Set eol-style to native
------------------------------------------
[...truncated 119.12 KB...]
setproxy:
_get_zipfile:
_check_exists:
_check_jarfile:
[echo] Checking ftplet-api-1.1.1.jar
[echo] Deleting ftplet-api-* (excluding ftplet-api-1.1.1.jar)
setproxy:
_get_jarfile:
setproxy:
_get_zipfile:
_check_exists:
_check_jarfile:
[echo] Checking ftpserver-core-1.1.1.jar
[echo] Deleting ftpserver-core-* (excluding ftpserver-core-1.1.1.jar)
setproxy:
_get_jarfile:
setproxy:
_get_zipfile:
_check_exists:
_check_jarfile:
[echo] Checking org.jacoco.ant-0.8.0-nodeps.jar
[echo] Deleting org.jacoco.ant-0.8.0-nodeps.jar (excluding org.jacoco.ant-0.8.0-nodeps.jar)
setproxy:
_get_jarfile:
setproxy:
_get_zipfile:
_check_exists:
_check_jarfile:
[echo] Checking sonarqube-ant-task-2.5.jar
[echo] Deleting sonarqube-ant-task-* (excluding sonarqube-ant-task-2.5.jar)
setproxy:
_get_jarfile:
setproxy:
_get_zipfile:
svnCheck:
[echo] svn.revision=1824362
init-svnVersion:
[echo] svn.revision = 1824362
[echo] jmeter.version = r1824362
[echo] display.version = r1824362
[echo] implementation.version = r1824362
_check_3rdparty:
_message_3rdParty:
init-version:
[echo] jmeter.version = r1824362
[echo] display.version = r1824362
[echo] implementation.version = r1824362
compile-jorphan:
[javac] Compiling 61 source files to <https://builds.apache.org/job/JMeter%20Windows/ws/trunk\build\jorphan>
[javac] warning: [options] bootstrap class path not set in conjunction with -source 1.8
[javac] 1 warning
[javac] An exception has occurred in the compiler (9.0.1). Please file a bug against the Java compiler via the Java bug reporting page (http://bugreport.java.com) after checking the Bug Database (http://bugs.java.com) for duplicates. Include your program and the following diagnostic in your report. Thank you.
[javac] java.lang.NullPointerException
[javac] at jdk.zipfs/jdk.nio.zipfs.JarFileSystem.getVersionMap(JarFileSystem.java:137)
[javac] at jdk.zipfs/jdk.nio.zipfs.JarFileSystem.createVersionedLinks(JarFileSystem.java:112)
[javac] at jdk.zipfs/jdk.nio.zipfs.JarFileSystem.<init>(JarFileSystem.java:85)
[javac] at jdk.zipfs/jdk.nio.zipfs.ZipFileSystemProvider.newFileSystem(ZipFileSystemProvider.java:134)
[javac] at jdk.compiler/com.sun.tools.javac.file.JavacFileManager$ArchiveContainer.<init>(JavacFileManager.java:517)
[javac] at jdk.compiler/com.sun.tools.javac.file.JavacFileManager.getContainer(JavacFileManager.java:319)
[javac] at jdk.compiler/com.sun.tools.javac.file.JavacFileManager.list(JavacFileManager.java:715)
[javac] at jdk.compiler/com.sun.tools.javac.code.ClassFinder.list(ClassFinder.java:722)
[javac] at jdk.compiler/com.sun.tools.javac.code.ClassFinder.scanUserPaths(ClassFinder.java:655)
[javac] at jdk.compiler/com.sun.tools.javac.code.ClassFinder.fillIn(ClassFinder.java:526)
[javac] at jdk.compiler/com.sun.tools.javac.code.ClassFinder.complete(ClassFinder.java:293)
[javac] at jdk.compiler/com.sun.tools.javac.code.Symbol.complete(Symbol.java:633)
[javac] at jdk.compiler/com.sun.tools.javac.code.Symbol$PackageSymbol.members(Symbol.java:1120)
[javac] at jdk.compiler/com.sun.tools.javac.code.Symtab.listPackageModules(Symtab.java:810)
[javac] at jdk.compiler/com.sun.tools.javac.comp.Enter.visitTopLevel(Enter.java:344)
[javac] at jdk.compiler/com.sun.tools.javac.tree.JCTree$JCCompilationUnit.accept(JCTree.java:529)
[javac] at jdk.compiler/com.sun.tools.javac.comp.Enter.classEnter(Enter.java:285)
[javac] at jdk.compiler/com.sun.tools.javac.comp.Enter.classEnter(Enter.java:300)
[javac] at jdk.compiler/com.sun.tools.javac.comp.Enter.complete(Enter.java:570)
[javac] at jdk.compiler/com.sun.tools.javac.comp.Enter.main(Enter.java:554)
[javac] at jdk.compiler/com.sun.tools.javac.main.JavaCompiler.enterTrees(JavaCompiler.java:1052)
[javac] at jdk.compiler/com.sun.tools.javac.main.JavaCompiler.compile(JavaCompiler.java:923)
[javac] at jdk.compiler/com.sun.tools.javac.main.Main.compile(Main.java:302)
[javac] at jdk.compiler/com.sun.tools.javac.main.Main.compile(Main.java:162)
[javac] at jdk.compiler/com.sun.tools.javac.Main.compile(Main.java:57)
[javac] at java.base/jdk.internal.reflect.NativeMethodAccessorImpl.invoke0(Native Method)
[javac] at java.base/jdk.internal.reflect.NativeMethodAccessorImpl.invoke(NativeMethodAccessorImpl.java:62)
[javac] at java.base/jdk.internal.reflect.DelegatingMethodAccessorImpl.invoke(DelegatingMethodAccessorImpl.java:43)
[javac] at java.base/java.lang.reflect.Method.invoke(Method.java:564)
[javac] at org.apache.tools.ant.taskdefs.compilers.Javac13.execute(Javac13.java:58)
[javac] at org.apache.tools.ant.taskdefs.Javac.compile(Javac.java:1395)
[javac] at org.apache.tools.ant.taskdefs.Javac.execute(Javac.java:1121)
[javac] at org.apache.tools.ant.UnknownElement.execute(UnknownElement.java:293)
[javac] at jdk.internal.reflect.GeneratedMethodAccessor5.invoke(Unknown Source)
[javac] at java.base/jdk.internal.reflect.DelegatingMethodAccessorImpl.invoke(DelegatingMethodAccessorImpl.java:43)
[javac] at java.base/java.lang.reflect.Method.invoke(Method.java:564)
[javac] at org.apache.tools.ant.dispatch.DispatchUtils.execute(DispatchUtils.java:106)
[javac] at org.apache.tools.ant.Task.perform(Task.java:348)
[javac] at org.apache.tools.ant.Target.execute(Target.java:435)
[javac] at org.apache.tools.ant.Target.performTasks(Target.java:456)
[javac] at org.apache.tools.ant.Project.executeSortedTargets(Project.java:1405)
[javac] at org.apache.tools.ant.Project.executeTarget(Project.java:1376)
[javac] at org.apache.tools.ant.helper.DefaultExecutor.executeTargets(DefaultExecutor.java:41)
[javac] at org.apache.tools.ant.Project.executeTargets(Project.java:1260)
[javac] at org.apache.tools.ant.Main.runBuild(Main.java:857)
[javac] at org.apache.tools.ant.Main.startAnt(Main.java:236)
[javac] at org.apache.tools.ant.launch.Launcher.run(Launcher.java:287)
[javac] at org.apache.tools.ant.launch.Launcher.main(Launcher.java:113)
Target 'compile-jorphan' failed with message 'Compile failed; see the compiler error output for details.'.
Cannot execute 'compile-core' - 'compile-jorphan' failed or was not executed.
Cannot execute 'compile-components' - 'compile-jorphan' failed or was not executed.
Cannot execute 'compile-functions' - 'compile-jorphan' failed or was not executed.
Cannot execute 'compile-http' - 'compile-jorphan' failed or was not executed.
Cannot execute 'compile-ftp' - 'compile-jorphan' failed or was not executed.
Cannot execute 'compile-jdbc' - 'compile-jorphan' failed or was not executed.
Cannot execute 'compile-java' - 'compile-jorphan' failed or was not executed.
Cannot execute 'compile-ldap' - 'compile-jorphan' failed or was not executed.
create-mail-dir:
Cannot execute 'compile-mail' - 'compile-jorphan' failed or was not executed.
Cannot execute 'compile-tcp' - 'compile-jorphan' failed or was not executed.
Cannot execute 'compile-protocols' - 'compile-http' failed or was not executed.
Cannot execute 'compile-junit' - 'compile-jorphan' failed or was not executed.
Cannot execute 'compile-jms' - 'compile-jorphan' failed or was not executed.
Cannot execute 'compile-native' - 'compile-jorphan' failed or was not executed.
Cannot execute 'compile-mongodb' - 'compile-jorphan' failed or was not executed.
Cannot execute 'compile' - 'compile-core' failed or was not executed.
Cannot execute 'compile-tests' - 'compile' failed or was not executed.
prepare-resources:
[copy] Copying 3 files to <https://builds.apache.org/job/JMeter%20Windows/ws/trunk\build\res\META-INF>
package-only:
Target 'package-only' failed with message '<https://builds.apache.org/job/JMeter%20Windows/ws/trunk\build\core> does not exist.'.
Cannot execute 'package' - 'compile' failed or was not executed.
Cannot execute '_test' - 'compile-tests' failed or was not executed.
batchtest:
[echo] Starting BatchTestLocal with file BatchTestLocal.jmx using -X -Jdummy=dummy
[jmeter] Error: Could not find or load main class org.apache.jmeter.NewDriver
[jmeter] Caused by: java.lang.ClassNotFoundException: org.apache.jmeter.NewDriver
[jmeter] Java Result: 1
[concat] <https://builds.apache.org/job/JMeter%20Windows/ws/trunk\bin\BatchTestLocal.log> does not exist.
Target 'batchtest' failed with message 'The following error occurred while executing this line:
<https://builds.apache.org/job/JMeter%20Windows/ws/trunk\build.xml>:2710: Cannot find output file <https://builds.apache.org/job/JMeter%20Windows/ws/trunk\bin\BatchTestLocal.csv'.>
batchtestserver:
[server] Error: Could not find or load main class org.apache.jmeter.NewDriver
[server] Caused by: java.lang.ClassNotFoundException: org.apache.jmeter.NewDriver
[server] Java Result: 1
batchtest:
[echo] Starting BatchTestLocal with file BatchTestLocal.jmx using -Rjenkins-win2016-1:2448 -Jdummy=dummy
[client] Error: Could not find or load main class org.apache.jmeter.NewDriver
[client] Caused by: java.lang.ClassNotFoundException: org.apache.jmeter.NewDriver
[client] Java Result: 1
[concat] <https://builds.apache.org/job/JMeter%20Windows/ws/trunk\bin\BatchTestLocal.log> does not exist.
Target 'batchtest' failed with message 'The following error occurred while executing this line:
<https://builds.apache.org/job/JMeter%20Windows/ws/trunk\build.xml>:2710: Cannot find output file <https://builds.apache.org/job/JMeter%20Windows/ws/trunk\bin\BatchTestLocal.csv'.>
Target 'batchtestserver' failed with message 'The following error occurred while executing this line:
<https://builds.apache.org/job/JMeter%20Windows/ws/trunk\build.xml>:2765: The following error occurred while executing this line:
<https://builds.apache.org/job/JMeter%20Windows/ws/trunk\build.xml>:2710: Cannot find output file <https://builds.apache.org/job/JMeter%20Windows/ws/trunk\bin\BatchTestLocal.csv'.>
batch_scripts:
batchtest:
[echo] Starting HTMLParserTestFile_2 with file HTMLParserTestFile_2.jmx using -X -Jdummy=dummy
[jmeter] Error: Could not find or load main class org.apache.jmeter.NewDriver
[jmeter] Caused by: java.lang.ClassNotFoundException: org.apache.jmeter.NewDriver
[jmeter] Java Result: 1
[concat] <https://builds.apache.org/job/JMeter%20Windows/ws/trunk\bin\HTMLParserTestFile_2.log> does not exist.
Target 'batchtest' failed with message 'The following error occurred while executing this line:
<https://builds.apache.org/job/JMeter%20Windows/ws/trunk\build.xml>:2710: Cannot find output file <https://builds.apache.org/job/JMeter%20Windows/ws/trunk\bin\HTMLParserTestFile_2.csv'.>
Target 'batch_scripts' failed with message 'The following error occurred while executing this line:
<https://builds.apache.org/job/JMeter%20Windows/ws/trunk\build.xml>:2765: The following error occurred while executing this line:
<https://builds.apache.org/job/JMeter%20Windows/ws/trunk\build.xml>:2710: Cannot find output file <https://builds.apache.org/job/JMeter%20Windows/ws/trunk\bin\HTMLParserTestFile_2.csv'.>
Cannot execute '_allbatchtests' - 'batchtest' failed or was not executed.
Cannot execute 'test' - '_test' failed or was not executed.
download_checkstyle:
_process_checkstyle_jars:
_check_exists:
_check_jarfile:
[echo] Checking checkstyle-8.8-all.jar
[echo] Deleting checkstyle-8.8-all.jar (excluding checkstyle-8.8-all.jar)
setproxy:
_get_jarfile:
[echo] Fetching: lib/opt/checkstyle-8.8-all.jar
[get] Getting: https://downloads.sourceforge.net/checkstyle/checkstyle/8.8/checkstyle-8.8-all.jar?ts=1518735678155&use_mirror=autoselect/checkstyle-8.8-all.jar
[get] To: <https://builds.apache.org/job/JMeter%20Windows/ws/trunk\build\checkstyle-8.8-all.jar>
[get] https://downloads.sourceforge.net/checkstyle/checkstyle/8.8/checkstyle-8.8-all.jar?ts=1518735678155&use_mirror=autoselect/checkstyle-8.8-all.jar moved to https://phoenixnap.dl.sourceforge.net/project/checkstyle/checkstyle/8.8/checkstyle-8.8-all.jar
_checkMD5:
[echo] Checksum OK: checkstyle-8.8-all.jar
[move] Moving 1 file to <https://builds.apache.org/job/JMeter%20Windows/ws/trunk\lib\opt>
[move] Attempting to rename: <https://builds.apache.org/job/JMeter%20Windows/ws/trunk\build\checkstyle-8.8-all.jar> to <https://builds.apache.org/job/JMeter%20Windows/ws/trunk\lib\opt\checkstyle-8.8-all.jar>
setproxy:
_get_zipfile:
checkstyle:
_process_checkstyle_jars:
_check_exists:
_check_jarfile:
[checkstyle] Running Checkstyle 8.8 on 1682 files
[checkstyle] [ERROR] <https://builds.apache.org/job/JMeter%20Windows/ws/trunk\test\src\org\apache\jmeter\control\TestTransactionController.java>:0: File does not end with a newline. [NewlineAtEndOfFile]
[checkstyle] [ERROR] <https://builds.apache.org/job/JMeter%20Windows/ws/trunk\test\src\org\apache\jmeter\functions\TestTimeShiftFunction.java>:0: File does not end with a newline. [NewlineAtEndOfFile]
[checkstyle] [ERROR] <https://builds.apache.org/job/JMeter%20Windows/ws/trunk\test\src\org\apache\jmeter\visualizers\backend\SamplerMetricFixedModeTest.java>:0: File does not end with a newline. [NewlineAtEndOfFile]
[checkstyle] [ERROR] <https://builds.apache.org/job/JMeter%20Windows/ws/trunk\test\src\org\apache\jmeter\visualizers\backend\SamplerMetricTimedModeTest.java>:0: File does not end with a newline. [NewlineAtEndOfFile]
Target 'checkstyle' failed with message 'Got 4 errors and 0 warnings.'.
BUILD FAILED
<https://builds.apache.org/job/JMeter%20Windows/ws/trunk\build.xml>:3577: Got 4 errors and 0 warnings.
Total time: 43 seconds
Build step 'Invoke Ant' marked build as failure
Build failed in Jenkins: JMeter Windows #1015
Posted by Apache Jenkins Server <je...@builds.apache.org>.
See <https://builds.apache.org/job/JMeter%20Windows/1015/display/redirect>
------------------------------------------
[...truncated 499.69 KB...]
[jmeter] Waiting for possible Shutdown/StopTestNow/Heapdump message on port 4445
[jmeter] summary = 2 in 00:00:31 = 0.1/s Avg: 15280 Min: 460 Max: 30100 Err: 0 (0.00%)
[jmeter] Tidying up ... @ Thu Feb 15 17:50:28 UTC 2018 (1518717028042)
[jmeter] ... end of run
[echo] Bug60607 output files compared OK
batchtest:
[echo] Starting SlowCharsFeature_HttpClient4 with file SlowCharsFeature.jmx using -X -Jdummy=dummy
[jmeter] SLF4J: Class path contains multiple SLF4J bindings.
[jmeter] SLF4J: Found binding in [jar:file:/F:/jenkins/jenkins-slave/workspace/JMeter%20Windows/trunk/lib/log4j-slf4j-impl-2.10.0.jar!/org/slf4j/impl/StaticLoggerBinder.class]
[jmeter] SLF4J: Found binding in [jar:file:/F:/jenkins/jenkins-slave/workspace/JMeter%20Windows/trunk/lib/opt/activemq-all-5.15.2.jar!/org/slf4j/impl/StaticLoggerBinder.class]
[jmeter] SLF4J: See http://www.slf4j.org/codes.html#multiple_bindings for an explanation.
[jmeter] SLF4J: Actual binding is of type [org.apache.logging.slf4j.Log4jLoggerFactory]
[jmeter] Creating summariser <summary>
[jmeter] Created the tree successfully using testfiles/SlowCharsFeature.jmx
[jmeter] Starting the test @ Thu Feb 15 17:50:31 UTC 2018 (1518717031661)
[jmeter] Waiting for possible Shutdown/StopTestNow/Heapdump message on port 4445
[jmeter] summary + 1 in 00:00:01 = 1.7/s Avg: 571 Min: 571 Max: 571 Err: 0 (0.00%) Active: 1 Started: 1 Finished: 0
[jmeter] summary + 2 in 00:00:18 = 0.1/s Avg: 8688 Min: 5925 Max: 11451 Err: 0 (0.00%) Active: 0 Started: 1 Finished: 1
[jmeter] summary = 3 in 00:00:18 = 0.2/s Avg: 5982 Min: 571 Max: 11451 Err: 0 (0.00%)
[jmeter] Tidying up ... @ Thu Feb 15 17:50:50 UTC 2018 (1518717050808)
[jmeter] ... end of run
[echo] SlowCharsFeature_HttpClient4 output files compared OK
batchtest:
[echo] Starting SlowCharsFeature_Java with file SlowCharsFeature.jmx using -X -Jjmeter.httpsampler=Java
[jmeter] SLF4J: Class path contains multiple SLF4J bindings.
[jmeter] SLF4J: Found binding in [jar:file:/F:/jenkins/jenkins-slave/workspace/JMeter%20Windows/trunk/lib/log4j-slf4j-impl-2.10.0.jar!/org/slf4j/impl/StaticLoggerBinder.class]
[jmeter] SLF4J: Found binding in [jar:file:/F:/jenkins/jenkins-slave/workspace/JMeter%20Windows/trunk/lib/opt/activemq-all-5.15.2.jar!/org/slf4j/impl/StaticLoggerBinder.class]
[jmeter] SLF4J: See http://www.slf4j.org/codes.html#multiple_bindings for an explanation.
[jmeter] SLF4J: Actual binding is of type [org.apache.logging.slf4j.Log4jLoggerFactory]
[jmeter] Creating summariser <summary>
[jmeter] Created the tree successfully using testfiles/SlowCharsFeature.jmx
[jmeter] Starting the test @ Thu Feb 15 17:50:54 UTC 2018 (1518717054304)
[jmeter] Waiting for possible Shutdown/StopTestNow/Heapdump message on port 4445
[jmeter] summary = 2 in 00:00:13 = 0.2/s Avg: 6262 Min: 520 Max: 12005 Err: 0 (0.00%)
[jmeter] Tidying up ... @ Thu Feb 15 17:51:07 UTC 2018 (1518717067975)
[jmeter] ... end of run
[echo] SlowCharsFeature_Java output files compared OK
batchtest:
[echo] Starting Http4ImplPreemptiveBasicAuth with file Http4ImplPreemptiveBasicAuth.jmx using -X -Jdummy=dummy
[jmeter] SLF4J: Class path contains multiple SLF4J bindings.
[jmeter] SLF4J: Found binding in [jar:file:/F:/jenkins/jenkins-slave/workspace/JMeter%20Windows/trunk/lib/log4j-slf4j-impl-2.10.0.jar!/org/slf4j/impl/StaticLoggerBinder.class]
[jmeter] SLF4J: Found binding in [jar:file:/F:/jenkins/jenkins-slave/workspace/JMeter%20Windows/trunk/lib/opt/activemq-all-5.15.2.jar!/org/slf4j/impl/StaticLoggerBinder.class]
[jmeter] SLF4J: See http://www.slf4j.org/codes.html#multiple_bindings for an explanation.
[jmeter] SLF4J: Actual binding is of type [org.apache.logging.slf4j.Log4jLoggerFactory]
[jmeter] Creating summariser <summary>
[jmeter] Created the tree successfully using testfiles/Http4ImplPreemptiveBasicAuth.jmx
[jmeter] Starting the test @ Thu Feb 15 17:51:11 UTC 2018 (1518717071215)
[jmeter] Waiting for possible Shutdown/StopTestNow/Heapdump message on port 4445
[jmeter] summary = 12 in 00:00:09 = 1.4/s Avg: 431 Min: 150 Max: 1444 Err: 0 (0.00%)
[jmeter] Tidying up ... @ Thu Feb 15 17:51:21 UTC 2018 (1518717081216)
[jmeter] ... end of run
[echo] Http4ImplPreemptiveBasicAuth output files compared OK
batchtest:
[echo] Starting Http4ImplPreemptiveBasicAuth with file Http4ImplPreemptiveBasicAuth.jmx using -X -Jjmeter.httpsampler=Java
[jmeter] SLF4J: Class path contains multiple SLF4J bindings.
[jmeter] SLF4J: Found binding in [jar:file:/F:/jenkins/jenkins-slave/workspace/JMeter%20Windows/trunk/lib/log4j-slf4j-impl-2.10.0.jar!/org/slf4j/impl/StaticLoggerBinder.class]
[jmeter] SLF4J: Found binding in [jar:file:/F:/jenkins/jenkins-slave/workspace/JMeter%20Windows/trunk/lib/opt/activemq-all-5.15.2.jar!/org/slf4j/impl/StaticLoggerBinder.class]
[jmeter] SLF4J: See http://www.slf4j.org/codes.html#multiple_bindings for an explanation.
[jmeter] SLF4J: Actual binding is of type [org.apache.logging.slf4j.Log4jLoggerFactory]
[jmeter] Creating summariser <summary>
[jmeter] Created the tree successfully using testfiles/Http4ImplPreemptiveBasicAuth.jmx
[jmeter] Starting the test @ Thu Feb 15 17:51:24 UTC 2018 (1518717084127)
[jmeter] Waiting for possible Shutdown/StopTestNow/Heapdump message on port 4445
[jmeter] summary + 7 in 00:00:05 = 1.5/s Avg: 345 Min: 151 Max: 1316 Err: 0 (0.00%) Active: 1 Started: 4 Finished: 3
[jmeter] summary + 5 in 00:00:02 = 2.8/s Avg: 153 Min: 152 Max: 154 Err: 0 (0.00%) Active: 0 Started: 6 Finished: 6
[jmeter] summary = 12 in 00:00:07 = 1.8/s Avg: 265 Min: 151 Max: 1316 Err: 0 (0.00%)
[jmeter] Tidying up ... @ Thu Feb 15 17:51:32 UTC 2018 (1518717092106)
[jmeter] ... end of run
[echo] Http4ImplPreemptiveBasicAuth output files compared OK
batchtest:
[echo] Starting TestKeepAlive with file TestKeepAlive.jmx using -X -Jdummy=dummy
[jmeter] SLF4J: Class path contains multiple SLF4J bindings.
[jmeter] SLF4J: Found binding in [jar:file:/F:/jenkins/jenkins-slave/workspace/JMeter%20Windows/trunk/lib/log4j-slf4j-impl-2.10.0.jar!/org/slf4j/impl/StaticLoggerBinder.class]
[jmeter] SLF4J: Found binding in [jar:file:/F:/jenkins/jenkins-slave/workspace/JMeter%20Windows/trunk/lib/opt/activemq-all-5.15.2.jar!/org/slf4j/impl/StaticLoggerBinder.class]
[jmeter] SLF4J: See http://www.slf4j.org/codes.html#multiple_bindings for an explanation.
[jmeter] SLF4J: Actual binding is of type [org.apache.logging.slf4j.Log4jLoggerFactory]
[jmeter] Creating summariser <summary>
[jmeter] Created the tree successfully using testfiles/TestKeepAlive.jmx
[jmeter] Starting the test @ Thu Feb 15 17:51:35 UTC 2018 (1518717095690)
[jmeter] Waiting for possible Shutdown/StopTestNow/Heapdump message on port 4445
[jmeter] summary = 7 in 00:01:03 = 0.1/s Avg: 319 Min: 152 Max: 683 Err: 0 (0.00%)
[jmeter] Tidying up ... @ Thu Feb 15 17:52:39 UTC 2018 (1518717159687)
[jmeter] ... end of run
[echo] TestKeepAlive output files compared OK
batchtest:
[echo] Starting ResponseDecompression with file ResponseDecompression.jmx using -X -Jdummy=dummy
[jmeter] SLF4J: Class path contains multiple SLF4J bindings.
[jmeter] SLF4J: Found binding in [jar:file:/F:/jenkins/jenkins-slave/workspace/JMeter%20Windows/trunk/lib/log4j-slf4j-impl-2.10.0.jar!/org/slf4j/impl/StaticLoggerBinder.class]
[jmeter] SLF4J: Found binding in [jar:file:/F:/jenkins/jenkins-slave/workspace/JMeter%20Windows/trunk/lib/opt/activemq-all-5.15.2.jar!/org/slf4j/impl/StaticLoggerBinder.class]
[jmeter] SLF4J: See http://www.slf4j.org/codes.html#multiple_bindings for an explanation.
[jmeter] SLF4J: Actual binding is of type [org.apache.logging.slf4j.Log4jLoggerFactory]
[jmeter] Creating summariser <summary>
[jmeter] Created the tree successfully using testfiles/ResponseDecompression.jmx
[jmeter] Starting the test @ Thu Feb 15 17:52:42 UTC 2018 (1518717162929)
[jmeter] Waiting for possible Shutdown/StopTestNow/Heapdump message on port 4445
[jmeter] summary = 6 in 00:00:03 = 1.9/s Avg: 476 Min: 112 Max: 985 Err: 0 (0.00%)
[jmeter] Tidying up ... @ Thu Feb 15 17:52:46 UTC 2018 (1518717166940)
[jmeter] ... end of run
[echo] ResponseDecompression output files compared OK
batchtest:
[echo] Starting TestHeaderManager with file TestHeaderManager.jmx using -X -Jdummy=dummy
[jmeter] SLF4J: Class path contains multiple SLF4J bindings.
[jmeter] SLF4J: Found binding in [jar:file:/F:/jenkins/jenkins-slave/workspace/JMeter%20Windows/trunk/lib/log4j-slf4j-impl-2.10.0.jar!/org/slf4j/impl/StaticLoggerBinder.class]
[jmeter] SLF4J: Found binding in [jar:file:/F:/jenkins/jenkins-slave/workspace/JMeter%20Windows/trunk/lib/opt/activemq-all-5.15.2.jar!/org/slf4j/impl/StaticLoggerBinder.class]
[jmeter] SLF4J: See http://www.slf4j.org/codes.html#multiple_bindings for an explanation.
[jmeter] SLF4J: Actual binding is of type [org.apache.logging.slf4j.Log4jLoggerFactory]
[jmeter] Creating summariser <summary>
[jmeter] Created the tree successfully using testfiles/TestHeaderManager.jmx
[jmeter] Starting the test @ Thu Feb 15 17:52:50 UTC 2018 (1518717170186)
[jmeter] Waiting for possible Shutdown/StopTestNow/Heapdump message on port 4445
[jmeter] summary = 3 in 00:00:06 = 0.5/s Avg: 2034 Min: 2001 Max: 2095 Err: 0 (0.00%)
[jmeter] Tidying up ... @ Thu Feb 15 17:52:57 UTC 2018 (1518717177468)
[jmeter] ... end of run
[echo] TestHeaderManager output files compared OK
batchtest:
[echo] Starting TestHeaderManager with file TestHeaderManager.jmx using -X -Jjmeter.httpsampler=Java
[jmeter] SLF4J: Class path contains multiple SLF4J bindings.
[jmeter] SLF4J: Found binding in [jar:file:/F:/jenkins/jenkins-slave/workspace/JMeter%20Windows/trunk/lib/log4j-slf4j-impl-2.10.0.jar!/org/slf4j/impl/StaticLoggerBinder.class]
[jmeter] SLF4J: Found binding in [jar:file:/F:/jenkins/jenkins-slave/workspace/JMeter%20Windows/trunk/lib/opt/activemq-all-5.15.2.jar!/org/slf4j/impl/StaticLoggerBinder.class]
[jmeter] SLF4J: See http://www.slf4j.org/codes.html#multiple_bindings for an explanation.
[jmeter] SLF4J: Actual binding is of type [org.apache.logging.slf4j.Log4jLoggerFactory]
[jmeter] Creating summariser <summary>
[jmeter] Created the tree successfully using testfiles/TestHeaderManager.jmx
[jmeter] Starting the test @ Thu Feb 15 17:53:00 UTC 2018 (1518717180483)
[jmeter] Waiting for possible Shutdown/StopTestNow/Heapdump message on port 4445
[jmeter] summary + 1 in 00:00:01 = 0.8/s Avg: 1038 Min: 1038 Max: 1038 Err: 0 (0.00%) Active: 1 Started: 1 Finished: 0
[jmeter] summary + 2 in 00:00:02 = 1.0/s Avg: 1003 Min: 1002 Max: 1005 Err: 0 (0.00%) Active: 0 Started: 2 Finished: 2
[jmeter] summary = 3 in 00:00:03 = 0.9/s Avg: 1015 Min: 1002 Max: 1038 Err: 0 (0.00%)
[jmeter] Tidying up ... @ Thu Feb 15 17:53:04 UTC 2018 (1518717184542)
[jmeter] ... end of run
[echo] TestHeaderManager output files compared OK
batchtest:
[echo] Starting TEST_HTTP_HttpClient4 with file TEST_HTTP.jmx using -X -Jjmeter.httpsampler=HttpClient4
[jmeter] SLF4J: Class path contains multiple SLF4J bindings.
[jmeter] SLF4J: Found binding in [jar:file:/F:/jenkins/jenkins-slave/workspace/JMeter%20Windows/trunk/lib/log4j-slf4j-impl-2.10.0.jar!/org/slf4j/impl/StaticLoggerBinder.class]
[jmeter] SLF4J: Found binding in [jar:file:/F:/jenkins/jenkins-slave/workspace/JMeter%20Windows/trunk/lib/opt/activemq-all-5.15.2.jar!/org/slf4j/impl/StaticLoggerBinder.class]
[jmeter] SLF4J: See http://www.slf4j.org/codes.html#multiple_bindings for an explanation.
[jmeter] SLF4J: Actual binding is of type [org.apache.logging.slf4j.Log4jLoggerFactory]
[jmeter] Creating summariser <summary>
[jmeter] Created the tree successfully using testfiles/TEST_HTTP.jmx
[jmeter] Starting the test @ Thu Feb 15 17:53:07 UTC 2018 (1518717187883)
[jmeter] Waiting for possible Shutdown/StopTestNow/Heapdump message on port 4445
[jmeter] summary = 22 in 00:00:02 = 10.9/s Avg: 65 Min: 1 Max: 673 Err: 0 (0.00%)
[jmeter] Tidying up ... @ Thu Feb 15 17:53:10 UTC 2018 (1518717190556)
[jmeter] ... end of run
[echo] TEST_HTTP_HttpClient4 output files compared OK
batchtest:
[echo] Starting TEST_HTTP_Java with file TEST_HTTP.jmx using -X -Jjmeter.httpsampler=Java
[jmeter] SLF4J: Class path contains multiple SLF4J bindings.
[jmeter] SLF4J: Found binding in [jar:file:/F:/jenkins/jenkins-slave/workspace/JMeter%20Windows/trunk/lib/log4j-slf4j-impl-2.10.0.jar!/org/slf4j/impl/StaticLoggerBinder.class]
[jmeter] SLF4J: Found binding in [jar:file:/F:/jenkins/jenkins-slave/workspace/JMeter%20Windows/trunk/lib/opt/activemq-all-5.15.2.jar!/org/slf4j/impl/StaticLoggerBinder.class]
[jmeter] SLF4J: See http://www.slf4j.org/codes.html#multiple_bindings for an explanation.
[jmeter] SLF4J: Actual binding is of type [org.apache.logging.slf4j.Log4jLoggerFactory]
[jmeter] Creating summariser <summary>
[jmeter] Created the tree successfully using testfiles/TEST_HTTP.jmx
[jmeter] Starting the test @ Thu Feb 15 17:53:15 UTC 2018 (1518717195520)
[jmeter] Waiting for possible Shutdown/StopTestNow/Heapdump message on port 4445
[jmeter] summary = 20 in 00:00:02 = 11.5/s Avg: 57 Min: 2 Max: 614 Err: 0 (0.00%)
[jmeter] Tidying up ... @ Thu Feb 15 17:53:18 UTC 2018 (1518717198023)
[jmeter] ... end of run
[concat] 2018-02-15 17:53:17,782 ERROR o.a.j.p.h.s.HTTPJavaImpl: readResponse: java.net.ProtocolException: Server redirected too many times (20)
[concat] 2018-02-15 17:53:17,787 ERROR o.a.j.p.h.s.HTTPJavaImpl: Cause: java.net.ProtocolException: Server redirected too many times (20)
[concat] 2018-02-15 17:53:17,794 ERROR o.a.j.p.h.c.HttpMirrorThread: Invalid request received:''
[echo] TEST_HTTP_Java output files compared OK
batchtest:
[echo] Starting TestSchedulerWithTimer with file TestSchedulerWithTimer.jmx using -X -Jdummy=dummy
[jmeter] SLF4J: Class path contains multiple SLF4J bindings.
[jmeter] SLF4J: Found binding in [jar:file:/F:/jenkins/jenkins-slave/workspace/JMeter%20Windows/trunk/lib/log4j-slf4j-impl-2.10.0.jar!/org/slf4j/impl/StaticLoggerBinder.class]
[jmeter] SLF4J: Found binding in [jar:file:/F:/jenkins/jenkins-slave/workspace/JMeter%20Windows/trunk/lib/opt/activemq-all-5.15.2.jar!/org/slf4j/impl/StaticLoggerBinder.class]
[jmeter] SLF4J: See http://www.slf4j.org/codes.html#multiple_bindings for an explanation.
[jmeter] SLF4J: Actual binding is of type [org.apache.logging.slf4j.Log4jLoggerFactory]
[jmeter] Creating summariser <summary>
[jmeter] Created the tree successfully using testfiles/TestSchedulerWithTimer.jmx
[jmeter] Starting the test @ Thu Feb 15 17:53:21 UTC 2018 (1518717201793)
[jmeter] Waiting for possible Shutdown/StopTestNow/Heapdump message on port 4445
[jmeter] summary = 6 in 00:00:06 = 1.0/s Avg: 118 Min: 0 Max: 591 Err: 0 (0.00%)
[jmeter] Tidying up ... @ Thu Feb 15 17:53:28 UTC 2018 (1518717208944)
[jmeter] ... end of run
[echo] TestSchedulerWithTimer output files compared OK
_allbatchtests:
test:
download_checkstyle:
_process_checkstyle_jars:
_check_exists:
_check_jarfile:
[echo] Checking checkstyle-8.8-all.jar
[echo] Deleting checkstyle-8.8-all.jar (excluding checkstyle-8.8-all.jar)
setproxy:
_get_jarfile:
[echo] Fetching: lib/opt/checkstyle-8.8-all.jar
[get] Getting: https://downloads.sourceforge.net/checkstyle/checkstyle/8.8/checkstyle-8.8-all.jar?ts=1518716596956&use_mirror=autoselect/checkstyle-8.8-all.jar
[get] To: <https://builds.apache.org/job/JMeter%20Windows/ws/trunk\build\checkstyle-8.8-all.jar>
[get] https://downloads.sourceforge.net/checkstyle/checkstyle/8.8/checkstyle-8.8-all.jar?ts=1518716596956&use_mirror=autoselect/checkstyle-8.8-all.jar moved to https://netix.dl.sourceforge.net/project/checkstyle/checkstyle/8.8/checkstyle-8.8-all.jar
_checkMD5:
[echo] Checksum OK: checkstyle-8.8-all.jar
[move] Moving 1 file to <https://builds.apache.org/job/JMeter%20Windows/ws/trunk\lib\opt>
[move] Attempting to rename: <https://builds.apache.org/job/JMeter%20Windows/ws/trunk\build\checkstyle-8.8-all.jar> to <https://builds.apache.org/job/JMeter%20Windows/ws/trunk\lib\opt\checkstyle-8.8-all.jar>
setproxy:
_get_zipfile:
checkstyle:
_process_checkstyle_jars:
_check_exists:
_check_jarfile:
[checkstyle] Running Checkstyle 8.8 on 1682 files
[checkstyle] [ERROR] <https://builds.apache.org/job/JMeter%20Windows/ws/trunk\test\src\org\apache\jmeter\assertions\MD5HexAssertionSpec.groovy>:0: File does not end with a newline. [NewlineAtEndOfFile]
[checkstyle] [ERROR] <https://builds.apache.org/job/JMeter%20Windows/ws/trunk\test\src\org\apache\jmeter\control\RandomOrderControllerSpec.groovy>:0: File does not end with a newline. [NewlineAtEndOfFile]
[checkstyle] [ERROR] <https://builds.apache.org/job/JMeter%20Windows/ws/trunk\test\src\org\apache\jmeter\control\TestTransactionController.java>:0: File does not end with a newline. [NewlineAtEndOfFile]
[checkstyle] [ERROR] <https://builds.apache.org/job/JMeter%20Windows/ws/trunk\test\src\org\apache\jmeter\control\ThroughputControllerSpec.groovy>:0: File does not end with a newline. [NewlineAtEndOfFile]
[checkstyle] [ERROR] <https://builds.apache.org/job/JMeter%20Windows/ws/trunk\test\src\org\apache\jmeter\engine\util\PackageSpec.groovy>:0: File does not end with a newline. [NewlineAtEndOfFile]
[checkstyle] [ERROR] <https://builds.apache.org/job/JMeter%20Windows/ws/trunk\test\src\org\apache\jmeter\extractor\BoundaryExtractorSpec.groovy>:0: File does not end with a newline. [NewlineAtEndOfFile]
[checkstyle] [ERROR] <https://builds.apache.org/job/JMeter%20Windows/ws/trunk\test\src\org\apache\jmeter\functions\TestTimeShiftFunction.java>:0: File does not end with a newline. [NewlineAtEndOfFile]
[checkstyle] [ERROR] <https://builds.apache.org/job/JMeter%20Windows/ws/trunk\test\src\org\apache\jmeter\report\core\SampleMetadataParserSpec.groovy>:0: File does not end with a newline. [NewlineAtEndOfFile]
[checkstyle] [ERROR] <https://builds.apache.org/job/JMeter%20Windows/ws/trunk\test\src\org\apache\jmeter\services\FileServerSpec.groovy>:0: File does not end with a newline. [NewlineAtEndOfFile]
[checkstyle] [ERROR] <https://builds.apache.org/job/JMeter%20Windows/ws/trunk\test\src\org\apache\jmeter\visualizers\backend\SamplerMetricFixedModeTest.java>:0: File does not end with a newline. [NewlineAtEndOfFile]
[checkstyle] [ERROR] <https://builds.apache.org/job/JMeter%20Windows/ws/trunk\test\src\org\apache\jmeter\visualizers\backend\SamplerMetricTimedModeTest.java>:0: File does not end with a newline. [NewlineAtEndOfFile]
[checkstyle] [ERROR] <https://builds.apache.org/job/JMeter%20Windows/ws/trunk\test\src\org\apache\jorphan\io\TextFileSpec.groovy>:0: File does not end with a newline. [NewlineAtEndOfFile]
Target 'checkstyle' failed with message 'Got 12 errors and 0 warnings.'.
BUILD FAILED
<https://builds.apache.org/job/JMeter%20Windows/ws/trunk\build.xml>:3577: Got 12 errors and 0 warnings.
Total time: 10 minutes 34 seconds
Build step 'Invoke Ant' marked build as failure