You are viewing a plain text version of this content. The canonical link for it is here.
Posted to builds@solr.apache.org by Apache Jenkins Server <je...@builds.apache.org> on 2026/01/23 17:00:41 UTC

[JENKINS] Solr » Solr-Test-9.10 - Build # 570 - Still Failing!

Build: https://ci-builds.apache.org/job/Solr/job/Solr-Test-9.10/570/

All tests passed

Build Log:
[...truncated 443 lines...]
BUILD FAILED in 41m 25s
165 actionable tasks: 165 executed

Publishing build scan...
https://develocity.apache.org/s/t6y5swfomwzoy

Build step 'Invoke Gradle script' changed build result to FAILURE
Build step 'Invoke Gradle script' marked build as failure
Archiving artifacts
Recording test results
[Checks API] No suitable checks publisher found.
Email was triggered for: Failure - Any
Sending email for trigger: Failure - Any

[JENKINS] Solr » Solr-Test-9.10 - Build # 572 - Still Failing!

Posted by Apache Jenkins Server <je...@builds.apache.org>.
Build: https://ci-builds.apache.org/job/Solr/job/Solr-Test-9.10/572/

All tests passed

Build Log:
[...truncated 443 lines...]
BUILD FAILED in 40m 41s
165 actionable tasks: 165 executed

Publishing build scan...
https://develocity.apache.org/s/i7hakfoot2qtu

Build step 'Invoke Gradle script' changed build result to FAILURE
Build step 'Invoke Gradle script' marked build as failure
Archiving artifacts
Recording test results
[Checks API] No suitable checks publisher found.
Email was triggered for: Failure - Any
Sending email for trigger: Failure - Any

[JENKINS] Solr » Solr-Test-9.10 - Build # 571 - Still Failing!

Posted by Apache Jenkins Server <je...@builds.apache.org>.
Build: https://ci-builds.apache.org/job/Solr/job/Solr-Test-9.10/571/

All tests passed

Build Log:
[...truncated 445 lines...]
BUILD FAILED in 40m 53s
165 actionable tasks: 165 executed

Publishing build scan...
https://develocity.apache.org/s/lap4aj2jtwbcs

Build step 'Invoke Gradle script' changed build result to FAILURE
Build step 'Invoke Gradle script' marked build as failure
Archiving artifacts
Recording test results
[Checks API] No suitable checks publisher found.
Email was triggered for: Failure - Any
Sending email for trigger: Failure - Any