You are viewing a plain text version of this content. The canonical link for it is here.
Posted to builds@solr.apache.org by Policeman Jenkins Server <je...@thetaphi.de> on 2025/12/18 19:56:35 UTC

[JENKINS] Solr-main-Linux (64bit/hotspot/jdk-24) - Build # 29758 - Still unstable!

Build: https://jenkins.thetaphi.de/job/Solr-main-Linux/29758/
Java: 64bit/hotspot/jdk-24 -XX:-UseCompressedOops -XX:+UseSerialGC

1 tests failed.
FAILED:  org.apache.solr.gcs.GCSIncrementalBackupTest.testSkipConfigset

Error Message:
org.apache.solr.common.SolrException: Could not find a healthy node to handle the request.

Stack Trace:
org.apache.solr.common.SolrException: Could not find a healthy node to handle the request.
	at __randomizedtesting.SeedInfo.seed([B87C45EB4CB6CFB4:B385DAE2D4F499A3]:0)
	at app//org.apache.solr.client.solrj.impl.CloudSolrClient.sendRequest(CloudSolrClient.java:1564)
	at app//org.apache.solr.client.solrj.impl.CloudSolrClient.requestWithRetryOnStaleState(CloudSolrClient.java:1206)
	at app//org.apache.solr.client.solrj.impl.CloudSolrClient.requestWithRetryOnStaleState(CloudSolrClient.java:1391)
	at app//org.apache.solr.client.solrj.impl.CloudSolrClient.requestWithRetryOnStaleState(CloudSolrClient.java:1391)
	at app//org.apache.solr.client.solrj.impl.CloudSolrClient.requestWithRetryOnStaleState(CloudSolrClient.java:1391)
	at app//org.apache.solr.client.solrj.impl.CloudSolrClient.requestWithRetryOnStaleState(CloudSolrClient.java:1382)
	at app//org.apache.solr.client.solrj.impl.CloudSolrClient.requestWithRetryOnStaleState(CloudSolrClient.java:1367)
	at app//org.apache.solr.client.solrj.impl.CloudSolrClient.request(CloudSolrClient.java:1128)
	at app//org.apache.solr.client.solrj.SolrRequest.process(SolrRequest.java:286)
	at app//org.apache.solr.client.solrj.SolrClient.query(SolrClient.java:928)
	at app//org.apache.solr.cloud.api.collections.AbstractIncrementalBackupTest.testSkipConfigset(AbstractIncrementalBackupTest.java:418)
	at java.base@24/jdk.internal.reflect.DirectMethodHandleAccessor.invoke(DirectMethodHandleAccessor.java:104)
	at java.base@24/java.lang.reflect.Method.invoke(Method.java:565)
	at app//com.carrotsearch.randomizedtesting.RandomizedRunner.invoke(RandomizedRunner.java:1763)
	at app//com.carrotsearch.randomizedtesting.RandomizedRunner$8.evaluate(RandomizedRunner.java:946)
	at app//com.carrotsearch.randomizedtesting.RandomizedRunner$9.evaluate(RandomizedRunner.java:982)
	at app//com.carrotsearch.randomizedtesting.RandomizedRunner$10.evaluate(RandomizedRunner.java:996)
	at app//com.carrotsearch.randomizedtesting.rules.SystemPropertiesRestoreRule$1.evaluate(SystemPropertiesRestoreRule.java:80)
	at app//org.junit.rules.RunRules.evaluate(RunRules.java:20)
	at app//org.apache.lucene.tests.util.TestRuleSetupTeardownChained$1.evaluate(TestRuleSetupTeardownChained.java:48)
	at app//org.apache.lucene.tests.util.AbstractBeforeAfterRule$1.evaluate(AbstractBeforeAfterRule.java:43)
	at app//org.apache.lucene.tests.util.TestRuleThreadAndTestName$1.evaluate(TestRuleThreadAndTestName.java:45)
	at app//org.apache.lucene.tests.util.TestRuleIgnoreAfterMaxFailures$1.evaluate(TestRuleIgnoreAfterMaxFailures.java:60)
	at app//org.apache.lucene.tests.util.TestRuleMarkFailure$1.evaluate(TestRuleMarkFailure.java:44)
	at app//org.junit.rules.RunRules.evaluate(RunRules.java:20)
	at app//com.carrotsearch.randomizedtesting.rules.StatementAdapter.evaluate(StatementAdapter.java:36)
	at app//com.carrotsearch.randomizedtesting.ThreadLeakControl$StatementRunner.run(ThreadLeakControl.java:390)
	at app//com.carrotsearch.randomizedtesting.ThreadLeakControl.forkTimeoutingTask(ThreadLeakControl.java:843)
	at app//com.carrotsearch.randomizedtesting.ThreadLeakControl$3.evaluate(ThreadLeakControl.java:490)
	at app//com.carrotsearch.randomizedtesting.RandomizedRunner.runSingleTest(RandomizedRunner.java:955)
	at app//com.carrotsearch.randomizedtesting.RandomizedRunner$5.evaluate(RandomizedRunner.java:840)
	at app//com.carrotsearch.randomizedtesting.RandomizedRunner$6.evaluate(RandomizedRunner.java:891)
	at app//com.carrotsearch.randomizedtesting.RandomizedRunner$7.evaluate(RandomizedRunner.java:902)
	at app//com.carrotsearch.randomizedtesting.rules.StatementAdapter.evaluate(StatementAdapter.java:36)
	at app//com.carrotsearch.randomizedtesting.rules.StatementAdapter.evaluate(StatementAdapter.java:36)
	at app//org.apache.lucene.tests.util.AbstractBeforeAfterRule$1.evaluate(AbstractBeforeAfterRule.java:43)
	at app//com.carrotsearch.randomizedtesting.rules.SystemPropertiesRestoreRule$1.evaluate(SystemPropertiesRestoreRule.java:80)
	at app//org.junit.rules.RunRules.evaluate(RunRules.java:20)
	at app//org.apache.lucene.tests.util.AbstractBeforeAfterRule$1.evaluate(AbstractBeforeAfterRule.java:43)
	at app//com.carrotsearch.randomizedtesting.rules.StatementAdapter.evaluate(StatementAdapter.java:36)
	at app//org.apache.lucene.tests.util.TestRuleStoreClassName$1.evaluate(TestRuleStoreClassName.java:38)
	at app//com.carrotsearch.randomizedtesting.rules.NoShadowingOrOverridesOnMethodsRule$1.evaluate(NoShadowingOrOverridesOnMethodsRule.java:40)
	at app//com.carrotsearch.randomizedtesting.rules.NoShadowingOrOverridesOnMethodsRule$1.evaluate(NoShadowingOrOverridesOnMethodsRule.java:40)
	at app//com.carrotsearch.randomizedtesting.rules.StatementAdapter.evaluate(StatementAdapter.java:36)
	at app//com.carrotsearch.randomizedtesting.rules.StatementAdapter.evaluate(StatementAdapter.java:36)
	at app//org.apache.lucene.tests.util.TestRuleAssertionsRequired$1.evaluate(TestRuleAssertionsRequired.java:53)
	at app//org.apache.lucene.tests.util.AbstractBeforeAfterRule$1.evaluate(AbstractBeforeAfterRule.java:43)
	at app//org.apache.lucene.tests.util.TestRuleMarkFailure$1.evaluate(TestRuleMarkFailure.java:44)
	at app//org.apache.lucene.tests.util.TestRuleIgnoreAfterMaxFailures$1.evaluate(TestRuleIgnoreAfterMaxFailures.java:60)
	at app//org.apache.lucene.tests.util.TestRuleIgnoreTestSuites$1.evaluate(TestRuleIgnoreTestSuites.java:47)
	at app//org.junit.rules.RunRules.evaluate(RunRules.java:20)
	at app//com.carrotsearch.randomizedtesting.rules.StatementAdapter.evaluate(StatementAdapter.java:36)
	at app//com.carrotsearch.randomizedtesting.ThreadLeakControl$StatementRunner.run(ThreadLeakControl.java:390)
	at app//com.carrotsearch.randomizedtesting.ThreadLeakControl.lambda$forkTimeoutingTask$0(ThreadLeakControl.java:850)
	at java.base@24/java.lang.Thread.run(Thread.java:1447)

[JENKINS] Solr-main-Linux (64bit/hotspot/jdk-24) - Build # 29761 - Still Unstable!

Posted by Policeman Jenkins Server <je...@thetaphi.de>.
Build: https://jenkins.thetaphi.de/job/Solr-main-Linux/29761/
Java: 64bit/hotspot/jdk-24 -XX:-UseCompressedOops -XX:+UseG1GC

4 tests failed.
FAILED:  org.apache.solr.search.vector.KnnQParserChildTest.testDiverseKids

Error Message:
java.lang.AssertionError

Stack Trace:
java.lang.AssertionError
	at org.apache.solr.util.RTimer.stop(RTimer.java:84)
	at org.apache.solr.metrics.otel.instruments.AttributedLongTimer$MetricTimer.stop(AttributedLongTimer.java:64)
	at org.apache.solr.update.SolrIndexWriter.updateMergeMetrics(SolrIndexWriter.java:315)
	at org.apache.solr.update.SolrIndexWriter.merge(SolrIndexWriter.java:225)
	at org.apache.lucene.index.IndexWriter$IndexWriterMergeSource.merge(IndexWriter.java:6601)
	at org.apache.lucene.index.ConcurrentMergeScheduler.doMerge(ConcurrentMergeScheduler.java:668)
	at org.apache.lucene.index.ConcurrentMergeScheduler$MergeThread.run(ConcurrentMergeScheduler.java:729)


FAILED:  org.apache.solr.search.vector.KnnQParserChildTest.testDiverseKids

Error Message:
java.lang.AssertionError

Stack Trace:
java.lang.AssertionError
	at org.apache.solr.util.RTimer.stop(RTimer.java:84)
	at org.apache.solr.metrics.otel.instruments.AttributedLongTimer$MetricTimer.stop(AttributedLongTimer.java:64)
	at org.apache.solr.update.SolrIndexWriter.updateMergeMetrics(SolrIndexWriter.java:315)
	at org.apache.solr.update.SolrIndexWriter.merge(SolrIndexWriter.java:225)
	at org.apache.lucene.index.IndexWriter$IndexWriterMergeSource.merge(IndexWriter.java:6601)
	at org.apache.lucene.index.ConcurrentMergeScheduler.doMerge(ConcurrentMergeScheduler.java:668)
	at org.apache.lucene.index.ConcurrentMergeScheduler$MergeThread.run(ConcurrentMergeScheduler.java:729)


FAILED:  org.apache.solr.search.vector.KnnQParserChildTest.testDiverseKids

Error Message:
java.lang.AssertionError

Stack Trace:
java.lang.AssertionError
	at org.apache.solr.util.RTimer.stop(RTimer.java:84)
	at org.apache.solr.metrics.otel.instruments.AttributedLongTimer$MetricTimer.stop(AttributedLongTimer.java:64)
	at org.apache.solr.update.SolrIndexWriter.updateMergeMetrics(SolrIndexWriter.java:315)
	at org.apache.solr.update.SolrIndexWriter.merge(SolrIndexWriter.java:225)
	at org.apache.lucene.index.IndexWriter$IndexWriterMergeSource.merge(IndexWriter.java:6601)
	at org.apache.lucene.index.ConcurrentMergeScheduler.doMerge(ConcurrentMergeScheduler.java:668)
	at org.apache.lucene.index.ConcurrentMergeScheduler$MergeThread.run(ConcurrentMergeScheduler.java:729)


FAILED:  org.apache.solr.search.vector.KnnQParserChildTest.testDiverseKids

Error Message:
java.lang.AssertionError

Stack Trace:
java.lang.AssertionError
	at org.apache.solr.util.RTimer.stop(RTimer.java:84)
	at org.apache.solr.metrics.otel.instruments.AttributedLongTimer$MetricTimer.stop(AttributedLongTimer.java:64)
	at org.apache.solr.update.SolrIndexWriter.updateMergeMetrics(SolrIndexWriter.java:315)
	at org.apache.solr.update.SolrIndexWriter.merge(SolrIndexWriter.java:225)
	at org.apache.lucene.index.IndexWriter$IndexWriterMergeSource.merge(IndexWriter.java:6601)
	at org.apache.lucene.index.ConcurrentMergeScheduler.doMerge(ConcurrentMergeScheduler.java:668)
	at org.apache.lucene.index.ConcurrentMergeScheduler$MergeThread.run(ConcurrentMergeScheduler.java:729)

[JENKINS] Solr-main-Linux (64bit/hotspot/jdk-23.0.2) - Build # 29760 - Still Unstable!

Posted by Policeman Jenkins Server <je...@thetaphi.de>.
Build: https://jenkins.thetaphi.de/job/Solr-main-Linux/29760/
Java: 64bit/hotspot/jdk-23.0.2 -XX:+UseCompressedOops -XX:+UseParallelGC

8 tests failed.
FAILED:  org.apache.solr.search.vector.KnnQParserChildTest.classMethod

Error Message:
java.lang.AssertionError

Stack Trace:
java.lang.AssertionError
	at org.apache.solr.util.RTimer.stop(RTimer.java:84)
	at org.apache.solr.metrics.otel.instruments.AttributedLongTimer$MetricTimer.stop(AttributedLongTimer.java:64)
	at org.apache.solr.update.SolrIndexWriter.updateMergeMetrics(SolrIndexWriter.java:315)
	at org.apache.solr.update.SolrIndexWriter.merge(SolrIndexWriter.java:225)
	at org.apache.lucene.index.IndexWriter$IndexWriterMergeSource.merge(IndexWriter.java:6601)
	at org.apache.lucene.index.ConcurrentMergeScheduler.doMerge(ConcurrentMergeScheduler.java:668)
	at org.apache.lucene.index.ConcurrentMergeScheduler$MergeThread.run(ConcurrentMergeScheduler.java:729)


FAILED:  org.apache.solr.search.vector.KnnQParserChildTest.classMethod

Error Message:
java.lang.AssertionError

Stack Trace:
java.lang.AssertionError
	at org.apache.solr.util.RTimer.stop(RTimer.java:84)
	at org.apache.solr.metrics.otel.instruments.AttributedLongTimer$MetricTimer.stop(AttributedLongTimer.java:64)
	at org.apache.solr.update.SolrIndexWriter.updateMergeMetrics(SolrIndexWriter.java:315)
	at org.apache.solr.update.SolrIndexWriter.merge(SolrIndexWriter.java:225)
	at org.apache.lucene.index.IndexWriter$IndexWriterMergeSource.merge(IndexWriter.java:6601)
	at org.apache.lucene.index.ConcurrentMergeScheduler.doMerge(ConcurrentMergeScheduler.java:668)
	at org.apache.lucene.index.ConcurrentMergeScheduler$MergeThread.run(ConcurrentMergeScheduler.java:729)


FAILED:  org.apache.solr.search.vector.KnnQParserChildTest.classMethod

Error Message:
java.lang.AssertionError: Nodes are added in the incorrect order! Comparing NaN to [NaN]

Stack Trace:
java.lang.AssertionError: Nodes are added in the incorrect order! Comparing NaN to [NaN]
	at org.apache.lucene.util.hnsw.NeighborArray.addInOrder(NeighborArray.java:80)
	at org.apache.lucene.util.hnsw.HnswGraphBuilder.popToScratch(HnswGraphBuilder.java:420)
	at org.apache.lucene.util.hnsw.HnswGraphBuilder.addGraphNodeInternal(HnswGraphBuilder.java:273)
	at org.apache.lucene.util.hnsw.HnswGraphBuilder.addGraphNodeWithEps(HnswGraphBuilder.java:331)
	at org.apache.lucene.util.hnsw.MergingHnswGraphBuilder.updateGraph(MergingHnswGraphBuilder.java:177)
	at org.apache.lucene.util.hnsw.MergingHnswGraphBuilder.build(MergingHnswGraphBuilder.java:128)
	at org.apache.lucene.util.hnsw.IncrementalHnswGraphMerger.merge(IncrementalHnswGraphMerger.java:197)
	at org.apache.lucene.codecs.lucene99.Lucene99HnswVectorsWriter.mergeOneField(Lucene99HnswVectorsWriter.java:414)
	at org.apache.lucene.codecs.perfield.PerFieldKnnVectorsFormat$FieldsWriter.mergeOneField(PerFieldKnnVectorsFormat.java:126)
	at org.apache.lucene.codecs.KnnVectorsWriter.merge(KnnVectorsWriter.java:105)
	at org.apache.lucene.index.SegmentMerger.mergeVectorValues(SegmentMerger.java:271)
	at org.apache.lucene.index.SegmentMerger.mergeWithLogging(SegmentMerger.java:314)
	at org.apache.lucene.index.SegmentMerger.merge(SegmentMerger.java:158)
	at org.apache.lucene.index.IndexWriter.mergeMiddle(IndexWriter.java:5317)
	at org.apache.lucene.index.IndexWriter.merge(IndexWriter.java:4778)
	at org.apache.solr.update.SolrIndexWriter.merge(SolrIndexWriter.java:219)
	at org.apache.lucene.index.IndexWriter$IndexWriterMergeSource.merge(IndexWriter.java:6601)
	at org.apache.lucene.index.ConcurrentMergeScheduler.doMerge(ConcurrentMergeScheduler.java:668)
	at org.apache.lucene.index.ConcurrentMergeScheduler$MergeThread.run(ConcurrentMergeScheduler.java:729)


FAILED:  org.apache.solr.search.vector.KnnQParserChildTest.classMethod

Error Message:
java.lang.AssertionError: Nodes are added in the incorrect order! Comparing NaN to [NaN]

Stack Trace:
java.lang.AssertionError: Nodes are added in the incorrect order! Comparing NaN to [NaN]
	at org.apache.lucene.util.hnsw.NeighborArray.addInOrder(NeighborArray.java:80)
	at org.apache.lucene.util.hnsw.HnswGraphBuilder.popToScratch(HnswGraphBuilder.java:420)
	at org.apache.lucene.util.hnsw.HnswGraphBuilder.addGraphNodeInternal(HnswGraphBuilder.java:273)
	at org.apache.lucene.util.hnsw.HnswGraphBuilder.addGraphNodeWithEps(HnswGraphBuilder.java:331)
	at org.apache.lucene.util.hnsw.MergingHnswGraphBuilder.updateGraph(MergingHnswGraphBuilder.java:177)
	at org.apache.lucene.util.hnsw.MergingHnswGraphBuilder.build(MergingHnswGraphBuilder.java:128)
	at org.apache.lucene.util.hnsw.IncrementalHnswGraphMerger.merge(IncrementalHnswGraphMerger.java:197)
	at org.apache.lucene.codecs.lucene99.Lucene99HnswVectorsWriter.mergeOneField(Lucene99HnswVectorsWriter.java:414)
	at org.apache.lucene.codecs.perfield.PerFieldKnnVectorsFormat$FieldsWriter.mergeOneField(PerFieldKnnVectorsFormat.java:126)
	at org.apache.lucene.codecs.KnnVectorsWriter.merge(KnnVectorsWriter.java:105)
	at org.apache.lucene.index.SegmentMerger.mergeVectorValues(SegmentMerger.java:271)
	at org.apache.lucene.index.SegmentMerger.mergeWithLogging(SegmentMerger.java:314)
	at org.apache.lucene.index.SegmentMerger.merge(SegmentMerger.java:158)
	at org.apache.lucene.index.IndexWriter.mergeMiddle(IndexWriter.java:5317)
	at org.apache.lucene.index.IndexWriter.merge(IndexWriter.java:4778)
	at org.apache.solr.update.SolrIndexWriter.merge(SolrIndexWriter.java:219)
	at org.apache.lucene.index.IndexWriter$IndexWriterMergeSource.merge(IndexWriter.java:6601)
	at org.apache.lucene.index.ConcurrentMergeScheduler.doMerge(ConcurrentMergeScheduler.java:668)
	at org.apache.lucene.index.ConcurrentMergeScheduler$MergeThread.run(ConcurrentMergeScheduler.java:729)


FAILED:  org.apache.solr.search.vector.KnnQParserChildTest.classMethod

Error Message:
java.lang.AssertionError: Nodes are added in the incorrect order! Comparing NaN to [NaN]

Stack Trace:
java.lang.AssertionError: Nodes are added in the incorrect order! Comparing NaN to [NaN]
	at org.apache.lucene.util.hnsw.NeighborArray.addInOrder(NeighborArray.java:80)
	at org.apache.lucene.util.hnsw.HnswGraphBuilder.popToScratch(HnswGraphBuilder.java:420)
	at org.apache.lucene.util.hnsw.HnswGraphBuilder.addGraphNodeInternal(HnswGraphBuilder.java:273)
	at org.apache.lucene.util.hnsw.HnswGraphBuilder.addGraphNodeWithEps(HnswGraphBuilder.java:331)
	at org.apache.lucene.util.hnsw.MergingHnswGraphBuilder.updateGraph(MergingHnswGraphBuilder.java:177)
	at org.apache.lucene.util.hnsw.MergingHnswGraphBuilder.build(MergingHnswGraphBuilder.java:128)
	at org.apache.lucene.util.hnsw.IncrementalHnswGraphMerger.merge(IncrementalHnswGraphMerger.java:197)
	at org.apache.lucene.codecs.lucene99.Lucene99HnswVectorsWriter.mergeOneField(Lucene99HnswVectorsWriter.java:414)
	at org.apache.lucene.codecs.perfield.PerFieldKnnVectorsFormat$FieldsWriter.mergeOneField(PerFieldKnnVectorsFormat.java:126)
	at org.apache.lucene.codecs.KnnVectorsWriter.merge(KnnVectorsWriter.java:105)
	at org.apache.lucene.index.SegmentMerger.mergeVectorValues(SegmentMerger.java:271)
	at org.apache.lucene.index.SegmentMerger.mergeWithLogging(SegmentMerger.java:314)
	at org.apache.lucene.index.SegmentMerger.merge(SegmentMerger.java:158)
	at org.apache.lucene.index.IndexWriter.mergeMiddle(IndexWriter.java:5317)
	at org.apache.lucene.index.IndexWriter.merge(IndexWriter.java:4778)
	at org.apache.solr.update.SolrIndexWriter.merge(SolrIndexWriter.java:219)
	at org.apache.lucene.index.IndexWriter$IndexWriterMergeSource.merge(IndexWriter.java:6601)
	at org.apache.lucene.index.ConcurrentMergeScheduler.doMerge(ConcurrentMergeScheduler.java:668)
	at org.apache.lucene.index.ConcurrentMergeScheduler$MergeThread.run(ConcurrentMergeScheduler.java:729)


FAILED:  org.apache.solr.search.vector.KnnQParserChildTest.classMethod

Error Message:
java.lang.AssertionError

Stack Trace:
java.lang.AssertionError
	at org.apache.solr.util.RTimer.stop(RTimer.java:84)
	at org.apache.solr.metrics.otel.instruments.AttributedLongTimer$MetricTimer.stop(AttributedLongTimer.java:64)
	at org.apache.solr.update.SolrIndexWriter.updateMergeMetrics(SolrIndexWriter.java:315)
	at org.apache.solr.update.SolrIndexWriter.merge(SolrIndexWriter.java:225)
	at org.apache.lucene.index.IndexWriter$IndexWriterMergeSource.merge(IndexWriter.java:6601)
	at org.apache.lucene.index.ConcurrentMergeScheduler.doMerge(ConcurrentMergeScheduler.java:668)
	at org.apache.lucene.index.ConcurrentMergeScheduler$MergeThread.run(ConcurrentMergeScheduler.java:729)


FAILED:  org.apache.solr.search.vector.KnnQParserChildTest.classMethod

Error Message:
java.lang.AssertionError

Stack Trace:
java.lang.AssertionError
	at org.apache.solr.util.RTimer.stop(RTimer.java:84)
	at org.apache.solr.metrics.otel.instruments.AttributedLongTimer$MetricTimer.stop(AttributedLongTimer.java:64)
	at org.apache.solr.update.SolrIndexWriter.updateMergeMetrics(SolrIndexWriter.java:315)
	at org.apache.solr.update.SolrIndexWriter.merge(SolrIndexWriter.java:225)
	at org.apache.lucene.index.IndexWriter$IndexWriterMergeSource.merge(IndexWriter.java:6601)
	at org.apache.lucene.index.ConcurrentMergeScheduler.doMerge(ConcurrentMergeScheduler.java:668)
	at org.apache.lucene.index.ConcurrentMergeScheduler$MergeThread.run(ConcurrentMergeScheduler.java:729)


FAILED:  org.apache.solr.search.vector.KnnQParserChildTest.classMethod

Error Message:
java.lang.AssertionError: Nodes are added in the incorrect order! Comparing NaN to [NaN]

Stack Trace:
java.lang.AssertionError: Nodes are added in the incorrect order! Comparing NaN to [NaN]
	at org.apache.lucene.util.hnsw.NeighborArray.addInOrder(NeighborArray.java:80)
	at org.apache.lucene.util.hnsw.HnswGraphBuilder.popToScratch(HnswGraphBuilder.java:420)
	at org.apache.lucene.util.hnsw.HnswGraphBuilder.addGraphNodeInternal(HnswGraphBuilder.java:273)
	at org.apache.lucene.util.hnsw.HnswGraphBuilder.addGraphNodeWithEps(HnswGraphBuilder.java:331)
	at org.apache.lucene.util.hnsw.MergingHnswGraphBuilder.updateGraph(MergingHnswGraphBuilder.java:177)
	at org.apache.lucene.util.hnsw.MergingHnswGraphBuilder.build(MergingHnswGraphBuilder.java:128)
	at org.apache.lucene.util.hnsw.IncrementalHnswGraphMerger.merge(IncrementalHnswGraphMerger.java:197)
	at org.apache.lucene.codecs.lucene99.Lucene99HnswVectorsWriter.mergeOneField(Lucene99HnswVectorsWriter.java:414)
	at org.apache.lucene.codecs.perfield.PerFieldKnnVectorsFormat$FieldsWriter.mergeOneField(PerFieldKnnVectorsFormat.java:126)
	at org.apache.lucene.codecs.KnnVectorsWriter.merge(KnnVectorsWriter.java:105)
	at org.apache.lucene.index.SegmentMerger.mergeVectorValues(SegmentMerger.java:271)
	at org.apache.lucene.index.SegmentMerger.mergeWithLogging(SegmentMerger.java:314)
	at org.apache.lucene.index.SegmentMerger.merge(SegmentMerger.java:158)
	at org.apache.lucene.index.IndexWriter.mergeMiddle(IndexWriter.java:5317)
	at org.apache.lucene.index.IndexWriter.merge(IndexWriter.java:4778)
	at org.apache.solr.update.SolrIndexWriter.merge(SolrIndexWriter.java:219)
	at org.apache.lucene.index.IndexWriter$IndexWriterMergeSource.merge(IndexWriter.java:6601)
	at org.apache.lucene.index.ConcurrentMergeScheduler.doMerge(ConcurrentMergeScheduler.java:668)
	at org.apache.lucene.index.ConcurrentMergeScheduler$MergeThread.run(ConcurrentMergeScheduler.java:729)

[JENKINS] Solr-main-Linux (64bit/hotspot/jdk-22.0.2) - Build # 29759 - Still Unstable!

Posted by Policeman Jenkins Server <je...@thetaphi.de>.
Build: https://jenkins.thetaphi.de/job/Solr-main-Linux/29759/
Java: 64bit/hotspot/jdk-22.0.2 -XX:-UseCompressedOops -XX:+UseSerialGC

1 tests failed.
FAILED:  org.apache.solr.handler.admin.LoggingHandlerTest.testLogLevelHandlerOutput

Error Message:
java.lang.AssertionError: Logger Missing: org.apache.solr.bogus_logger_package.BogusClass_A

Stack Trace:
java.lang.AssertionError: Logger Missing: org.apache.solr.bogus_logger_package.BogusClass_A
	at __randomizedtesting.SeedInfo.seed([E7A2C99B92333F4B:7CF98C13CF8281B2]:0)
	at org.junit.Assert.fail(Assert.java:89)
	at org.junit.Assert.assertTrue(Assert.java:42)
	at org.apache.solr.handler.admin.LoggingHandlerTest.assertLoggerLevel(LoggingHandlerTest.java:200)
	at org.apache.solr.handler.admin.LoggingHandlerTest.testLogLevelHandlerOutput(LoggingHandlerTest.java:129)
	at java.base/jdk.internal.reflect.DirectMethodHandleAccessor.invoke(DirectMethodHandleAccessor.java:103)
	at java.base/java.lang.reflect.Method.invoke(Method.java:580)
	at com.carrotsearch.randomizedtesting.RandomizedRunner.invoke(RandomizedRunner.java:1763)
	at com.carrotsearch.randomizedtesting.RandomizedRunner$8.evaluate(RandomizedRunner.java:946)
	at com.carrotsearch.randomizedtesting.RandomizedRunner$9.evaluate(RandomizedRunner.java:982)
	at com.carrotsearch.randomizedtesting.RandomizedRunner$10.evaluate(RandomizedRunner.java:996)
	at com.carrotsearch.randomizedtesting.rules.SystemPropertiesRestoreRule$1.evaluate(SystemPropertiesRestoreRule.java:80)
	at org.junit.rules.RunRules.evaluate(RunRules.java:20)
	at org.apache.lucene.tests.util.TestRuleSetupTeardownChained$1.evaluate(TestRuleSetupTeardownChained.java:48)
	at org.apache.lucene.tests.util.AbstractBeforeAfterRule$1.evaluate(AbstractBeforeAfterRule.java:43)
	at org.apache.lucene.tests.util.TestRuleThreadAndTestName$1.evaluate(TestRuleThreadAndTestName.java:45)
	at org.apache.lucene.tests.util.TestRuleIgnoreAfterMaxFailures$1.evaluate(TestRuleIgnoreAfterMaxFailures.java:60)
	at org.apache.lucene.tests.util.TestRuleMarkFailure$1.evaluate(TestRuleMarkFailure.java:44)
	at org.junit.rules.RunRules.evaluate(RunRules.java:20)
	at com.carrotsearch.randomizedtesting.rules.StatementAdapter.evaluate(StatementAdapter.java:36)
	at com.carrotsearch.randomizedtesting.ThreadLeakControl$StatementRunner.run(ThreadLeakControl.java:390)
	at com.carrotsearch.randomizedtesting.ThreadLeakControl.forkTimeoutingTask(ThreadLeakControl.java:843)
	at com.carrotsearch.randomizedtesting.ThreadLeakControl$3.evaluate(ThreadLeakControl.java:490)
	at com.carrotsearch.randomizedtesting.RandomizedRunner.runSingleTest(RandomizedRunner.java:955)
	at com.carrotsearch.randomizedtesting.RandomizedRunner$5.evaluate(RandomizedRunner.java:840)
	at com.carrotsearch.randomizedtesting.RandomizedRunner$6.evaluate(RandomizedRunner.java:891)
	at com.carrotsearch.randomizedtesting.RandomizedRunner$7.evaluate(RandomizedRunner.java:902)
	at com.carrotsearch.randomizedtesting.rules.StatementAdapter.evaluate(StatementAdapter.java:36)
	at org.apache.solr.util.LogLevelTestRule$LogLevelStatement.evaluate(LogLevelTestRule.java:63)
	at com.carrotsearch.randomizedtesting.rules.StatementAdapter.evaluate(StatementAdapter.java:36)
	at org.apache.lucene.tests.util.AbstractBeforeAfterRule$1.evaluate(AbstractBeforeAfterRule.java:43)
	at com.carrotsearch.randomizedtesting.rules.SystemPropertiesRestoreRule$1.evaluate(SystemPropertiesRestoreRule.java:80)
	at org.junit.rules.RunRules.evaluate(RunRules.java:20)
	at org.apache.lucene.tests.util.AbstractBeforeAfterRule$1.evaluate(AbstractBeforeAfterRule.java:43)
	at com.carrotsearch.randomizedtesting.rules.StatementAdapter.evaluate(StatementAdapter.java:36)
	at org.apache.lucene.tests.util.TestRuleStoreClassName$1.evaluate(TestRuleStoreClassName.java:38)
	at com.carrotsearch.randomizedtesting.rules.NoShadowingOrOverridesOnMethodsRule$1.evaluate(NoShadowingOrOverridesOnMethodsRule.java:40)
	at com.carrotsearch.randomizedtesting.rules.NoShadowingOrOverridesOnMethodsRule$1.evaluate(NoShadowingOrOverridesOnMethodsRule.java:40)
	at com.carrotsearch.randomizedtesting.rules.StatementAdapter.evaluate(StatementAdapter.java:36)
	at com.carrotsearch.randomizedtesting.rules.StatementAdapter.evaluate(StatementAdapter.java:36)
	at org.apache.lucene.tests.util.TestRuleAssertionsRequired$1.evaluate(TestRuleAssertionsRequired.java:53)
	at org.apache.lucene.tests.util.AbstractBeforeAfterRule$1.evaluate(AbstractBeforeAfterRule.java:43)
	at org.apache.lucene.tests.util.TestRuleMarkFailure$1.evaluate(TestRuleMarkFailure.java:44)
	at org.apache.lucene.tests.util.TestRuleIgnoreAfterMaxFailures$1.evaluate(TestRuleIgnoreAfterMaxFailures.java:60)
	at org.apache.lucene.tests.util.TestRuleIgnoreTestSuites$1.evaluate(TestRuleIgnoreTestSuites.java:47)
	at org.junit.rules.RunRules.evaluate(RunRules.java:20)
	at com.carrotsearch.randomizedtesting.rules.StatementAdapter.evaluate(StatementAdapter.java:36)
	at com.carrotsearch.randomizedtesting.ThreadLeakControl$StatementRunner.run(ThreadLeakControl.java:390)
	at com.carrotsearch.randomizedtesting.ThreadLeakControl.lambda$forkTimeoutingTask$0(ThreadLeakControl.java:850)
	at java.base/java.lang.Thread.run(Thread.java:1570)