You are viewing a plain text version of this content. The canonical link for it is here.
Posted to commits@openjpa.apache.org by Apache Hudson Server <hu...@hudson.apache.org> on 2010/11/07 18:58:59 UTC
Build failed in Hudson: OpenJPA-trunk #322
See <https://hudson.apache.org/hudson/job/OpenJPA-trunk/322/changes>
Changes:
[mtylenda] OPENJPA-1864: Fix the class comment.
[mtylenda] OPENJPA-1837: Revert the statement about XML column as the mentioned limitation does exist in that case.
------------------------------------------
Started by an SCM change
Building remotely on windows1
Updating https://svn.apache.org/repos/asf/openjpa/trunk
U openjpa-jdbc\src\main\java\org\apache\openjpa\jdbc\sql\MaxDBDictionary.java
U openjpa-project\src\doc\manual\supported_databases.xml
At revision 1032323
WARNING: clock of the subversion server appears to be out of sync. This can result in inconsistent check out behavior.
Parsing POMs
[trunk] $ c:\hudson\tools\java\latest-1.6-64/bin/java -Xmx1024m -XX:MaxPermSize=256m -cp c:\hudson\hudson-slave\maven-agent.jar;c:\hudson\tools\maven\apache-maven-2.2.1\boot\classworlds-1.1.jar hudson.maven.agent.Main c:\hudson\tools\maven\apache-maven-2.2.1 C:\Users\hudson\AppData\LocalLow\Sun\Java\Deployment\cache\6.0\11\186ce08b-3b0b3d36 c:\hudson\hudson-slave\maven-interceptor.jar 59575 c:\hudson\hudson-slave\maven2.1-interceptor.jar
<===[HUDSON REMOTING CAPACITY]===> channel started
Executing Maven: -B -f <https://hudson.apache.org/hudson/job/OpenJPA-trunk/ws/trunk\pom.xml> clean install
[INFO] Scanning for projects...
[INFO] Reactor build order:
[INFO] OpenJPA Parent POM
[INFO] OpenJPA Utilities Library
[INFO] OpenJPA Kernel
[INFO] OpenJPA JDBC
[INFO] OpenJPA Persistence
[INFO] OpenJPA Persistence JDBC
[INFO] OpenJPA Persistence Locking Tests
[INFO] OpenJPA XML Store
[INFO] OpenJPA Slice
[INFO] OpenJPA Aggregate Jar
[INFO] OpenJPA Aggregate Jar with Dependencies
[INFO] OpenJPA Project Docs and Assemblies
[INFO] OpenJPA Examples
[INFO] OpenJPA Examples - Simple
[INFO] OpenJPA Examples - image-gallery
[INFO] OpenJPA Examples - OpenBooks
[INFO] OpenJPA Integration Tests
[INFO] OpenJPA Integration Tests - Daytrader
[INFO] OpenJPA Integration Tests - Examples
[INFO] OpenJPA Integration Tests - SLF4JLogFactory
[INFO] OpenJPA Integration Tests - JPA TCK
[INFO] OpenJPA Integration Tests - Bean Validation
[INFO] OpenJPA Integration Tests - JMX Platform MBeans
[INFO] ------------------------------------------------------------------------
[INFO] Building OpenJPA Parent POM
[INFO] task-segment: [clean, install]
[INFO] ------------------------------------------------------------------------
[INFO] [clean:clean {execution: default-clean}]
[INFO] Deleting file set: <https://hudson.apache.org/hudson/job/OpenJPA-trunk/ws/trunk\target> (included: [**], excluded: [])
[INFO] [buildnumber:create {execution: default}]
[INFO] Checking for local modifications: skipped.
[INFO] Updating project files from SCM: skipped.
[INFO] Executing: cmd.exe /X /C "svn --non-interactive info"
[INFO] Working directory: <https://hudson.apache.org/hudson/job/OpenJPA-trunk/ws/trunk>
[INFO] Storing buildNumber: 1032321 at timestamp: November 7, 2010 at 12:42 AM
[INFO] Executing: cmd.exe /X /C "svn --non-interactive info"
[INFO] Working directory: <https://hudson.apache.org/hudson/job/OpenJPA-trunk/ws/trunk>
[INFO] Storing buildScmBranch: trunk
[INFO] [enforcer:enforce {execution: default}]
[INFO] Setting property: classpath.resource.loader.class => 'org.codehaus.plexus.velocity.ContextClassLoaderResourceLoader'.
[INFO] Setting property: velocimacro.messages.on => 'false'.
[INFO] Setting property: resource.loader => 'classpath'.
[INFO] Setting property: resource.manager.logwhenfound => 'false'.
[INFO] [checkstyle:checkstyle {execution: default}]
[INFO] Source directory does not exist - skipping report.
[INFO] Setting property: classpath.resource.loader.class => 'org.codehaus.plexus.velocity.ContextClassLoaderResourceLoader'.
[INFO] Setting property: velocimacro.messages.on => 'false'.
[INFO] Setting property: resource.loader => 'classpath'.
[INFO] Setting property: resource.manager.logwhenfound => 'false'.
[INFO] [remote-resources:process {execution: default}]
[INFO] [site:attach-descriptor {execution: default-attach-descriptor}]
[INFO] Parent project loaded from repository.
[INFO] [ianal:verify-legal-files {execution: default}]
[INFO] [apache-rat:check {execution: default}]
[INFO] Exclude: **/.*/**
[INFO] Exclude: **/target/**/*
[INFO] [install:install {execution: default-install}]
[INFO] Installing <https://hudson.apache.org/hudson/job/OpenJPA-trunk/ws/trunk\pom.xml> to C:\Users\hudson\.m2\repository\org\apache\openjpa\openjpa-parent\2.1.0-SNAPSHOT\openjpa-parent-2.1.0-SNAPSHOT.pom
[HUDSON] Archiving <https://hudson.apache.org/hudson/job/OpenJPA-trunk/ws/trunk\pom.xml> to /home/hudson/hudson/jobs/OpenJPA-trunk/modules/org.apache.openjpa$openjpa-parent/builds/2010-11-07_17-40-32/archive/org.apache.openjpa/openjpa-parent/2.1.0-SNAPSHOT/pom.xml
[HUDSON] Archiving C:\Users\hudson\.m2\repository\org\apache\openjpa\openjpa-parent\2.1.0-SNAPSHOT\openjpa-parent-2.1.0-SNAPSHOT.pom to /home/hudson/hudson/jobs/OpenJPA-trunk/modules/org.apache.openjpa$openjpa-parent/builds/2010-11-07_17-40-32/archive/org.apache.openjpa/openjpa-parent/2.1.0-SNAPSHOT/openjpa-parent-2.1.0-SNAPSHOT.pom
[INFO] ------------------------------------------------------------------------
[INFO] Building OpenJPA Utilities Library
[INFO] task-segment: [clean, install]
[INFO] ------------------------------------------------------------------------
[INFO] [clean:clean {execution: default-clean}]
[INFO] Deleting file set: C:\hudson\hudson-slave\workspace\OpenJPA-trunk\trunk\openjpa-lib\target (included: [**], excluded: [])
[HUDSON] Archiving C:\hudson\hudson-slave\workspace\OpenJPA-trunk\trunk\openjpa-lib\pom.xml to /home/hudson/hudson/jobs/OpenJPA-trunk/modules/org.apache.openjpa$openjpa-lib/builds/2010-11-07_17-40-32/archive/org.apache.openjpa/openjpa-lib/2.1.0-SNAPSHOT/pom.xml
[INFO] ------------------------------------------------------------------------
[ERROR] BUILD ERROR
[INFO] ------------------------------------------------------------------------
[INFO] Failed to delete directory: C:\hudson\hudson-slave\workspace\OpenJPA-trunk\trunk\openjpa-lib\target. Reason: Unable to delete file C:\hudson\hudson-slave\workspace\OpenJPA-trunk\trunk\openjpa-lib\target\openjpa-lib-2.1.0-SNAPSHOT.jar
[INFO] ------------------------------------------------------------------------
[INFO] For more information, run Maven with the -e switch
[INFO] ------------------------------------------------------------------------
[INFO] Total time: 18 minutes 6 seconds
[INFO] Finished at: Sun Nov 07 00:59:02 GMT 2010
[INFO] Final Memory: 65M/174M
[INFO] ------------------------------------------------------------------------
Sending e-mails to: commits@openjpa.apache.org
channel stopped
Hudson build is back to normal : OpenJPA-trunk #332
Posted by Apache Hudson Server <hu...@hudson.apache.org>.
See <https://hudson.apache.org/hudson/job/OpenJPA-trunk/332/changes>
Build failed in Hudson: OpenJPA-trunk #331
Posted by Apache Hudson Server <hu...@hudson.apache.org>.
See <https://hudson.apache.org/hudson/job/OpenJPA-trunk/331/changes>
Changes:
[ppoddar] OPENJPA-1889: Relax binding query parameter type checks for enums
[curtisr7] OPENJPA-1886: Remove query parameters when tracing.
------------------------------------------
[...truncated 14564 lines...]
[INFO] [apache-rat:check {execution: default}]
[INFO] Exclude: **/.*/**
[INFO] Exclude: **/target/**/*
[INFO] [install:install {execution: default-install}]
[INFO] Installing <https://hudson.apache.org/hudson/job/OpenJPA-trunk/ws/trunk/openjpa-xmlstore/target/openjpa-xmlstore-2.1.0-SNAPSHOT.jar> to /home/hudson/.m2/repository/org/apache/openjpa/openjpa-xmlstore/2.1.0-SNAPSHOT/openjpa-xmlstore-2.1.0-SNAPSHOT.jar
[INFO] Installing <https://hudson.apache.org/hudson/job/OpenJPA-trunk/ws/trunk/openjpa-xmlstore/target/openjpa-xmlstore-2.1.0-SNAPSHOT-tests.jar> to /home/hudson/.m2/repository/org/apache/openjpa/openjpa-xmlstore/2.1.0-SNAPSHOT/openjpa-xmlstore-2.1.0-SNAPSHOT-tests.jar
[HUDSON] Archiving <https://hudson.apache.org/hudson/job/OpenJPA-trunk/ws/trunk/openjpa-xmlstore/pom.xml> to /home/hudson/hudson/jobs/OpenJPA-trunk/modules/org.apache.openjpa$openjpa-xmlstore/builds/2010-11-17_03-31-35/archive/org.apache.openjpa/openjpa-xmlstore/2.1.0-SNAPSHOT/pom.xml
[HUDSON] Archiving <https://hudson.apache.org/hudson/job/OpenJPA-trunk/ws/trunk/openjpa-xmlstore/target/openjpa-xmlstore-2.1.0-SNAPSHOT.jar> to /home/hudson/hudson/jobs/OpenJPA-trunk/modules/org.apache.openjpa$openjpa-xmlstore/builds/2010-11-17_03-31-35/archive/org.apache.openjpa/openjpa-xmlstore/2.1.0-SNAPSHOT/openjpa-xmlstore-2.1.0-SNAPSHOT.jar
[HUDSON] Archiving <https://hudson.apache.org/hudson/job/OpenJPA-trunk/ws/trunk/openjpa-xmlstore/target/openjpa-xmlstore-2.1.0-SNAPSHOT-tests.jar> to /home/hudson/hudson/jobs/OpenJPA-trunk/modules/org.apache.openjpa$openjpa-xmlstore/builds/2010-11-17_03-31-35/archive/org.apache.openjpa/openjpa-xmlstore/2.1.0-SNAPSHOT/openjpa-xmlstore-2.1.0-SNAPSHOT-tests.jar
[INFO] ------------------------------------------------------------------------
[INFO] Building OpenJPA Slice
[INFO] task-segment: [clean, install]
[INFO] ------------------------------------------------------------------------
[INFO] [clean:clean {execution: default-clean}]
[INFO] Deleting file set: <https://hudson.apache.org/hudson/job/OpenJPA-trunk/ws/trunk/openjpa-slice/target> (included: [**], excluded: [])
[INFO] [buildnumber:create {execution: default}]
[INFO] [enforcer:enforce {execution: default}]
[INFO] [checkstyle:checkstyle {execution: default}]
[INFO] Starting audit...
Audit done.
[WARNING] Unable to locate Source XRef to link to - DISABLED
[INFO] [remote-resources:process {execution: default}]
[INFO] [resources:resources {execution: default-resources}]
[INFO] Using 'UTF-8' encoding to copy filtered resources.
[INFO] Copying 4 resources
[INFO] Copying 3 resources
[INFO] [compiler:compile {execution: default-compile}]
[INFO] Compiling 31 source files to <https://hudson.apache.org/hudson/job/OpenJPA-trunk/ws/trunk/openjpa-slice/target/classes>
[INFO] [resources:testResources {execution: default-testResources}]
[INFO] Using 'UTF-8' encoding to copy filtered resources.
[INFO] Copying 1 resource
[INFO] Copying 3 resources
[INFO] [compiler:testCompile {execution: default-testCompile}]
[INFO] Compiling 22 source files to <https://hudson.apache.org/hudson/job/OpenJPA-trunk/ws/trunk/openjpa-slice/target/test-classes>
[INFO] [antrun:run {execution: default}]
[INFO] Executing tasks
enhance:
enhance.all.entities:
[echo] running enhancer
248 enhance WARN [pool-1-thread-1] openjpa.Enhance - Type "class org.apache.openjpa.slice.policy.UserDistributionPolicy" loaded by org.apache.openjpa.lib.util.TemporaryClassLoader@1c8f29b has no metadata; enhancing as persistence aware. If you intended for "class org.apache.openjpa.slice.policy.UserDistributionPolicy" to be persistence-capable, then this means that OpenJPA could not find any metadata for "class org.apache.openjpa.slice.policy.UserDistributionPolicy". This can happen if the directory containing your metadata is not in your CLASSPATH, or if your metadata files are not named properly. See the documentation on metadata placement for more information.
329 enhance WARN [pool-1-thread-1] openjpa.Enhance - Type "class org.apache.openjpa.slice.PersistenceTestCase" loaded by org.apache.openjpa.lib.util.TemporaryClassLoader@1c8f29b has no metadata; enhancing as persistence aware. If you intended for "class org.apache.openjpa.slice.PersistenceTestCase" to be persistence-capable, then this means that OpenJPA could not find any metadata for "class org.apache.openjpa.slice.PersistenceTestCase". This can happen if the directory containing your metadata is not in your CLASSPATH, or if your metadata files are not named properly. See the documentation on metadata placement for more information.
361 enhance WARN [pool-1-thread-1] openjpa.Enhance - Type "class org.apache.openjpa.slice.SliceTestCase" loaded by org.apache.openjpa.lib.util.TemporaryClassLoader@1c8f29b has no metadata; enhancing as persistence aware. If you intended for "class org.apache.openjpa.slice.SliceTestCase" to be persistence-capable, then this means that OpenJPA could not find any metadata for "class org.apache.openjpa.slice.SliceTestCase". This can happen if the directory containing your metadata is not in your CLASSPATH, or if your metadata files are not named properly. See the documentation on metadata placement for more information.
397 enhance WARN [pool-1-thread-1] openjpa.Enhance - Type "class org.apache.openjpa.slice.SingleEMFTestCase" loaded by org.apache.openjpa.lib.util.TemporaryClassLoader@1c8f29b has no metadata; enhancing as persistence aware. If you intended for "class org.apache.openjpa.slice.SingleEMFTestCase" to be persistence-capable, then this means that OpenJPA could not find any metadata for "class org.apache.openjpa.slice.SingleEMFTestCase". This can happen if the directory containing your metadata is not in your CLASSPATH, or if your metadata files are not named properly. See the documentation on metadata placement for more information.
421 enhance WARN [pool-1-thread-1] openjpa.Enhance - Type "class org.apache.openjpa.slice.policy.EvenOddDistributionPolicy" loaded by org.apache.openjpa.lib.util.TemporaryClassLoader@1c8f29b has no metadata; enhancing as persistence aware. If you intended for "class org.apache.openjpa.slice.policy.EvenOddDistributionPolicy" to be persistence-capable, then this means that OpenJPA could not find any metadata for "class org.apache.openjpa.slice.policy.EvenOddDistributionPolicy". This can happen if the directory containing your metadata is not in your CLASSPATH, or if your metadata files are not named properly. See the documentation on metadata placement for more information.
425 enhance WARN [pool-1-thread-1] openjpa.Enhance - Type "class org.apache.openjpa.slice.policy.SampleQueryTargetPolicy" loaded by org.apache.openjpa.lib.util.TemporaryClassLoader@1c8f29b has no metadata; enhancing as persistence aware. If you intended for "class org.apache.openjpa.slice.policy.SampleQueryTargetPolicy" to be persistence-capable, then this means that OpenJPA could not find any metadata for "class org.apache.openjpa.slice.policy.SampleQueryTargetPolicy". This can happen if the directory containing your metadata is not in your CLASSPATH, or if your metadata files are not named properly. See the documentation on metadata placement for more information.
[INFO] Executed tasks
[WARNING] DEPRECATED [systemProperties]: Use systemPropertyVariables instead.
[INFO] [surefire:test {execution: default-test}]
[INFO] Surefire report directory: <https://hudson.apache.org/hudson/job/OpenJPA-trunk/ws/trunk/openjpa-slice/target/surefire-reports>
-------------------------------------------------------
T E S T S
-------------------------------------------------------
Running org.apache.openjpa.slice.TestQuery
5 ordering WARN [main] openjpa.Runtime - Slice identifiers are not explicitly listed via "openjpa.slice.Names" property.The configuration will be scanned to determine slice identifiers.
6 ordering INFO [main] openjpa.Runtime - Detected slices "[Even, Odd]" in configuration.
41 ordering INFO [main] openjpa.jdbc.JDBC - Using dictionary class "org.apache.openjpa.jdbc.sql.DerbyDictionary".
173 ordering INFO [main] openjpa.Runtime - Starting OpenJPA Slice 2.1.0-SNAPSHOT
505 ordering.Even INFO [main] openjpa.jdbc.JDBC - Using dictionary class "org.apache.openjpa.jdbc.sql.DerbyDictionary".
4611 ordering.Odd INFO [main] openjpa.jdbc.JDBC - Using dictionary class "org.apache.openjpa.jdbc.sql.DerbyDictionary".
12637 ordering WARN [main] openjpa.Runtime - Query "SELECT COUNT(p) FROM PObject p" is removed from cache excluded permanently. Query "SELECT COUNT(p) FROM PObject p" is not cached because it returns a single value rather than a list. A query that returns single value can not be cached. .
12863 ordering WARN [main] openjpa.Runtime - Query "SELECT p.value,p FROM PObject p ORDER BY p.value ASC" is removed from cache excluded permanently. Query "SELECT p.value,p FROM PObject p ORDER BY p.value ASC" is not cached because its result is not obtained by executing a select statement. This can happen if the query was evaluated in-memory. The result was provided by org.apache.openjpa.kernel.OrderingMergedResultObjectProvider. .
0 ordering WARN [main] openjpa.Runtime - Slice identifiers are not explicitly listed via "openjpa.slice.Names" property.The configuration will be scanned to determine slice identifiers.
0 ordering INFO [main] openjpa.Runtime - Detected slices "[Even, Odd]" in configuration.
3 ordering INFO [main] openjpa.jdbc.JDBC - Using dictionary class "org.apache.openjpa.jdbc.sql.DerbyDictionary".
12 ordering INFO [main] openjpa.Runtime - Starting OpenJPA Slice 2.1.0-SNAPSHOT
10 ordering.Even INFO [main] openjpa.jdbc.JDBC - Using dictionary class "org.apache.openjpa.jdbc.sql.DerbyDictionary".
9 ordering.Odd INFO [main] openjpa.jdbc.JDBC - Using dictionary class "org.apache.openjpa.jdbc.sql.DerbyDictionary".
412 ordering WARN [main] openjpa.Runtime - Query "SELECT COUNT(p) FROM PObject p" is removed from cache excluded permanently. Query "SELECT COUNT(p) FROM PObject p" is not cached because it returns a single value rather than a list. A query that returns single value can not be cached. .
510 ordering WARN [main] openjpa.Runtime - Query "SELECT p FROM PObject p ORDER BY p.value ASC" is removed from cache excluded permanently. Query "SELECT p FROM PObject p ORDER BY p.value ASC" is not cached because its result is not obtained by executing a select statement. This can happen if the query was evaluated in-memory. The result was provided by org.apache.openjpa.kernel.OrderingMergedResultObjectProvider. .
1 ordering WARN [main] openjpa.Runtime - Slice identifiers are not explicitly listed via "openjpa.slice.Names" property.The configuration will be scanned to determine slice identifiers.
1 ordering INFO [main] openjpa.Runtime - Detected slices "[Even, Odd]" in configuration.
4 ordering INFO [main] openjpa.jdbc.JDBC - Using dictionary class "org.apache.openjpa.jdbc.sql.DerbyDictionary".
11 ordering INFO [main] openjpa.Runtime - Starting OpenJPA Slice 2.1.0-SNAPSHOT
8 ordering.Even INFO [main] openjpa.jdbc.JDBC - Using dictionary class "org.apache.openjpa.jdbc.sql.DerbyDictionary".
8 ordering.Odd INFO [main] openjpa.jdbc.JDBC - Using dictionary class "org.apache.openjpa.jdbc.sql.DerbyDictionary".
221 ordering WARN [main] openjpa.Runtime - Query "SELECT COUNT(p) FROM PObject p" is removed from cache excluded permanently. Query "SELECT COUNT(p) FROM PObject p" is not cached because it returns a single value rather than a list. A query that returns single value can not be cached. .
363 ordering WARN [main] openjpa.Runtime - Query "SELECT p FROM Person p JOIN p.address a ORDER BY a.zip ASC, a.city DESC" is removed from cache excluded permanently. Query "SELECT p FROM Person p JOIN p.address a ORDER BY a.zip ASC, a.city DESC" is not cached because its result is not obtained by executing a select statement. This can happen if the query was evaluated in-memory. The result was provided by org.apache.openjpa.kernel.OrderingMergedResultObjectProvider. .
0 ordering WARN [main] openjpa.Runtime - Slice identifiers are not explicitly listed via "openjpa.slice.Names" property.The configuration will be scanned to determine slice identifiers.
1 ordering INFO [main] openjpa.Runtime - Detected slices "[Even, Odd]" in configuration.
3 ordering INFO [main] openjpa.jdbc.JDBC - Using dictionary class "org.apache.openjpa.jdbc.sql.DerbyDictionary".
32 ordering INFO [main] openjpa.Runtime - Starting OpenJPA Slice 2.1.0-SNAPSHOT
30 ordering.Even INFO [main] openjpa.jdbc.JDBC - Using dictionary class "org.apache.openjpa.jdbc.sql.DerbyDictionary".
8 ordering.Odd INFO [main] openjpa.jdbc.JDBC - Using dictionary class "org.apache.openjpa.jdbc.sql.DerbyDictionary".
224 ordering WARN [main] openjpa.Runtime - Query "SELECT COUNT(p) FROM PObject p" is removed from cache excluded permanently. Query "SELECT COUNT(p) FROM PObject p" is not cached because it returns a single value rather than a list. A query that returns single value can not be cached. .
315 ordering WARN [main] openjpa.Runtime - Query "SELECT MAX(p.value) FROM PObject p" is removed from cache excluded permanently. Query "SELECT MAX(p.value) FROM PObject p" is not cached because it returns a single value rather than a list. A query that returns single value can not be cached. .
325 ordering WARN [main] openjpa.Runtime - Query "SELECT MIN(p.value) FROM PObject p" is removed from cache excluded permanently. Query "SELECT MIN(p.value) FROM PObject p" is not cached because it returns a single value rather than a list. A query that returns single value can not be cached. .
337 ordering WARN [main] openjpa.Runtime - Query "SELECT SUM(p.value) FROM PObject p" is removed from cache excluded permanently. Query "SELECT SUM(p.value) FROM PObject p" is not cached because it returns a single value rather than a list. A query that returns single value can not be cached. .
351 ordering WARN [main] openjpa.Runtime - Query "SELECT MIN(p.value),MAX(p.value) FROM PObject p" is removed from cache excluded permanently. Query "SELECT MIN(p.value),MAX(p.value) FROM PObject p" is not cached because it returns a single value rather than a list. A query that returns single value can not be cached. .
0 ordering WARN [main] openjpa.Runtime - Slice identifiers are not explicitly listed via "openjpa.slice.Names" property.The configuration will be scanned to determine slice identifiers.
1 ordering INFO [main] openjpa.Runtime - Detected slices "[Even, Odd]" in configuration.
3 ordering INFO [main] openjpa.jdbc.JDBC - Using dictionary class "org.apache.openjpa.jdbc.sql.DerbyDictionary".
9 ordering INFO [main] openjpa.Runtime - Starting OpenJPA Slice 2.1.0-SNAPSHOT
7 ordering.Even INFO [main] openjpa.jdbc.JDBC - Using dictionary class "org.apache.openjpa.jdbc.sql.DerbyDictionary".
7 ordering.Odd INFO [main] openjpa.jdbc.JDBC - Using dictionary class "org.apache.openjpa.jdbc.sql.DerbyDictionary".
190 ordering WARN [main] openjpa.Runtime - Query "SELECT COUNT(p) FROM PObject p" is removed from cache excluded permanently. Query "SELECT COUNT(p) FROM PObject p" is not cached because it returns a single value rather than a list. A query that returns single value can not be cached. .
284 ordering WARN [main] openjpa.Runtime - Query "SELECT MAX(p.value) FROM PObject p WHERE MOD(p.value,2)=0" is removed from cache excluded permanently. Query "SELECT MAX(p.value) FROM PObject p WHERE MOD(p.value,2)=0" is not cached because it returns a single value rather than a list. A query that returns single value can not be cached. .
0 ordering WARN [main] openjpa.Runtime - Slice identifiers are not explicitly listed via "openjpa.slice.Names" property.The configuration will be scanned to determine slice identifiers.
0 ordering INFO [main] openjpa.Runtime - Detected slices "[Even, Odd]" in configuration.
3 ordering INFO [main] openjpa.jdbc.JDBC - Using dictionary class "org.apache.openjpa.jdbc.sql.DerbyDictionary".
9 ordering INFO [main] openjpa.Runtime - Starting OpenJPA Slice 2.1.0-SNAPSHOT
8 ordering.Even INFO [main] openjpa.jdbc.JDBC - Using dictionary class "org.apache.openjpa.jdbc.sql.DerbyDictionary".
6 ordering.Odd INFO [main] openjpa.jdbc.JDBC - Using dictionary class "org.apache.openjpa.jdbc.sql.DerbyDictionary".
181 ordering WARN [main] openjpa.Runtime - Query "SELECT COUNT(p) FROM PObject p" is removed from cache excluded permanently. Query "SELECT COUNT(p) FROM PObject p" is not cached because it returns a single value rather than a list. A query that returns single value can not be cached. .
272 ordering WARN [main] openjpa.Runtime - Query "SELECT p FROM PObject p ORDER BY p.value ASC" is removed from cache excluded permanently. Query "SELECT p FROM PObject p ORDER BY p.value ASC" is not cached because its result is not obtained by executing a select statement. This can happen if the query was evaluated in-memory. The result was provided by org.apache.openjpa.kernel.OrderingMergedResultObjectProvider. .
0 ordering WARN [main] openjpa.Runtime - Slice identifiers are not explicitly listed via "openjpa.slice.Names" property.The configuration will be scanned to determine slice identifiers.
0 ordering INFO [main] openjpa.Runtime - Detected slices "[Even, Odd]" in configuration.
2 ordering INFO [main] openjpa.jdbc.JDBC - Using dictionary class "org.apache.openjpa.jdbc.sql.DerbyDictionary".
8 ordering INFO [main] openjpa.Runtime - Starting OpenJPA Slice 2.1.0-SNAPSHOT
7 ordering.Even INFO [main] openjpa.jdbc.JDBC - Using dictionary class "org.apache.openjpa.jdbc.sql.DerbyDictionary".
6 ordering.Odd INFO [main] openjpa.jdbc.JDBC - Using dictionary class "org.apache.openjpa.jdbc.sql.DerbyDictionary".
190 ordering WARN [main] openjpa.Runtime - Query "SELECT COUNT(p) FROM PObject p" is removed from cache excluded permanently. Query "SELECT COUNT(p) FROM PObject p" is not cached because it returns a single value rather than a list. A query that returns single value can not be cached. .
270 ordering WARN [main] openjpa.Runtime - Query "SELECT p FROM PObject p" is removed from cache excluded permanently. Query "SELECT p FROM PObject p" is not cached because its result is not obtained by executing a select statement. This can happen if the query was evaluated in-memory. The result was provided by org.apache.openjpa.lib.rop.MergedResultObjectProvider. .
0 ordering WARN [main] openjpa.Runtime - Slice identifiers are not explicitly listed via "openjpa.slice.Names" property.The configuration will be scanned to determine slice identifiers.
0 ordering INFO [main] openjpa.Runtime - Detected slices "[Even, Odd]" in configuration.
2 ordering INFO [main] openjpa.jdbc.JDBC - Using dictionary class "org.apache.openjpa.jdbc.sql.DerbyDictionary".
7 ordering INFO [main] openjpa.Runtime - Starting OpenJPA Slice 2.1.0-SNAPSHOT
6 ordering.Even INFO [main] openjpa.jdbc.JDBC - Using dictionary class "org.apache.openjpa.jdbc.sql.DerbyDictionary".
7 ordering.Odd INFO [main] openjpa.jdbc.JDBC - Using dictionary class "org.apache.openjpa.jdbc.sql.DerbyDictionary".
166 ordering WARN [main] openjpa.Runtime - Query "SELECT COUNT(p) FROM PObject p" is removed from cache excluded permanently. Query "SELECT COUNT(p) FROM PObject p" is not cached because it returns a single value rather than a list. A query that returns single value can not be cached. .
262 ordering WARN [main] openjpa.Runtime - Query "SELECT p FROM PObject p" is removed from cache excluded permanently. Query "SELECT p FROM PObject p" is not cached because its result is not obtained by executing a select statement. This can happen if the query was evaluated in-memory. The result was provided by org.apache.openjpa.lib.rop.MergedResultObjectProvider. .
0 ordering WARN [main] openjpa.Runtime - Slice identifiers are not explicitly listed via "openjpa.slice.Names" property.The configuration will be scanned to determine slice identifiers.
0 ordering INFO [main] openjpa.Runtime - Detected slices "[Even, Odd]" in configuration.
2 ordering INFO [main] openjpa.jdbc.JDBC - Using dictionary class "org.apache.openjpa.jdbc.sql.DerbyDictionary".
7 ordering INFO [main] openjpa.Runtime - Starting OpenJPA Slice 2.1.0-SNAPSHOT
6 ordering.Even INFO [main] openjpa.jdbc.JDBC - Using dictionary class "org.apache.openjpa.jdbc.sql.DerbyDictionary".
6 ordering.Odd INFO [main] openjpa.jdbc.JDBC - Using dictionary class "org.apache.openjpa.jdbc.sql.DerbyDictionary".
158 ordering WARN [main] openjpa.Runtime - Query "SELECT COUNT(p) FROM PObject p" is removed from cache excluded permanently. Query "SELECT COUNT(p) FROM PObject p" is not cached because it returns a single value rather than a list. A query that returns single value can not be cached. .
242 ordering WARN [main] openjpa.Runtime - Query "SELECT p FROM PObject p ORDER BY p.value" is removed from cache excluded permanently. Query "SELECT p FROM PObject p ORDER BY p.value" is not cached because its result is not obtained by executing a select statement. This can happen if the query was evaluated in-memory. The result was provided by org.apache.openjpa.kernel.OrderingMergedResultObjectProvider. .
0 ordering WARN [main] openjpa.Runtime - Slice identifiers are not explicitly listed via "openjpa.slice.Names" property.The configuration will be scanned to determine slice identifiers.
0 ordering INFO [main] openjpa.Runtime - Detected slices "[Even, Odd]" in configuration.
3 ordering INFO [main] openjpa.jdbc.JDBC - Using dictionary class "org.apache.openjpa.jdbc.sql.DerbyDictionary".
8 ordering INFO [main] openjpa.Runtime - Starting OpenJPA Slice 2.1.0-SNAPSHOT
6 ordering.Even INFO [main] openjpa.jdbc.JDBC - Using dictionary class "org.apache.openjpa.jdbc.sql.DerbyDictionary".
5 ordering.Odd INFO [main] openjpa.jdbc.JDBC - Using dictionary class "org.apache.openjpa.jdbc.sql.DerbyDictionary".
147 ordering WARN [main] openjpa.Runtime - Query "SELECT COUNT(p) FROM PObject p" is removed from cache excluded permanently. Query "SELECT COUNT(p) FROM PObject p" is not cached because it returns a single value rather than a list. A query that returns single value can not be cached. .
237 ordering WARN [main] openjpa.Runtime - Query "SELECT p FROM PObject p WHERE p.value > :v" is removed from cache excluded permanently. Query "SELECT p FROM PObject p WHERE p.value > :v" is not cached because its result is not obtained by executing a select statement. This can happen if the query was evaluated in-memory. The result was provided by org.apache.openjpa.lib.rop.MergedResultObjectProvider. .
0 ordering WARN [main] openjpa.Runtime - Slice identifiers are not explicitly listed via "openjpa.slice.Names" property.The configuration will be scanned to determine slice identifiers.
0 ordering INFO [main] openjpa.Runtime - Detected slices "[Even, Odd]" in configuration.
1 ordering INFO [main] openjpa.jdbc.JDBC - Using dictionary class "org.apache.openjpa.jdbc.sql.DerbyDictionary".
5 ordering INFO [main] openjpa.Runtime - Starting OpenJPA Slice 2.1.0-SNAPSHOT
5 ordering.Even INFO [main] openjpa.jdbc.JDBC - Using dictionary class "org.apache.openjpa.jdbc.sql.DerbyDictionary".
5 ordering.Odd INFO [main] openjpa.jdbc.JDBC - Using dictionary class "org.apache.openjpa.jdbc.sql.DerbyDictionary".
150 ordering WARN [main] openjpa.Runtime - Query "SELECT COUNT(p) FROM PObject p" is removed from cache excluded permanently. Query "SELECT COUNT(p) FROM PObject p" is not cached because it returns a single value rather than a list. A query that returns single value can not be cached. .
253 ordering WARN [main] openjpa.Runtime - Query "select a from Address a where a.city = :city" is removed from cache excluded permanently. Query "select a from Address a where a.city = :city" is not cached because its result is not obtained by executing a select statement. This can happen if the query was evaluated in-memory. The result was provided by org.apache.openjpa.lib.rop.MergedResultObjectProvider. .
286 ordering WARN [main] openjpa.Runtime - Query "SELECT p FROM Person p WHERE p.address = :a" is removed from cache excluded permanently. Query "SELECT p FROM Person p WHERE p.address = :a" is not cached because its result is not obtained by executing a select statement. This can happen if the query was evaluated in-memory. The result was provided by org.apache.openjpa.lib.rop.MergedResultObjectProvider. .
0 ordering WARN [main] openjpa.Runtime - Slice identifiers are not explicitly listed via "openjpa.slice.Names" property.The configuration will be scanned to determine slice identifiers.
0 ordering INFO [main] openjpa.Runtime - Detected slices "[Even, Odd]" in configuration.
1 ordering INFO [main] openjpa.jdbc.JDBC - Using dictionary class "org.apache.openjpa.jdbc.sql.DerbyDictionary".
5 ordering INFO [main] openjpa.Runtime - Starting OpenJPA Slice 2.1.0-SNAPSHOT
5 ordering.Even INFO [main] openjpa.jdbc.JDBC - Using dictionary class "org.apache.openjpa.jdbc.sql.DerbyDictionary".
4 ordering.Odd INFO [main] openjpa.jdbc.JDBC - Using dictionary class "org.apache.openjpa.jdbc.sql.DerbyDictionary".
141 ordering WARN [main] openjpa.Runtime - Query "SELECT COUNT(p) FROM PObject p" is removed from cache excluded permanently. Query "SELECT COUNT(p) FROM PObject p" is not cached because it returns a single value rather than a list. A query that returns single value can not be cached. .
251 ordering WARN [main] openjpa.Runtime - Query "select c from Car c" is removed from cache excluded permanently. Query "select c from Car c" is not cached because its result is not obtained by executing a select statement. This can happen if the query was evaluated in-memory. The result was provided by org.apache.openjpa.lib.rop.MergedResultObjectProvider. .
258 ordering WARN [main] openjpa.Runtime - Query "select m from Manufacturer m" is removed from cache excluded permanently. Query "select m from Manufacturer m" is not cached because its result is not obtained by executing a select statement. This can happen if the query was evaluated in-memory. The result was provided by org.apache.openjpa.lib.rop.MergedResultObjectProvider. .
Tests run: 12, Failures: 0, Errors: 0, Skipped: 0, Time elapsed: 16.948 sec
Running org.apache.openjpa.slice.TestQueryMultiThreaded
0 ordering WARN [main] openjpa.Runtime - Slice identifiers are not explicitly listed via "openjpa.slice.Names" property.The configuration will be scanned to determine slice identifiers.
0 ordering INFO [main] openjpa.Runtime - Detected slices "[Even, Odd]" in configuration.
2 ordering INFO [main] openjpa.jdbc.JDBC - Using dictionary class "org.apache.openjpa.jdbc.sql.DerbyDictionary".
6 ordering INFO [main] openjpa.Runtime - Starting OpenJPA Slice 2.1.0-SNAPSHOT
5 ordering.Even INFO [main] openjpa.jdbc.JDBC - Using dictionary class "org.apache.openjpa.jdbc.sql.DerbyDictionary".
5 ordering.Odd INFO [main] openjpa.jdbc.JDBC - Using dictionary class "org.apache.openjpa.jdbc.sql.DerbyDictionary".
173 ordering WARN [main] openjpa.Runtime - Query "SELECT COUNT(p) FROM PObject p" is removed from cache excluded permanently. Query "SELECT COUNT(p) FROM PObject p" is not cached because it returns a single value rather than a list. A query that returns single value can not be cached. .
283 ordering WARN [Thread-2] openjpa.Runtime - Query "SELECT MAX(p.value) FROM PObject p" is removed from cache excluded permanently. Query "SELECT MAX(p.value) FROM PObject p" is not cached because it returns a single value rather than a list. A query that returns single value can not be cached. .
329 ordering WARN [Thread-2] openjpa.Runtime - Query "SELECT MIN(p.value) FROM PObject p" is removed from cache excluded permanently. Query "SELECT MIN(p.value) FROM PObject p" is not cached because it returns a single value rather than a list. A query that returns single value can not be cached. .
337 ordering WARN [Thread-2] openjpa.Runtime - Query "SELECT SUM(p.value) FROM PObject p" is removed from cache excluded permanently. Query "SELECT SUM(p.value) FROM PObject p" is not cached because it returns a single value rather than a list. A query that returns single value can not be cached. .
342 ordering WARN [Thread-2] openjpa.Runtime - Query "SELECT MIN(p.value),MAX(p.value) FROM PObject p" is removed from cache excluded permanently. Query "SELECT MIN(p.value),MAX(p.value) FROM PObject p" is not cached because it returns a single value rather than a list. A query that returns single value can not be cached. .
0 ordering WARN [main] openjpa.Runtime - Slice identifiers are not explicitly listed via "openjpa.slice.Names" property.The configuration will be scanned to determine slice identifiers.
0 ordering INFO [main] openjpa.Runtime - Detected slices "[Even, Odd]" in configuration.
2 ordering INFO [main] openjpa.jdbc.JDBC - Using dictionary class "org.apache.openjpa.jdbc.sql.DerbyDictionary".
10 ordering INFO [main] openjpa.Runtime - Starting OpenJPA Slice 2.1.0-SNAPSHOT
8 ordering.Even INFO [main] openjpa.jdbc.JDBC - Using dictionary class "org.apache.openjpa.jdbc.sql.DerbyDictionary".
6 ordering.Odd INFO [main] openjpa.jdbc.JDBC - Using dictionary class "org.apache.openjpa.jdbc.sql.DerbyDictionary".
142 ordering WARN [main] openjpa.Runtime - Query "SELECT COUNT(p) FROM PObject p" is removed from cache excluded permanently. Query "SELECT COUNT(p) FROM PObject p" is not cached because it returns a single value rather than a list. A query that returns single value can not be cached. .
201 ordering WARN [Thread-7] openjpa.Runtime - Query "SELECT MAX(p.value) FROM PObject p WHERE MOD(p.value,2)=0" is removed from cache excluded permanently. Query "SELECT MAX(p.value) FROM PObject p WHERE MOD(p.value,2)=0" is not cached because it returns a single value rather than a list. A query that returns single value can not be cached. .
1 ordering WARN [main] openjpa.Runtime - Slice identifiers are not explicitly listed via "openjpa.slice.Names" property.The configuration will be scanned to determine slice identifiers.
1 ordering INFO [main] openjpa.Runtime - Detected slices "[Even, Odd]" in configuration.
2 ordering INFO [main] openjpa.jdbc.JDBC - Using dictionary class "org.apache.openjpa.jdbc.sql.DerbyDictionary".
6 ordering INFO [main] openjpa.Runtime - Starting OpenJPA Slice 2.1.0-SNAPSHOT
4 ordering.Even INFO [main] openjpa.jdbc.JDBC - Using dictionary class "org.apache.openjpa.jdbc.sql.DerbyDictionary".
4 ordering.Odd INFO [main] openjpa.jdbc.JDBC - Using dictionary class "org.apache.openjpa.jdbc.sql.DerbyDictionary".
150 ordering WARN [main] openjpa.Runtime - Query "SELECT COUNT(p) FROM PObject p" is removed from cache excluded permanently. Query "SELECT COUNT(p) FROM PObject p" is not cached because it returns a single value rather than a list. A query that returns single value can not be cached. .
213 ordering WARN [Thread-12] openjpa.Runtime - Query "SELECT p.value,p FROM PObject p ORDER BY p.value ASC" is removed from cache excluded permanently. Query "SELECT p.value,p FROM PObject p ORDER BY p.value ASC" is not cached because its result is not obtained by executing a select statement. This can happen if the query was evaluated in-memory. The result was provided by org.apache.openjpa.kernel.OrderingMergedResultObjectProvider. .
0 ordering WARN [main] openjpa.Runtime - Slice identifiers are not explicitly listed via "openjpa.slice.Names" property.The configuration will be scanned to determine slice identifiers.
0 ordering INFO [main] openjpa.Runtime - Detected slices "[Even, Odd]" in configuration.
2 ordering INFO [main] openjpa.jdbc.JDBC - Using dictionary class "org.apache.openjpa.jdbc.sql.DerbyDictionary".
7 ordering INFO [main] openjpa.Runtime - Starting OpenJPA Slice 2.1.0-SNAPSHOT
8 ordering.Even INFO [main] openjpa.jdbc.JDBC - Using dictionary class "org.apache.openjpa.jdbc.sql.DerbyDictionary".
7 ordering.Odd INFO [main] openjpa.jdbc.JDBC - Using dictionary class "org.apache.openjpa.jdbc.sql.DerbyDictionary".
153 ordering WARN [main] openjpa.Runtime - Query "SELECT COUNT(p) FROM PObject p" is removed from cache excluded permanently. Query "SELECT COUNT(p) FROM PObject p" is not cached because it returns a single value rather than a list. A query that returns single value can not be cached. .
211 ordering WARN [Thread-17] openjpa.Runtime - Query "SELECT p FROM PObject p" is removed from cache excluded permanently. Query "SELECT p FROM PObject p" is not cached because its result is not obtained by executing a select statement. This can happen if the query was evaluated in-memory. The result was provided by org.apache.openjpa.lib.rop.MergedResultObjectProvider. .
0 ordering WARN [main] openjpa.Runtime - Slice identifiers are not explicitly listed via "openjpa.slice.Names" property.The configuration will be scanned to determine slice identifiers.
0 ordering INFO [main] openjpa.Runtime - Detected slices "[Even, Odd]" in configuration.
2 ordering INFO [main] openjpa.jdbc.JDBC - Using dictionary class "org.apache.openjpa.jdbc.sql.DerbyDictionary".
6 ordering INFO [main] openjpa.Runtime - Starting OpenJPA Slice 2.1.0-SNAPSHOT
4 ordering.Even INFO [main] openjpa.jdbc.JDBC - Using dictionary class "org.apache.openjpa.jdbc.sql.DerbyDictionary".
5 ordering.Odd INFO [main] openjpa.jdbc.JDBC - Using dictionary class "org.apache.openjpa.jdbc.sql.DerbyDictionary".
132 ordering WARN [main] openjpa.Runtime - Query "SELECT COUNT(p) FROM PObject p" is removed from cache excluded permanently. Query "SELECT COUNT(p) FROM PObject p" is not cached because it returns a single value rather than a list. A query that returns single value can not be cached. .
192 ordering WARN [Thread-22] openjpa.Runtime - Query "SELECT p FROM PObject p ORDER BY p.value" is removed from cache excluded permanently. Query "SELECT p FROM PObject p ORDER BY p.value" is not cached because its result is not obtained by executing a select statement. This can happen if the query was evaluated in-memory. The result was provided by org.apache.openjpa.kernel.OrderingMergedResultObjectProvider. .
0 ordering WARN [main] openjpa.Runtime - Slice identifiers are not explicitly listed via "openjpa.slice.Names" property.The configuration will be scanned to determine slice identifiers.
0 ordering INFO [main] openjpa.Runtime - Detected slices "[Even, Odd]" in configuration.
1 ordering INFO [main] openjpa.jdbc.JDBC - Using dictionary class "org.apache.openjpa.jdbc.sql.DerbyDictionary".
5 ordering INFO [main] openjpa.Runtime - Starting OpenJPA Slice 2.1.0-SNAPSHOT
4 ordering.Even INFO [main] openjpa.jdbc.JDBC - Using dictionary class "org.apache.openjpa.jdbc.sql.DerbyDictionary".
5 ordering.Odd INFO [main] openjpa.jdbc.JDBC - Using dictionary class "org.apache.openjpa.jdbc.sql.DerbyDictionary".
132 ordering WARN [main] openjpa.Runtime - Query "SELECT COUNT(p) FROM PObject p" is removed from cache excluded permanently. Query "SELECT COUNT(p) FROM PObject p" is not cached because it returns a single value rather than a list. A query that returns single value can not be cached. .
197 ordering WARN [Thread-27] openjpa.Runtime - Query "SELECT p FROM PObject p WHERE p.value > :v" is removed from cache excluded permanently. Query "SELECT p FROM PObject p WHERE p.value > :v" is not cached because its result is not obtained by executing a select statement. This can happen if the query was evaluated in-memory. The result was provided by org.apache.openjpa.lib.rop.MergedResultObjectProvider. .
0 ordering WARN [main] openjpa.Runtime - Slice identifiers are not explicitly listed via "openjpa.slice.Names" property.The configuration will be scanned to determine slice identifiers.
1 ordering INFO [main] openjpa.Runtime - Detected slices "[Even, Odd]" in configuration.
2 ordering INFO [main] openjpa.jdbc.JDBC - Using dictionary class "org.apache.openjpa.jdbc.sql.DerbyDictionary".
5 ordering INFO [main] openjpa.Runtime - Starting OpenJPA Slice 2.1.0-SNAPSHOT
4 ordering.Even INFO [main] openjpa.jdbc.JDBC - Using dictionary class "org.apache.openjpa.jdbc.sql.DerbyDictionary".
4 ordering.Odd INFO [main] openjpa.jdbc.JDBC - Using dictionary class "org.apache.openjpa.jdbc.sql.DerbyDictionary".
193 ordering WARN [main] openjpa.Runtime - Query "SELECT COUNT(p) FROM PObject p" is removed from cache excluded permanently. Query "SELECT COUNT(p) FROM PObject p" is not cached because it returns a single value rather than a list. A query that returns single value can not be cached. .
278 ordering WARN [Thread-32] openjpa.Runtime - Query "select a from Address a where a.city = :city" is removed from cache excluded permanently. Query "select a from Address a where a.city = :city" is not cached because its result is not obtained by executing a select statement. This can happen if the query was evaluated in-memory. The result was provided by org.apache.openjpa.lib.rop.MergedResultObjectProvider. .
282 ordering WARN [Thread-32] openjpa.Runtime - Query "SELECT p FROM Person p WHERE p.address = :a" is removed from cache excluded permanently. Query "SELECT p FROM Person p WHERE p.address = :a" is not cached because its result is not obtained by executing a select statement. This can happen if the query was evaluated in-memory. The result was provided by org.apache.openjpa.lib.rop.MergedResultObjectProvider. .
Build timed out. Aborting
Sending e-mails to: commits@openjpa.apache.org
Process 1289968432901 is killed.
[HUDSON] Recording test results
[INFO] ------------------------------------------------------------------------
[ERROR] FATAL ERROR
[INFO] ------------------------------------------------------------------------
[INFO] Unable to call isArchivingDisabled. Invalid object ID 23
[INFO] ------------------------------------------------------------------------
[INFO] Trace
java.lang.IllegalStateException: Unable to call isArchivingDisabled. Invalid object ID 23
at hudson.remoting.RemoteInvocationHandler$RPCRequest.perform(RemoteInvocationHandler.java:268)
at hudson.remoting.RemoteInvocationHandler$RPCRequest.call(RemoteInvocationHandler.java:255)
at hudson.remoting.RemoteInvocationHandler$RPCRequest.call(RemoteInvocationHandler.java:215)
at hudson.remoting.UserRequest.perform(UserRequest.java:114)
at hudson.remoting.UserRequest.perform(UserRequest.java:48)
at hudson.remoting.Request$2.run(Request.java:270)
at java.util.concurrent.Executors$RunnableAdapter.call(Executors.java:441)
at java.util.concurrent.FutureTask$Sync.innerRun(FutureTask.java:303)
at java.util.concurrent.FutureTask.run(FutureTask.java:138)
at java.util.concurrent.ThreadPoolExecutor$Worker.runTask(ThreadPoolExecutor.java:886)
at java.util.concurrent.ThreadPoolExecutor$Worker.run(ThreadPoolExecutor.java:908)
at java.lang.Thread.run(Thread.java:662)
[INFO] ------------------------------------------------------------------------
[INFO] Total time: 83 minutes 36 seconds
[INFO] Finished at: Wed Nov 17 04:55:21 UTC 2010
[INFO] Final Memory: 137M/565M
[INFO] ------------------------------------------------------------------------
channel stopped
Build failed in Hudson: OpenJPA-trunk #330
Posted by Apache Hudson Server <hu...@hudson.apache.org>.
See <https://hudson.apache.org/hudson/job/OpenJPA-trunk/330/changes>
Changes:
[mtylenda] OPENJPA-1863: Update HSQLDictionary for HSQLDB 2.0 - patch provided by Georgi Naplatanov with slight modifications.
------------------------------------------
[...truncated 22997 lines...]
[WARNING] We have a duplicate org/apache/bval/jsr303/util/NodeContextBuilderImpl.class in /home/hudson/.m2/repository/org/apache/bval/bval-jsr303/0.2-incubating/bval-jsr303-0.2-incubating.jar
[WARNING] We have a duplicate org/apache/bval/jsr303/util/PathImpl.class in /home/hudson/.m2/repository/org/apache/bval/bval-jsr303/0.2-incubating/bval-jsr303-0.2-incubating.jar
[WARNING] We have a duplicate org/apache/bval/jsr303/util/NodeImpl.class in /home/hudson/.m2/repository/org/apache/bval/bval-jsr303/0.2-incubating/bval-jsr303-0.2-incubating.jar
[WARNING] We have a duplicate org/apache/bval/jsr303/util/ConstraintDefinitionValidator.class in /home/hudson/.m2/repository/org/apache/bval/bval-jsr303/0.2-incubating/bval-jsr303-0.2-incubating.jar
[WARNING] We have a duplicate org/apache/bval/jsr303/util/NodeBuilderCustomizableContextImpl.class in /home/hudson/.m2/repository/org/apache/bval/bval-jsr303/0.2-incubating/bval-jsr303-0.2-incubating.jar
[WARNING] We have a duplicate org/apache/bval/jsr303/util/SecureActions$1.class in /home/hudson/.m2/repository/org/apache/bval/bval-jsr303/0.2-incubating/bval-jsr303-0.2-incubating.jar
[WARNING] We have a duplicate org/apache/bval/jsr303/util/SecureActions$2.class in /home/hudson/.m2/repository/org/apache/bval/bval-jsr303/0.2-incubating/bval-jsr303-0.2-incubating.jar
[WARNING] We have a duplicate org/apache/bval/jsr303/util/SecureActions$3.class in /home/hudson/.m2/repository/org/apache/bval/bval-jsr303/0.2-incubating/bval-jsr303-0.2-incubating.jar
[WARNING] We have a duplicate org/apache/bval/jsr303/util/SecureActions$4.class in /home/hudson/.m2/repository/org/apache/bval/bval-jsr303/0.2-incubating/bval-jsr303-0.2-incubating.jar
[WARNING] We have a duplicate org/apache/bval/jsr303/util/SecureActions$5.class in /home/hudson/.m2/repository/org/apache/bval/bval-jsr303/0.2-incubating/bval-jsr303-0.2-incubating.jar
[WARNING] We have a duplicate org/apache/bval/jsr303/util/SecureActions$6.class in /home/hudson/.m2/repository/org/apache/bval/bval-jsr303/0.2-incubating/bval-jsr303-0.2-incubating.jar
[WARNING] We have a duplicate org/apache/bval/jsr303/util/SecureActions.class in /home/hudson/.m2/repository/org/apache/bval/bval-jsr303/0.2-incubating/bval-jsr303-0.2-incubating.jar
[WARNING] We have a duplicate org/apache/bval/jsr303/util/TypeUtils$1.class in /home/hudson/.m2/repository/org/apache/bval/bval-jsr303/0.2-incubating/bval-jsr303-0.2-incubating.jar
[WARNING] We have a duplicate org/apache/bval/jsr303/util/TypeUtils$2.class in /home/hudson/.m2/repository/org/apache/bval/bval-jsr303/0.2-incubating/bval-jsr303-0.2-incubating.jar
[WARNING] We have a duplicate org/apache/bval/jsr303/util/TypeUtils.class in /home/hudson/.m2/repository/org/apache/bval/bval-jsr303/0.2-incubating/bval-jsr303-0.2-incubating.jar
[WARNING] We have a duplicate org/apache/bval/jsr303/util/EnumerationConverter.class in /home/hudson/.m2/repository/org/apache/bval/bval-jsr303/0.2-incubating/bval-jsr303-0.2-incubating.jar
[WARNING] We have a duplicate org/apache/bval/jsr303/util/NodeBuilderDefinedContextImpl.class in /home/hudson/.m2/repository/org/apache/bval/bval-jsr303/0.2-incubating/bval-jsr303-0.2-incubating.jar
[WARNING] We have a duplicate org/apache/bval/jsr303/util/IOUtils.class in /home/hudson/.m2/repository/org/apache/bval/bval-jsr303/0.2-incubating/bval-jsr303-0.2-incubating.jar
[WARNING] We have a duplicate org/apache/bval/jsr303/ConstraintValidatorIdentity.class in /home/hudson/.m2/repository/org/apache/bval/bval-jsr303/0.2-incubating/bval-jsr303-0.2-incubating.jar
[WARNING] We have a duplicate org/apache/bval/jsr303/resolver/JPATraversableResolver.class in /home/hudson/.m2/repository/org/apache/bval/bval-jsr303/0.2-incubating/bval-jsr303-0.2-incubating.jar
[WARNING] We have a duplicate org/apache/bval/jsr303/resolver/CachingRelevant.class in /home/hudson/.m2/repository/org/apache/bval/bval-jsr303/0.2-incubating/bval-jsr303-0.2-incubating.jar
[WARNING] We have a duplicate org/apache/bval/jsr303/resolver/DefaultTraversableResolver.class in /home/hudson/.m2/repository/org/apache/bval/bval-jsr303/0.2-incubating/bval-jsr303-0.2-incubating.jar
[WARNING] We have a duplicate org/apache/bval/jsr303/resolver/CachingTraversableResolver$CacheEntry.class in /home/hudson/.m2/repository/org/apache/bval/bval-jsr303/0.2-incubating/bval-jsr303-0.2-incubating.jar
[WARNING] We have a duplicate org/apache/bval/jsr303/resolver/CachingTraversableResolver$1.class in /home/hudson/.m2/repository/org/apache/bval/bval-jsr303/0.2-incubating/bval-jsr303-0.2-incubating.jar
[WARNING] We have a duplicate org/apache/bval/jsr303/resolver/CachingTraversableResolver.class in /home/hudson/.m2/repository/org/apache/bval/bval-jsr303/0.2-incubating/bval-jsr303-0.2-incubating.jar
[WARNING] We have a duplicate org/apache/bval/jsr303/resolver/SimpleTraversableResolver.class in /home/hudson/.m2/repository/org/apache/bval/bval-jsr303/0.2-incubating/bval-jsr303-0.2-incubating.jar
[WARNING] We have a duplicate org/apache/bval/jsr303/ElementDescriptorImpl.class in /home/hudson/.m2/repository/org/apache/bval/bval-jsr303/0.2-incubating/bval-jsr303-0.2-incubating.jar
[WARNING] We have a duplicate org/apache/bval/jsr303/extensions/ConstructorDescriptor.class in /home/hudson/.m2/repository/org/apache/bval/bval-jsr303/0.2-incubating/bval-jsr303-0.2-incubating.jar
[WARNING] We have a duplicate org/apache/bval/jsr303/extensions/ProcedureDescriptor.class in /home/hudson/.m2/repository/org/apache/bval/bval-jsr303/0.2-incubating/bval-jsr303-0.2-incubating.jar
[WARNING] We have a duplicate org/apache/bval/jsr303/extensions/ParameterDescriptor.class in /home/hudson/.m2/repository/org/apache/bval/bval-jsr303/0.2-incubating/bval-jsr303-0.2-incubating.jar
[WARNING] We have a duplicate org/apache/bval/jsr303/extensions/MethodBeanDescriptor.class in /home/hudson/.m2/repository/org/apache/bval/bval-jsr303/0.2-incubating/bval-jsr303-0.2-incubating.jar
[WARNING] We have a duplicate org/apache/bval/jsr303/extensions/MethodDescriptor.class in /home/hudson/.m2/repository/org/apache/bval/bval-jsr303/0.2-incubating/bval-jsr303-0.2-incubating.jar
[WARNING] We have a duplicate org/apache/bval/jsr303/extensions/ParameterDescriptorImpl.class in /home/hudson/.m2/repository/org/apache/bval/bval-jsr303/0.2-incubating/bval-jsr303-0.2-incubating.jar
[WARNING] We have a duplicate org/apache/bval/jsr303/extensions/MethodValidator.class in /home/hudson/.m2/repository/org/apache/bval/bval-jsr303/0.2-incubating/bval-jsr303-0.2-incubating.jar
[WARNING] We have a duplicate org/apache/bval/jsr303/extensions/MethodDescriptorImpl.class in /home/hudson/.m2/repository/org/apache/bval/bval-jsr303/0.2-incubating/bval-jsr303-0.2-incubating.jar
[WARNING] We have a duplicate org/apache/bval/jsr303/extensions/ReturnAccess.class in /home/hudson/.m2/repository/org/apache/bval/bval-jsr303/0.2-incubating/bval-jsr303-0.2-incubating.jar
[WARNING] We have a duplicate org/apache/bval/jsr303/extensions/ParameterAccess.class in /home/hudson/.m2/repository/org/apache/bval/bval-jsr303/0.2-incubating/bval-jsr303-0.2-incubating.jar
[WARNING] We have a duplicate org/apache/bval/jsr303/extensions/ConstructorDescriptorImpl.class in /home/hudson/.m2/repository/org/apache/bval/bval-jsr303/0.2-incubating/bval-jsr303-0.2-incubating.jar
[WARNING] We have a duplicate org/apache/bval/jsr303/extensions/AppendValidationToList.class in /home/hudson/.m2/repository/org/apache/bval/bval-jsr303/0.2-incubating/bval-jsr303-0.2-incubating.jar
[WARNING] We have a duplicate org/apache/bval/jsr303/extensions/MethodValidatorMetaBeanFactory.class in /home/hudson/.m2/repository/org/apache/bval/bval-jsr303/0.2-incubating/bval-jsr303-0.2-incubating.jar
[WARNING] We have a duplicate org/apache/bval/jsr303/extensions/MethodBeanDescriptorImpl.class in /home/hudson/.m2/repository/org/apache/bval/bval-jsr303/0.2-incubating/bval-jsr303-0.2-incubating.jar
[WARNING] We have a duplicate org/apache/bval/jsr303/extensions/MethodValidatorImpl.class in /home/hudson/.m2/repository/org/apache/bval/bval-jsr303/0.2-incubating/bval-jsr303-0.2-incubating.jar
[WARNING] We have a duplicate org/apache/bval/jsr303/ConstraintViolationImpl.class in /home/hudson/.m2/repository/org/apache/bval/bval-jsr303/0.2-incubating/bval-jsr303-0.2-incubating.jar
[WARNING] We have a duplicate org/apache/bval/jsr303/ConstraintValidatorContextImpl$ConstraintViolationBuilderImpl.class in /home/hudson/.m2/repository/org/apache/bval/bval-jsr303/0.2-incubating/bval-jsr303-0.2-incubating.jar
[WARNING] We have a duplicate org/apache/bval/jsr303/ConstraintValidatorContextImpl.class in /home/hudson/.m2/repository/org/apache/bval/bval-jsr303/0.2-incubating/bval-jsr303-0.2-incubating.jar
[WARNING] We have a duplicate org/apache/bval/jsr303/ConstraintValidation.class in /home/hudson/.m2/repository/org/apache/bval/bval-jsr303/0.2-incubating/bval-jsr303-0.2-incubating.jar
[WARNING] We have a duplicate org/apache/bval/jsr303/GroupValidationContext.class in /home/hudson/.m2/repository/org/apache/bval/bval-jsr303/0.2-incubating/bval-jsr303-0.2-incubating.jar
[WARNING] We have a duplicate org/apache/bval/jsr303/ConstraintValidationListener.class in /home/hudson/.m2/repository/org/apache/bval/bval-jsr303/0.2-incubating/bval-jsr303-0.2-incubating.jar
[WARNING] We have a duplicate org/apache/bval/jsr303/groups/Groups.class in /home/hudson/.m2/repository/org/apache/bval/bval-jsr303/0.2-incubating/bval-jsr303-0.2-incubating.jar
[WARNING] We have a duplicate org/apache/bval/jsr303/groups/Group.class in /home/hudson/.m2/repository/org/apache/bval/bval-jsr303/0.2-incubating/bval-jsr303-0.2-incubating.jar
[WARNING] We have a duplicate org/apache/bval/jsr303/groups/GroupsComputer.class in /home/hudson/.m2/repository/org/apache/bval/bval-jsr303/0.2-incubating/bval-jsr303-0.2-incubating.jar
[WARNING] We have a duplicate org/apache/bval/jsr303/DefaultMessageInterpolator.class in /home/hudson/.m2/repository/org/apache/bval/bval-jsr303/0.2-incubating/bval-jsr303-0.2-incubating.jar
[WARNING] We have a duplicate org/apache/bval/jsr303/ConstraintDefaults$1.class in /home/hudson/.m2/repository/org/apache/bval/bval-jsr303/0.2-incubating/bval-jsr303-0.2-incubating.jar
[WARNING] We have a duplicate org/apache/bval/jsr303/ConstraintDefaults.class in /home/hudson/.m2/repository/org/apache/bval/bval-jsr303/0.2-incubating/bval-jsr303-0.2-incubating.jar
[WARNING] We have a duplicate org/apache/bval/jsr303/BaseAppendValidation.class in /home/hudson/.m2/repository/org/apache/bval/bval-jsr303/0.2-incubating/bval-jsr303-0.2-incubating.jar
[WARNING] We have a duplicate org/apache/bval/jsr303/AppendValidation.class in /home/hudson/.m2/repository/org/apache/bval/bval-jsr303/0.2-incubating/bval-jsr303-0.2-incubating.jar
[WARNING] We have a duplicate org/apache/bval/jsr303/DefaultValidationProviderResolver.class in /home/hudson/.m2/repository/org/apache/bval/bval-jsr303/0.2-incubating/bval-jsr303-0.2-incubating.jar
[WARNING] We have a duplicate org/apache/bval/jsr303/Jsr303MetaBeanFactory.class in /home/hudson/.m2/repository/org/apache/bval/bval-jsr303/0.2-incubating/bval-jsr303-0.2-incubating.jar
[WARNING] We have a duplicate org/apache/bval/jsr303/ApacheFactoryContext$XMLMetaBeanManagerCreator.class in /home/hudson/.m2/repository/org/apache/bval/bval-jsr303/0.2-incubating/bval-jsr303-0.2-incubating.jar
[WARNING] We have a duplicate org/apache/bval/jsr303/ApacheFactoryContext.class in /home/hudson/.m2/repository/org/apache/bval/bval-jsr303/0.2-incubating/bval-jsr303-0.2-incubating.jar
[WARNING] We have a duplicate org/apache/bval/jsr303/BeanDescriptorImpl.class in /home/hudson/.m2/repository/org/apache/bval/bval-jsr303/0.2-incubating/bval-jsr303-0.2-incubating.jar
[WARNING] We have a duplicate org/apache/bval/jsr303/ApacheValidatorFactory.class in /home/hudson/.m2/repository/org/apache/bval/bval-jsr303/0.2-incubating/bval-jsr303-0.2-incubating.jar
[WARNING] We have a duplicate org/apache/bval/jsr303/ConstraintCached.class in /home/hudson/.m2/repository/org/apache/bval/bval-jsr303/0.2-incubating/bval-jsr303-0.2-incubating.jar
[WARNING] We have a duplicate org/apache/bval/jsr303/GroupValidationContextImpl.class in /home/hudson/.m2/repository/org/apache/bval/bval-jsr303/0.2-incubating/bval-jsr303-0.2-incubating.jar
[WARNING] We have a duplicate org/apache/bval/jsr303/DefaultConstraintValidatorFactory.class in /home/hudson/.m2/repository/org/apache/bval/bval-jsr303/0.2-incubating/bval-jsr303-0.2-incubating.jar
[WARNING] We have a duplicate org/apache/bval/jsr303/ConstraintDescriptorImpl.class in /home/hudson/.m2/repository/org/apache/bval/bval-jsr303/0.2-incubating/bval-jsr303-0.2-incubating.jar
[WARNING] We have a duplicate org/apache/bval/jsr303/Jsr303Features$Property.class in /home/hudson/.m2/repository/org/apache/bval/bval-jsr303/0.2-incubating/bval-jsr303-0.2-incubating.jar
[WARNING] We have a duplicate org/apache/bval/jsr303/Jsr303Features$Bean.class in /home/hudson/.m2/repository/org/apache/bval/bval-jsr303/0.2-incubating/bval-jsr303-0.2-incubating.jar
[WARNING] We have a duplicate org/apache/bval/jsr303/Jsr303Features.class in /home/hudson/.m2/repository/org/apache/bval/bval-jsr303/0.2-incubating/bval-jsr303-0.2-incubating.jar
[WARNING] We have a duplicate org/apache/bval/jsr303/ConfigurationImpl.class in /home/hudson/.m2/repository/org/apache/bval/bval-jsr303/0.2-incubating/bval-jsr303-0.2-incubating.jar
[WARNING] We have a duplicate org/apache/bval/jsr303/ApacheValidatorConfiguration$Properties.class in /home/hudson/.m2/repository/org/apache/bval/bval-jsr303/0.2-incubating/bval-jsr303-0.2-incubating.jar
[WARNING] We have a duplicate org/apache/bval/jsr303/ApacheValidatorConfiguration.class in /home/hudson/.m2/repository/org/apache/bval/bval-jsr303/0.2-incubating/bval-jsr303-0.2-incubating.jar
[WARNING] We have a duplicate org/apache/bval/jsr303/NestedMetaProperty.class in /home/hudson/.m2/repository/org/apache/bval/bval-jsr303/0.2-incubating/bval-jsr303-0.2-incubating.jar
[WARNING] We have a duplicate org/apache/bval/jsr303/UnknownPropertyException.class in /home/hudson/.m2/repository/org/apache/bval/bval-jsr303/0.2-incubating/bval-jsr303-0.2-incubating.jar
[WARNING] We have a duplicate org/apache/bval/jsr303/ClassValidator$Jsr303ValidationCallback.class in /home/hudson/.m2/repository/org/apache/bval/bval-jsr303/0.2-incubating/bval-jsr303-0.2-incubating.jar
[WARNING] We have a duplicate org/apache/bval/jsr303/ClassValidator.class in /home/hudson/.m2/repository/org/apache/bval/bval-jsr303/0.2-incubating/bval-jsr303-0.2-incubating.jar
[WARNING] We have a duplicate org/apache/bval/jsr303/AnnotationConstraintBuilder$1.class in /home/hudson/.m2/repository/org/apache/bval/bval-jsr303/0.2-incubating/bval-jsr303-0.2-incubating.jar
[WARNING] We have a duplicate org/apache/bval/jsr303/AnnotationConstraintBuilder$ConstraintOverrides.class in /home/hudson/.m2/repository/org/apache/bval/bval-jsr303/0.2-incubating/bval-jsr303-0.2-incubating.jar
[WARNING] We have a duplicate org/apache/bval/jsr303/AnnotationConstraintBuilder.class in /home/hudson/.m2/repository/org/apache/bval/bval-jsr303/0.2-incubating/bval-jsr303-0.2-incubating.jar
[WARNING] We have a duplicate org/apache/bval/jsr303/AppendValidationToBuilder.class in /home/hudson/.m2/repository/org/apache/bval/bval-jsr303/0.2-incubating/bval-jsr303-0.2-incubating.jar
[WARNING] We have a duplicate org/apache/bval/jsr303/ConstraintFinderImpl$1.class in /home/hudson/.m2/repository/org/apache/bval/bval-jsr303/0.2-incubating/bval-jsr303-0.2-incubating.jar
[WARNING] We have a duplicate org/apache/bval/jsr303/ConstraintFinderImpl.class in /home/hudson/.m2/repository/org/apache/bval/bval-jsr303/0.2-incubating/bval-jsr303-0.2-incubating.jar
[WARNING] We have a duplicate org/apache/bval/jsr303/PropertyDescriptorImpl.class in /home/hudson/.m2/repository/org/apache/bval/bval-jsr303/0.2-incubating/bval-jsr303-0.2-incubating.jar
[WARNING] We have a duplicate org/apache/bval/jsr303/AppendValidationToMeta.class in /home/hudson/.m2/repository/org/apache/bval/bval-jsr303/0.2-incubating/bval-jsr303-0.2-incubating.jar
[WARNING] We have a duplicate org/apache/bval/jsr303/ApacheValidationProvider.class in /home/hudson/.m2/repository/org/apache/bval/bval-jsr303/0.2-incubating/bval-jsr303-0.2-incubating.jar
[WARNING] We have a duplicate org/apache/bval/jsr303/GraphBeanIdentity.class in /home/hudson/.m2/repository/org/apache/bval/bval-jsr303/0.2-incubating/bval-jsr303-0.2-incubating.jar
[WARNING] We have a duplicate org/apache/bval/constraints/SizeValidator.class in /home/hudson/.m2/repository/org/apache/bval/bval-jsr303/0.2-incubating/bval-jsr303-0.2-incubating.jar
[WARNING] We have a duplicate org/apache/bval/constraints/SizeValidatorForArrayOfBoolean.class in /home/hudson/.m2/repository/org/apache/bval/bval-jsr303/0.2-incubating/bval-jsr303-0.2-incubating.jar
[WARNING] We have a duplicate org/apache/bval/constraints/SizeValidatorForArrayOfShort.class in /home/hudson/.m2/repository/org/apache/bval/bval-jsr303/0.2-incubating/bval-jsr303-0.2-incubating.jar
[WARNING] We have a duplicate org/apache/bval/constraints/MaxValidatorForNumber.class in /home/hudson/.m2/repository/org/apache/bval/bval-jsr303/0.2-incubating/bval-jsr303-0.2-incubating.jar
[WARNING] We have a duplicate org/apache/bval/constraints/DecimalMaxValidatorForNumber.class in /home/hudson/.m2/repository/org/apache/bval/bval-jsr303/0.2-incubating/bval-jsr303-0.2-incubating.jar
[WARNING] We have a duplicate org/apache/bval/constraints/DecimalMinValidatorForString.class in /home/hudson/.m2/repository/org/apache/bval/bval-jsr303/0.2-incubating/bval-jsr303-0.2-incubating.jar
[WARNING] We have a duplicate org/apache/bval/constraints/SizeValidatorForArrayOfObject.class in /home/hudson/.m2/repository/org/apache/bval/bval-jsr303/0.2-incubating/bval-jsr303-0.2-incubating.jar
[WARNING] We have a duplicate org/apache/bval/constraints/MaxValidatorForString.class in /home/hudson/.m2/repository/org/apache/bval/bval-jsr303/0.2-incubating/bval-jsr303-0.2-incubating.jar
[WARNING] We have a duplicate org/apache/bval/constraints/SizeValidatorForArrayOfByte.class in /home/hudson/.m2/repository/org/apache/bval/bval-jsr303/0.2-incubating/bval-jsr303-0.2-incubating.jar
[WARNING] We have a duplicate org/apache/bval/constraints/NotNullValidator.class in /home/hudson/.m2/repository/org/apache/bval/bval-jsr303/0.2-incubating/bval-jsr303-0.2-incubating.jar
[WARNING] We have a duplicate org/apache/bval/constraints/SizeValidatorForMap.class in /home/hudson/.m2/repository/org/apache/bval/bval-jsr303/0.2-incubating/bval-jsr303-0.2-incubating.jar
[WARNING] We have a duplicate org/apache/bval/constraints/DigitsValidatorForString.class in /home/hudson/.m2/repository/org/apache/bval/bval-jsr303/0.2-incubating/bval-jsr303-0.2-incubating.jar
[WARNING] We have a duplicate org/apache/bval/constraints/MinValidatorForString.class in /home/hudson/.m2/repository/org/apache/bval/bval-jsr303/0.2-incubating/bval-jsr303-0.2-incubating.jar
[WARNING] We have a duplicate org/apache/bval/constraints/NotEmptyValidatorForCollection.class in /home/hudson/.m2/repository/org/apache/bval/bval-jsr303/0.2-incubating/bval-jsr303-0.2-incubating.jar
[WARNING] We have a duplicate org/apache/bval/constraints/NotEmpty.class in /home/hudson/.m2/repository/org/apache/bval/bval-jsr303/0.2-incubating/bval-jsr303-0.2-incubating.jar
[WARNING] We have a duplicate org/apache/bval/constraints/DecimalMinValidatorForNumber.class in /home/hudson/.m2/repository/org/apache/bval/bval-jsr303/0.2-incubating/bval-jsr303-0.2-incubating.jar
[WARNING] We have a duplicate org/apache/bval/constraints/FutureValidatorForDate.class in /home/hudson/.m2/repository/org/apache/bval/bval-jsr303/0.2-incubating/bval-jsr303-0.2-incubating.jar
[WARNING] We have a duplicate org/apache/bval/constraints/SizeValidatorForArrayOfFloat.class in /home/hudson/.m2/repository/org/apache/bval/bval-jsr303/0.2-incubating/bval-jsr303-0.2-incubating.jar
[WARNING] We have a duplicate org/apache/bval/constraints/EmailValidator.class in /home/hudson/.m2/repository/org/apache/bval/bval-jsr303/0.2-incubating/bval-jsr303-0.2-incubating.jar
[WARNING] We have a duplicate org/apache/bval/constraints/Email.class in /home/hudson/.m2/repository/org/apache/bval/bval-jsr303/0.2-incubating/bval-jsr303-0.2-incubating.jar
[WARNING] We have a duplicate org/apache/bval/constraints/NotEmptyValidatorForString.class in /home/hudson/.m2/repository/org/apache/bval/bval-jsr303/0.2-incubating/bval-jsr303-0.2-incubating.jar
[WARNING] We have a duplicate org/apache/bval/constraints/AssertFalseValidator.class in /home/hudson/.m2/repository/org/apache/bval/bval-jsr303/0.2-incubating/bval-jsr303-0.2-incubating.jar
[WARNING] We have a duplicate org/apache/bval/constraints/PastValidatorForDate.class in /home/hudson/.m2/repository/org/apache/bval/bval-jsr303/0.2-incubating/bval-jsr303-0.2-incubating.jar
[WARNING] We have a duplicate org/apache/bval/constraints/DecimalMaxValidatorForString.class in /home/hudson/.m2/repository/org/apache/bval/bval-jsr303/0.2-incubating/bval-jsr303-0.2-incubating.jar
[WARNING] We have a duplicate org/apache/bval/constraints/NotEmptyValidatorForMap.class in /home/hudson/.m2/repository/org/apache/bval/bval-jsr303/0.2-incubating/bval-jsr303-0.2-incubating.jar
[WARNING] We have a duplicate org/apache/bval/constraints/FutureValidatorForCalendar.class in /home/hudson/.m2/repository/org/apache/bval/bval-jsr303/0.2-incubating/bval-jsr303-0.2-incubating.jar
[WARNING] We have a duplicate org/apache/bval/constraints/NullValidator.class in /home/hudson/.m2/repository/org/apache/bval/bval-jsr303/0.2-incubating/bval-jsr303-0.2-incubating.jar
[WARNING] We have a duplicate org/apache/bval/constraints/SizeValidatorForCollection.class in /home/hudson/.m2/repository/org/apache/bval/bval-jsr303/0.2-incubating/bval-jsr303-0.2-incubating.jar
[WARNING] We have a duplicate org/apache/bval/constraints/SizeValidatorForArrayOfLong.class in /home/hudson/.m2/repository/org/apache/bval/bval-jsr303/0.2-incubating/bval-jsr303-0.2-incubating.jar
[WARNING] We have a duplicate org/apache/bval/constraints/MinValidatorForNumber.class in /home/hudson/.m2/repository/org/apache/bval/bval-jsr303/0.2-incubating/bval-jsr303-0.2-incubating.jar
[WARNING] We have a duplicate org/apache/bval/constraints/AssertTrueValidator.class in /home/hudson/.m2/repository/org/apache/bval/bval-jsr303/0.2-incubating/bval-jsr303-0.2-incubating.jar
[WARNING] We have a duplicate org/apache/bval/constraints/PatternValidator.class in /home/hudson/.m2/repository/org/apache/bval/bval-jsr303/0.2-incubating/bval-jsr303-0.2-incubating.jar
[WARNING] We have a duplicate org/apache/bval/constraints/DigitsValidatorForNumber.class in /home/hudson/.m2/repository/org/apache/bval/bval-jsr303/0.2-incubating/bval-jsr303-0.2-incubating.jar
[WARNING] We have a duplicate org/apache/bval/constraints/SizeValidatorForArrayOfDouble.class in /home/hudson/.m2/repository/org/apache/bval/bval-jsr303/0.2-incubating/bval-jsr303-0.2-incubating.jar
[WARNING] We have a duplicate org/apache/bval/constraints/SizeValidatorForString.class in /home/hudson/.m2/repository/org/apache/bval/bval-jsr303/0.2-incubating/bval-jsr303-0.2-incubating.jar
[WARNING] We have a duplicate org/apache/bval/constraints/SizeValidatorForArrayOfChar.class in /home/hudson/.m2/repository/org/apache/bval/bval-jsr303/0.2-incubating/bval-jsr303-0.2-incubating.jar
[WARNING] We have a duplicate org/apache/bval/constraints/NotEmptyValidator.class in /home/hudson/.m2/repository/org/apache/bval/bval-jsr303/0.2-incubating/bval-jsr303-0.2-incubating.jar
[WARNING] We have a duplicate org/apache/bval/constraints/PastValidatorForCalendar.class in /home/hudson/.m2/repository/org/apache/bval/bval-jsr303/0.2-incubating/bval-jsr303-0.2-incubating.jar
[WARNING] We have a duplicate org/apache/bval/constraints/SizeValidatorForArrayOfInt.class in /home/hudson/.m2/repository/org/apache/bval/bval-jsr303/0.2-incubating/bval-jsr303-0.2-incubating.jar
[INFO] Replacing original artifact with shaded artifact.
[INFO] Replacing <https://hudson.apache.org/hudson/job/OpenJPA-trunk/ws/trunk/openjpa-all/target/openjpa-all-2.1.0-SNAPSHOT.jar> with <https://hudson.apache.org/hudson/job/OpenJPA-trunk/ws/trunk/openjpa-all/target/openjpa-all-2.1.0-SNAPSHOT-shaded.jar>
[INFO] [ianal:verify-legal-files {execution: default}]
[INFO] Checking legal files in: openjpa-all-2.1.0-SNAPSHOT.jar
[INFO] Checking legal files in: openjpa-all-2.1.0-SNAPSHOT-tests.jar
[INFO] [apache-rat:check {execution: default}]
[INFO] Exclude: **/.*/**
[INFO] Exclude: **/target/**/*
[INFO] [install:install {execution: default-install}]
[INFO] Installing <https://hudson.apache.org/hudson/job/OpenJPA-trunk/ws/trunk/openjpa-all/target/openjpa-all-2.1.0-SNAPSHOT.jar> to /home/hudson/.m2/repository/org/apache/openjpa/openjpa-all/2.1.0-SNAPSHOT/openjpa-all-2.1.0-SNAPSHOT.jar
[INFO] Installing <https://hudson.apache.org/hudson/job/OpenJPA-trunk/ws/trunk/openjpa-all/target/openjpa-all-2.1.0-SNAPSHOT-tests.jar> to /home/hudson/.m2/repository/org/apache/openjpa/openjpa-all/2.1.0-SNAPSHOT/openjpa-all-2.1.0-SNAPSHOT-tests.jar
[HUDSON] Archiving <https://hudson.apache.org/hudson/job/OpenJPA-trunk/ws/trunk/openjpa-all/dependency-reduced-pom.xml> to /home/hudson/hudson/jobs/OpenJPA-trunk/modules/org.apache.openjpa$openjpa-all/builds/2010-11-13_12-22-15/archive/org.apache.openjpa/openjpa-all/2.1.0-SNAPSHOT/dependency-reduced-pom.xml
[HUDSON] Archiving <https://hudson.apache.org/hudson/job/OpenJPA-trunk/ws/trunk/openjpa-all/target/openjpa-all-2.1.0-SNAPSHOT.jar> to /home/hudson/hudson/jobs/OpenJPA-trunk/modules/org.apache.openjpa$openjpa-all/builds/2010-11-13_12-22-15/archive/org.apache.openjpa/openjpa-all/2.1.0-SNAPSHOT/openjpa-all-2.1.0-SNAPSHOT.jar
[HUDSON] Archiving <https://hudson.apache.org/hudson/job/OpenJPA-trunk/ws/trunk/openjpa-all/target/openjpa-all-2.1.0-SNAPSHOT-tests.jar> to /home/hudson/hudson/jobs/OpenJPA-trunk/modules/org.apache.openjpa$openjpa-all/builds/2010-11-13_12-22-15/archive/org.apache.openjpa/openjpa-all/2.1.0-SNAPSHOT/openjpa-all-2.1.0-SNAPSHOT-tests.jar
[INFO] ------------------------------------------------------------------------
[INFO] Building OpenJPA Project Docs and Assemblies
[INFO] task-segment: [clean, install]
[INFO] ------------------------------------------------------------------------
[INFO] [clean:clean {execution: default-clean}]
[INFO] [buildnumber:create {execution: default}]
[INFO] [enforcer:enforce {execution: default}]
[INFO] [checkstyle:checkstyle {execution: default}]
[INFO] Source directory does not exist - skipping report.
[INFO] [remote-resources:process {execution: default}]
[INFO] [site:attach-descriptor {execution: default-attach-descriptor}]
[INFO] [assembly:attached {execution: bin}]
[INFO] Reading assembly descriptor: assembly.xml
[WARNING] Cannot include project artifact: org.apache.openjpa:apache-openjpa:pom:2.1.0-SNAPSHOT; it doesn't have an associated file or directory.
[WARNING] Cannot include project artifact: org.apache.openjpa:apache-openjpa:pom:2.1.0-SNAPSHOT; it doesn't have an associated file or directory.
[INFO] Building zip: <https://hudson.apache.org/hudson/job/OpenJPA-trunk/ws/trunk/openjpa-project/target/site/downloads/apache-openjpa-2.1.0-SNAPSHOT-binary.zip>
[WARNING] DEPRECATED [descriptor]: Please use descriptors instead
[INFO] [assembly:attached {execution: sources}]
[INFO] apache-openjpa-2.1.0-SNAPSHOT-source/README.txt already added, skipping
[INFO] apache-openjpa-2.1.0-SNAPSHOT-source/LICENSE already added, skipping
[INFO] apache-openjpa-2.1.0-SNAPSHOT-source/NOTICE already added, skipping
[INFO] Building zip: <https://hudson.apache.org/hudson/job/OpenJPA-trunk/ws/trunk/openjpa-project/target/site/downloads/apache-openjpa-2.1.0-SNAPSHOT-source.zip>
[INFO] apache-openjpa-2.1.0-SNAPSHOT-source/README.txt already added, skipping
[INFO] apache-openjpa-2.1.0-SNAPSHOT-source/LICENSE already added, skipping
[INFO] apache-openjpa-2.1.0-SNAPSHOT-source/NOTICE already added, skipping
[INFO] [ianal:verify-legal-files {execution: default}]
[INFO] Checking legal files in: apache-openjpa-2.1.0-SNAPSHOT-binary.zip
[INFO] Checking legal files in: apache-openjpa-2.1.0-SNAPSHOT-source.zip
[WARNING] Artifact does not contain any legal files: apache-openjpa-2.1.0-SNAPSHOT-source.zip
[INFO] [apache-rat:check {execution: default}]
[INFO] Exclude: **/.*/**
[INFO] Exclude: **/target/**/*
[INFO] [install:install {execution: default-install}]
[INFO] Installing <https://hudson.apache.org/hudson/job/OpenJPA-trunk/ws/trunk/openjpa-project/pom.xml> to /home/hudson/.m2/repository/org/apache/openjpa/apache-openjpa/2.1.0-SNAPSHOT/apache-openjpa-2.1.0-SNAPSHOT.pom
[INFO] Installing <https://hudson.apache.org/hudson/job/OpenJPA-trunk/ws/trunk/openjpa-project/target/site/downloads/apache-openjpa-2.1.0-SNAPSHOT-binary.zip> to /home/hudson/.m2/repository/org/apache/openjpa/apache-openjpa/2.1.0-SNAPSHOT/apache-openjpa-2.1.0-SNAPSHOT-binary.zip
[INFO] Installing <https://hudson.apache.org/hudson/job/OpenJPA-trunk/ws/trunk/openjpa-project/target/site/downloads/apache-openjpa-2.1.0-SNAPSHOT-source.zip> to /home/hudson/.m2/repository/org/apache/openjpa/apache-openjpa/2.1.0-SNAPSHOT/apache-openjpa-2.1.0-SNAPSHOT-source.zip
[HUDSON] Archiving <https://hudson.apache.org/hudson/job/OpenJPA-trunk/ws/trunk/openjpa-project/pom.xml> to /home/hudson/hudson/jobs/OpenJPA-trunk/modules/org.apache.openjpa$apache-openjpa/builds/2010-11-13_12-22-15/archive/org.apache.openjpa/apache-openjpa/2.1.0-SNAPSHOT/pom.xml
[HUDSON] Archiving /home/hudson/.m2/repository/org/apache/openjpa/apache-openjpa/2.1.0-SNAPSHOT/apache-openjpa-2.1.0-SNAPSHOT.pom to /home/hudson/hudson/jobs/OpenJPA-trunk/modules/org.apache.openjpa$apache-openjpa/builds/2010-11-13_12-22-15/archive/org.apache.openjpa/apache-openjpa/2.1.0-SNAPSHOT/apache-openjpa-2.1.0-SNAPSHOT.pom
[HUDSON] Archiving <https://hudson.apache.org/hudson/job/OpenJPA-trunk/ws/trunk/openjpa-project/target/site/downloads/apache-openjpa-2.1.0-SNAPSHOT-binary.zip> to /home/hudson/hudson/jobs/OpenJPA-trunk/modules/org.apache.openjpa$apache-openjpa/builds/2010-11-13_12-22-15/archive/org.apache.openjpa/apache-openjpa/2.1.0-SNAPSHOT/apache-openjpa-2.1.0-SNAPSHOT-binary.zip
[HUDSON] Archiving <https://hudson.apache.org/hudson/job/OpenJPA-trunk/ws/trunk/openjpa-project/target/site/downloads/apache-openjpa-2.1.0-SNAPSHOT-source.zip> to /home/hudson/hudson/jobs/OpenJPA-trunk/modules/org.apache.openjpa$apache-openjpa/builds/2010-11-13_12-22-15/archive/org.apache.openjpa/apache-openjpa/2.1.0-SNAPSHOT/apache-openjpa-2.1.0-SNAPSHOT-source.zip
Build timed out. Aborting
Sending e-mails to: commits@openjpa.apache.org
Sending e-mails to: commits@openjpa.apache.org
[INFO] ------------------------------------------------------------------------
[ERROR] FATAL ERROR
[INFO] ------------------------------------------------------------------------
[INFO] hudson.remoting.RequestAbortedException: hudson.remoting.Channel$OrderlyShutdown
[INFO] ------------------------------------------------------------------------
[INFO] Trace
hudson.remoting.RequestAbortedException: hudson.remoting.RequestAbortedException: hudson.remoting.Channel$OrderlyShutdown
at hudson.remoting.Request.call(Request.java:137)
at hudson.remoting.Channel.call(Channel.java:630)
at hudson.remoting.RemoteInvocationHandler.invoke(RemoteInvocationHandler.java:158)
at $Proxy2.isArchivingDisabled(Unknown Source)
at hudson.maven.MavenBuildProxy$Filter.isArchivingDisabled(MavenBuildProxy.java:222)
at hudson.maven.reporters.MavenArtifact.archive(MavenArtifact.java:192)
at hudson.maven.reporters.MavenArtifactArchiver.postBuild(MavenArtifactArchiver.java:107)
at hudson.maven.MavenModuleSetBuild$Builder.postModule(MavenModuleSetBuild.java:800)
at hudson.maven.MavenBuilder$Adapter.fireLeaveModule(MavenBuilder.java:317)
at hudson.maven.MavenBuilder$Adapter.postBuild(MavenBuilder.java:275)
at org.apache.maven.lifecycle.LifecycleExecutorInterceptor.execute(LifecycleExecutorInterceptor.java:68)
at org.apache.maven.DefaultMaven.doExecute(DefaultMaven.java:328)
at org.apache.maven.DefaultMaven.execute(DefaultMaven.java:138)
at org.apache.maven.cli.MavenCli.main(MavenCli.java:362)
at sun.reflect.NativeMethodAccessorImpl.invoke0(Native Method)
at sun.reflect.NativeMethodAccessorImpl.invoke(NativeMethodAccessorImpl.java:39)
at sun.reflect.DelegatingMethodAccessorImpl.invoke(DelegatingMethodAccessorImpl.java:25)
at java.lang.reflect.Method.invoke(Method.java:597)
at org.codehaus.classworlds.Launcher.launchEnhanced(Launcher.java:315)
at org.codehaus.classworlds.Launcher.launch(Launcher.java:255)
at hudson.maven.agent.Main.launch(Main.java:165)
at hudson.maven.MavenBuilder.call(MavenBuilder.java:165)
at hudson.maven.MavenModuleSetBuild$Builder.call(MavenModuleSetBuild.java:750)
at hudson.maven.MavenModuleSetBuild$Builder.call(MavenModuleSetBuild.java:694)
at hudson.remoting.UserRequest.perform(UserRequest.java:114)
at hudson.remoting.UserRequest.perform(UserRequest.java:48)
at hudson.remoting.Request$2.run(Request.java:270)
at java.util.concurrent.Executors$RunnableAdapter.call(Executors.java:441)
at java.util.concurrent.FutureTask$Sync.innerRun(FutureTask.java:303)
at java.util.concurrent.FutureTask.run(FutureTask.java:138)
at java.util.concurrent.ThreadPoolExecutor$Worker.runTask(ThreadPoolExecutor.java:886)
at java.util.concurrent.ThreadPoolExecutor$Worker.run(ThreadPoolExecutor.java:908)
at java.lang.Thread.run(Thread.java:619)
channel stopped
Caused by: hudson.remoting.RequestAbortedException: hudson.remoting.Channel$OrderlyShutdown
at hudson.remoting.Request.abort(Request.java:257)
at hudson.remoting.Channel.terminate(Channel.java:681)
at hudson.remoting.Channel$CloseCommand.execute(Channel.java:764)
at hudson.remoting.Channel$ReaderThread.run(Channel.java:963)
Caused by: hudson.remoting.Channel$OrderlyShutdown
... 2 more
Caused by: Command close created at
at hudson.remoting.Command.<init>(Command.java:58)
at hudson.remoting.Command.<init>(Command.java:47)
at hudson.remoting.Channel$CloseCommand.<init>(Channel.java:760)
at hudson.remoting.Channel$CloseCommand.<init>(Channel.java:760)
at hudson.remoting.Channel.close(Channel.java:805)
at hudson.slaves.Channels$1.close(Channels.java:91)
at hudson.maven.ProcessCache$MavenProcess.discard(ProcessCache.java:145)
at hudson.maven.MavenModuleSetBuild$RunnerImpl.doRun(MavenModuleSetBuild.java:541)
at hudson.model.AbstractBuild$AbstractRunner.run(AbstractBuild.java:416)
at hudson.model.Run.run(Run.java:1324)
at hudson.maven.MavenModuleSetBuild.run(MavenModuleSetBuild.java:349)
at hudson.model.ResourceController.execute(ResourceController.java:88)
at hudson.model.Executor.run(Executor.java:139)
[INFO] ------------------------------------------------------------------------
[INFO] Total time: 75 minutes 4 seconds
[INFO] Finished at: Sat Nov 13 13:37:28 UTC 2010
[INFO] Final Memory: 107M/514M
[INFO] ------------------------------------------------------------------------
Build failed in Hudson: OpenJPA-trunk #329
Posted by Apache Hudson Server <hu...@hudson.apache.org>.
See <https://hudson.apache.org/hudson/job/OpenJPA-trunk/329/changes>
Changes:
[curtisr7] OPENJPA-1844: Update javadoc for DataCacheInstrument.
------------------------------------------
Started by an SCM change
Building remotely on windows1
Updating https://svn.apache.org/repos/asf/openjpa/trunk
U openjpa-kernel\src\main\java\org\apache\openjpa\instrumentation\DataCacheInstrument.java
At revision 1033708
WARNING: clock of the subversion server appears to be out of sync. This can result in inconsistent check out behavior.
Parsing POMs
[trunk] $ c:\hudson\tools\java\latest-1.6-64/bin/java -Xmx1024m -XX:MaxPermSize=256m -cp c:\hudson\hudson-slave\maven-agent.jar;c:\hudson\tools\maven\apache-maven-2.2.1\boot\classworlds-1.1.jar hudson.maven.agent.Main c:\hudson\tools\maven\apache-maven-2.2.1 C:\Users\hudson\AppData\LocalLow\Sun\Java\Deployment\cache\6.0\11\186ce08b-3b0b3d36 c:\hudson\hudson-slave\maven-interceptor.jar 65174 c:\hudson\hudson-slave\maven2.1-interceptor.jar
<===[HUDSON REMOTING CAPACITY]===> channel started
Executing Maven: -B -f <https://hudson.apache.org/hudson/job/OpenJPA-trunk/ws/trunk\pom.xml> clean install
[INFO] Scanning for projects...
[INFO] Reactor build order:
[INFO] OpenJPA Parent POM
[INFO] OpenJPA Utilities Library
[INFO] OpenJPA Kernel
[INFO] OpenJPA JDBC
[INFO] OpenJPA Persistence
[INFO] OpenJPA Persistence JDBC
[INFO] OpenJPA Persistence Locking Tests
[INFO] OpenJPA XML Store
[INFO] OpenJPA Slice
[INFO] OpenJPA Aggregate Jar
[INFO] OpenJPA Aggregate Jar with Dependencies
[INFO] OpenJPA Project Docs and Assemblies
[INFO] OpenJPA Examples
[INFO] OpenJPA Examples - Simple
[INFO] OpenJPA Examples - image-gallery
[INFO] OpenJPA Examples - OpenBooks
[INFO] OpenJPA Integration Tests
[INFO] OpenJPA Integration Tests - Daytrader
[INFO] OpenJPA Integration Tests - Examples
[INFO] OpenJPA Integration Tests - SLF4JLogFactory
[INFO] OpenJPA Integration Tests - JPA TCK
[INFO] OpenJPA Integration Tests - Bean Validation
[INFO] OpenJPA Integration Tests - JMX Platform MBeans
[INFO] ------------------------------------------------------------------------
[INFO] Building OpenJPA Parent POM
[INFO] task-segment: [clean, install]
[INFO] ------------------------------------------------------------------------
[INFO] [clean:clean {execution: default-clean}]
[INFO] Deleting file set: <https://hudson.apache.org/hudson/job/OpenJPA-trunk/ws/trunk\target> (included: [**], excluded: [])
[INFO] [buildnumber:create {execution: default}]
[INFO] Checking for local modifications: skipped.
[INFO] Updating project files from SCM: skipped.
[INFO] Executing: cmd.exe /X /C "svn --non-interactive info"
[INFO] Working directory: <https://hudson.apache.org/hudson/job/OpenJPA-trunk/ws/trunk>
[INFO] Storing buildNumber: 1033705 at timestamp: November 10, 2010 at 4:16 AM
[INFO] Executing: cmd.exe /X /C "svn --non-interactive info"
[INFO] Working directory: <https://hudson.apache.org/hudson/job/OpenJPA-trunk/ws/trunk>
[INFO] Storing buildScmBranch: trunk
[INFO] [enforcer:enforce {execution: default}]
[INFO] Setting property: classpath.resource.loader.class => 'org.codehaus.plexus.velocity.ContextClassLoaderResourceLoader'.
[INFO] Setting property: velocimacro.messages.on => 'false'.
[INFO] Setting property: resource.loader => 'classpath'.
[INFO] Setting property: resource.manager.logwhenfound => 'false'.
[INFO] [checkstyle:checkstyle {execution: default}]
[INFO] Source directory does not exist - skipping report.
[INFO] Setting property: classpath.resource.loader.class => 'org.codehaus.plexus.velocity.ContextClassLoaderResourceLoader'.
[INFO] Setting property: velocimacro.messages.on => 'false'.
[INFO] Setting property: resource.loader => 'classpath'.
[INFO] Setting property: resource.manager.logwhenfound => 'false'.
[INFO] [remote-resources:process {execution: default}]
[INFO] [site:attach-descriptor {execution: default-attach-descriptor}]
[INFO] Parent project loaded from repository.
[INFO] [ianal:verify-legal-files {execution: default}]
[INFO] [apache-rat:check {execution: default}]
[INFO] Exclude: **/.*/**
[INFO] Exclude: **/target/**/*
[INFO] [install:install {execution: default-install}]
[INFO] Installing <https://hudson.apache.org/hudson/job/OpenJPA-trunk/ws/trunk\pom.xml> to C:\Users\hudson\.m2\repository\org\apache\openjpa\openjpa-parent\2.1.0-SNAPSHOT\openjpa-parent-2.1.0-SNAPSHOT.pom
[HUDSON] Archiving <https://hudson.apache.org/hudson/job/OpenJPA-trunk/ws/trunk\pom.xml> to /home/hudson/hudson/jobs/OpenJPA-trunk/modules/org.apache.openjpa$openjpa-parent/builds/2010-11-10_21-16-26/archive/org.apache.openjpa/openjpa-parent/2.1.0-SNAPSHOT/pom.xml
[HUDSON] Archiving C:\Users\hudson\.m2\repository\org\apache\openjpa\openjpa-parent\2.1.0-SNAPSHOT\openjpa-parent-2.1.0-SNAPSHOT.pom to /home/hudson/hudson/jobs/OpenJPA-trunk/modules/org.apache.openjpa$openjpa-parent/builds/2010-11-10_21-16-26/archive/org.apache.openjpa/openjpa-parent/2.1.0-SNAPSHOT/openjpa-parent-2.1.0-SNAPSHOT.pom
[INFO] ------------------------------------------------------------------------
[INFO] Building OpenJPA Utilities Library
[INFO] task-segment: [clean, install]
[INFO] ------------------------------------------------------------------------
[INFO] [clean:clean {execution: default-clean}]
[INFO] Deleting file set: C:\hudson\hudson-slave\workspace\OpenJPA-trunk\trunk\openjpa-lib\target (included: [**], excluded: [])
[HUDSON] Archiving C:\hudson\hudson-slave\workspace\OpenJPA-trunk\trunk\openjpa-lib\pom.xml to /home/hudson/hudson/jobs/OpenJPA-trunk/modules/org.apache.openjpa$openjpa-lib/builds/2010-11-10_21-16-26/archive/org.apache.openjpa/openjpa-lib/2.1.0-SNAPSHOT/pom.xml
[INFO] ------------------------------------------------------------------------
[ERROR] BUILD ERROR
[INFO] ------------------------------------------------------------------------
[INFO] Failed to delete directory: C:\hudson\hudson-slave\workspace\OpenJPA-trunk\trunk\openjpa-lib\target. Reason: Unable to delete file C:\hudson\hudson-slave\workspace\OpenJPA-trunk\trunk\openjpa-lib\target\openjpa-lib-2.1.0-SNAPSHOT.jar
[INFO] ------------------------------------------------------------------------
[INFO] For more information, run Maven with the -e switch
[INFO] ------------------------------------------------------------------------
[INFO] Total time: 2 minutes 5 seconds
[INFO] Finished at: Wed Nov 10 04:18:45 GMT 2010
[INFO] Final Memory: 65M/160M
[INFO] ------------------------------------------------------------------------
Sending e-mails to: commits@openjpa.apache.org
channel stopped
Build failed in Hudson: OpenJPA-trunk #328
Posted by Apache Hudson Server <hu...@hudson.apache.org>.
See <https://hudson.apache.org/hudson/job/OpenJPA-trunk/328/changes>
Changes:
[curtisr7] OPENJPA-1882: Fix DataCacheStoreManager NPE.
------------------------------------------
Started by an SCM change
Building remotely on windows1
Updating https://svn.apache.org/repos/asf/openjpa/trunk
U openjpa-kernel\src\main\java\org\apache\openjpa\datacache\DataCacheStoreManager.java
AU openjpa-persistence-jdbc\src\test\java\org\apache\openjpa\persistence\datacache\TestDataCacheStoreManager.java
At revision 1033642
WARNING: clock of the subversion server appears to be out of sync. This can result in inconsistent check out behavior.
Parsing POMs
[trunk] $ c:\hudson\tools\java\latest-1.6-64/bin/java -Xmx1024m -XX:MaxPermSize=256m -cp c:\hudson\hudson-slave\maven-agent.jar;c:\hudson\tools\maven\apache-maven-2.2.1\boot\classworlds-1.1.jar hudson.maven.agent.Main c:\hudson\tools\maven\apache-maven-2.2.1 C:\Users\hudson\AppData\LocalLow\Sun\Java\Deployment\cache\6.0\11\186ce08b-3b0b3d36 c:\hudson\hudson-slave\maven-interceptor.jar 65096 c:\hudson\hudson-slave\maven2.1-interceptor.jar
<===[HUDSON REMOTING CAPACITY]===> channel started
Executing Maven: -B -f <https://hudson.apache.org/hudson/job/OpenJPA-trunk/ws/trunk\pom.xml> clean install
[INFO] Scanning for projects...
[INFO] Reactor build order:
[INFO] OpenJPA Parent POM
[INFO] OpenJPA Utilities Library
[INFO] OpenJPA Kernel
[INFO] OpenJPA JDBC
[INFO] OpenJPA Persistence
[INFO] OpenJPA Persistence JDBC
[INFO] OpenJPA Persistence Locking Tests
[INFO] OpenJPA XML Store
[INFO] OpenJPA Slice
[INFO] OpenJPA Aggregate Jar
[INFO] OpenJPA Aggregate Jar with Dependencies
[INFO] OpenJPA Project Docs and Assemblies
[INFO] OpenJPA Examples
[INFO] OpenJPA Examples - Simple
[INFO] OpenJPA Examples - image-gallery
[INFO] OpenJPA Examples - OpenBooks
[INFO] OpenJPA Integration Tests
[INFO] OpenJPA Integration Tests - Daytrader
[INFO] OpenJPA Integration Tests - Examples
[INFO] OpenJPA Integration Tests - SLF4JLogFactory
[INFO] OpenJPA Integration Tests - JPA TCK
[INFO] OpenJPA Integration Tests - Bean Validation
[INFO] OpenJPA Integration Tests - JMX Platform MBeans
[INFO] ------------------------------------------------------------------------
[INFO] Building OpenJPA Parent POM
[INFO] task-segment: [clean, install]
[INFO] ------------------------------------------------------------------------
[INFO] [clean:clean {execution: default-clean}]
[INFO] Deleting file set: <https://hudson.apache.org/hudson/job/OpenJPA-trunk/ws/trunk\target> (included: [**], excluded: [])
[INFO] [buildnumber:create {execution: default}]
[INFO] Checking for local modifications: skipped.
[INFO] Updating project files from SCM: skipped.
[INFO] Executing: cmd.exe /X /C "svn --non-interactive info"
[INFO] Working directory: <https://hudson.apache.org/hudson/job/OpenJPA-trunk/ws/trunk>
[INFO] Storing buildNumber: 1033637 at timestamp: November 10, 2010 at 2:16 AM
[INFO] Executing: cmd.exe /X /C "svn --non-interactive info"
[INFO] Working directory: <https://hudson.apache.org/hudson/job/OpenJPA-trunk/ws/trunk>
[INFO] Storing buildScmBranch: trunk
[INFO] [enforcer:enforce {execution: default}]
[INFO] Setting property: classpath.resource.loader.class => 'org.codehaus.plexus.velocity.ContextClassLoaderResourceLoader'.
[INFO] Setting property: velocimacro.messages.on => 'false'.
[INFO] Setting property: resource.loader => 'classpath'.
[INFO] Setting property: resource.manager.logwhenfound => 'false'.
[INFO] [checkstyle:checkstyle {execution: default}]
[INFO] Source directory does not exist - skipping report.
[INFO] Setting property: classpath.resource.loader.class => 'org.codehaus.plexus.velocity.ContextClassLoaderResourceLoader'.
[INFO] Setting property: velocimacro.messages.on => 'false'.
[INFO] Setting property: resource.loader => 'classpath'.
[INFO] Setting property: resource.manager.logwhenfound => 'false'.
[INFO] [remote-resources:process {execution: default}]
[INFO] [site:attach-descriptor {execution: default-attach-descriptor}]
[INFO] Parent project loaded from repository.
[INFO] [ianal:verify-legal-files {execution: default}]
[INFO] [apache-rat:check {execution: default}]
[INFO] Exclude: **/.*/**
[INFO] Exclude: **/target/**/*
[INFO] [install:install {execution: default-install}]
[INFO] Installing <https://hudson.apache.org/hudson/job/OpenJPA-trunk/ws/trunk\pom.xml> to C:\Users\hudson\.m2\repository\org\apache\openjpa\openjpa-parent\2.1.0-SNAPSHOT\openjpa-parent-2.1.0-SNAPSHOT.pom
[HUDSON] Archiving <https://hudson.apache.org/hudson/job/OpenJPA-trunk/ws/trunk\pom.xml> to /home/hudson/hudson/jobs/OpenJPA-trunk/modules/org.apache.openjpa$openjpa-parent/builds/2010-11-10_19-15-38/archive/org.apache.openjpa/openjpa-parent/2.1.0-SNAPSHOT/pom.xml
[HUDSON] Archiving C:\Users\hudson\.m2\repository\org\apache\openjpa\openjpa-parent\2.1.0-SNAPSHOT\openjpa-parent-2.1.0-SNAPSHOT.pom to /home/hudson/hudson/jobs/OpenJPA-trunk/modules/org.apache.openjpa$openjpa-parent/builds/2010-11-10_19-15-38/archive/org.apache.openjpa/openjpa-parent/2.1.0-SNAPSHOT/openjpa-parent-2.1.0-SNAPSHOT.pom
[INFO] ------------------------------------------------------------------------
[INFO] Building OpenJPA Utilities Library
[INFO] task-segment: [clean, install]
[INFO] ------------------------------------------------------------------------
[INFO] [clean:clean {execution: default-clean}]
[INFO] Deleting file set: C:\hudson\hudson-slave\workspace\OpenJPA-trunk\trunk\openjpa-lib\target (included: [**], excluded: [])
[HUDSON] Archiving C:\hudson\hudson-slave\workspace\OpenJPA-trunk\trunk\openjpa-lib\pom.xml to /home/hudson/hudson/jobs/OpenJPA-trunk/modules/org.apache.openjpa$openjpa-lib/builds/2010-11-10_19-15-38/archive/org.apache.openjpa/openjpa-lib/2.1.0-SNAPSHOT/pom.xml
[INFO] ------------------------------------------------------------------------
[ERROR] BUILD ERROR
[INFO] ------------------------------------------------------------------------
[INFO] Failed to delete directory: C:\hudson\hudson-slave\workspace\OpenJPA-trunk\trunk\openjpa-lib\target. Reason: Unable to delete file C:\hudson\hudson-slave\workspace\OpenJPA-trunk\trunk\openjpa-lib\target\openjpa-lib-2.1.0-SNAPSHOT.jar
[INFO] ------------------------------------------------------------------------
[INFO] For more information, run Maven with the -e switch
[INFO] ------------------------------------------------------------------------
[INFO] Total time: 2 minutes 44 seconds
[INFO] Finished at: Wed Nov 10 02:18:48 GMT 2010
[INFO] Final Memory: 65M/176M
[INFO] ------------------------------------------------------------------------
Sending e-mails to: commits@openjpa.apache.org
channel stopped
Build failed in Hudson: OpenJPA-trunk #327
Posted by Apache Hudson Server <hu...@hudson.apache.org>.
See <https://hudson.apache.org/hudson/job/OpenJPA-trunk/327/changes>
Changes:
[kwsutter] OPENJPA-1881. Creating a new "completion" trace message for the enhancement processing.
------------------------------------------
Started by an SCM change
Building remotely on windows1
Updating https://svn.apache.org/repos/asf/openjpa/trunk
U openjpa-kernel\src\main\java\org\apache\openjpa\enhance\PCClassFileTransformer.java
U openjpa-kernel\src\main\resources\org\apache\openjpa\enhance\localizer.properties
At revision 1033490
WARNING: clock of the subversion server appears to be out of sync. This can result in inconsistent check out behavior.
Parsing POMs
[trunk] $ c:\hudson\tools\java\latest-1.6-64/bin/java -Xmx1024m -XX:MaxPermSize=256m -cp c:\hudson\hudson-slave\maven-agent.jar;c:\hudson\tools\maven\apache-maven-2.2.1\boot\classworlds-1.1.jar hudson.maven.agent.Main c:\hudson\tools\maven\apache-maven-2.2.1 C:\Users\hudson\AppData\LocalLow\Sun\Java\Deployment\cache\6.0\11\186ce08b-3b0b3d36 c:\hudson\hudson-slave\maven-interceptor.jar 64914 c:\hudson\hudson-slave\maven2.1-interceptor.jar
<===[HUDSON REMOTING CAPACITY]===> channel started
Executing Maven: -B -f <https://hudson.apache.org/hudson/job/OpenJPA-trunk/ws/trunk\pom.xml> clean install
[INFO] Scanning for projects...
[INFO] Reactor build order:
[INFO] OpenJPA Parent POM
[INFO] OpenJPA Utilities Library
[INFO] OpenJPA Kernel
[INFO] OpenJPA JDBC
[INFO] OpenJPA Persistence
[INFO] OpenJPA Persistence JDBC
[INFO] OpenJPA Persistence Locking Tests
[INFO] OpenJPA XML Store
[INFO] OpenJPA Slice
[INFO] OpenJPA Aggregate Jar
[INFO] OpenJPA Aggregate Jar with Dependencies
[INFO] OpenJPA Project Docs and Assemblies
[INFO] OpenJPA Examples
[INFO] OpenJPA Examples - Simple
[INFO] OpenJPA Examples - image-gallery
[INFO] OpenJPA Examples - OpenBooks
[INFO] OpenJPA Integration Tests
[INFO] OpenJPA Integration Tests - Daytrader
[INFO] OpenJPA Integration Tests - Examples
[INFO] OpenJPA Integration Tests - SLF4JLogFactory
[INFO] OpenJPA Integration Tests - JPA TCK
[INFO] OpenJPA Integration Tests - Bean Validation
[INFO] OpenJPA Integration Tests - JMX Platform MBeans
[INFO] ------------------------------------------------------------------------
[INFO] Building OpenJPA Parent POM
[INFO] task-segment: [clean, install]
[INFO] ------------------------------------------------------------------------
[INFO] [clean:clean {execution: default-clean}]
[INFO] Deleting file set: <https://hudson.apache.org/hudson/job/OpenJPA-trunk/ws/trunk\target> (included: [**], excluded: [])
[INFO] [buildnumber:create {execution: default}]
[INFO] Checking for local modifications: skipped.
[INFO] Updating project files from SCM: skipped.
[INFO] Executing: cmd.exe /X /C "svn --non-interactive info"
[INFO] Working directory: <https://hudson.apache.org/hudson/job/OpenJPA-trunk/ws/trunk>
[INFO] Storing buildNumber: 1033480 at timestamp: November 9, 2010 at 9:52 PM
[INFO] Executing: cmd.exe /X /C "svn --non-interactive info"
[INFO] Working directory: <https://hudson.apache.org/hudson/job/OpenJPA-trunk/ws/trunk>
[INFO] Storing buildScmBranch: trunk
[INFO] [enforcer:enforce {execution: default}]
[INFO] Setting property: classpath.resource.loader.class => 'org.codehaus.plexus.velocity.ContextClassLoaderResourceLoader'.
[INFO] Setting property: velocimacro.messages.on => 'false'.
[INFO] Setting property: resource.loader => 'classpath'.
[INFO] Setting property: resource.manager.logwhenfound => 'false'.
[INFO] [checkstyle:checkstyle {execution: default}]
[INFO] Source directory does not exist - skipping report.
[INFO] Setting property: classpath.resource.loader.class => 'org.codehaus.plexus.velocity.ContextClassLoaderResourceLoader'.
[INFO] Setting property: velocimacro.messages.on => 'false'.
[INFO] Setting property: resource.loader => 'classpath'.
[INFO] Setting property: resource.manager.logwhenfound => 'false'.
[INFO] [remote-resources:process {execution: default}]
[INFO] [site:attach-descriptor {execution: default-attach-descriptor}]
[INFO] Parent project loaded from repository.
[INFO] [ianal:verify-legal-files {execution: default}]
[INFO] [apache-rat:check {execution: default}]
[INFO] Exclude: **/.*/**
[INFO] Exclude: **/target/**/*
[INFO] [install:install {execution: default-install}]
[INFO] Installing <https://hudson.apache.org/hudson/job/OpenJPA-trunk/ws/trunk\pom.xml> to C:\Users\hudson\.m2\repository\org\apache\openjpa\openjpa-parent\2.1.0-SNAPSHOT\openjpa-parent-2.1.0-SNAPSHOT.pom
[HUDSON] Archiving <https://hudson.apache.org/hudson/job/OpenJPA-trunk/ws/trunk\pom.xml> to /home/hudson/hudson/jobs/OpenJPA-trunk/modules/org.apache.openjpa$openjpa-parent/builds/2010-11-10_14-49-47/archive/org.apache.openjpa/openjpa-parent/2.1.0-SNAPSHOT/pom.xml
[HUDSON] Archiving C:\Users\hudson\.m2\repository\org\apache\openjpa\openjpa-parent\2.1.0-SNAPSHOT\openjpa-parent-2.1.0-SNAPSHOT.pom to /home/hudson/hudson/jobs/OpenJPA-trunk/modules/org.apache.openjpa$openjpa-parent/builds/2010-11-10_14-49-47/archive/org.apache.openjpa/openjpa-parent/2.1.0-SNAPSHOT/openjpa-parent-2.1.0-SNAPSHOT.pom
[INFO] ------------------------------------------------------------------------
[INFO] Building OpenJPA Utilities Library
[INFO] task-segment: [clean, install]
[INFO] ------------------------------------------------------------------------
[INFO] [clean:clean {execution: default-clean}]
[INFO] Deleting file set: C:\hudson\hudson-slave\workspace\OpenJPA-trunk\trunk\openjpa-lib\target (included: [**], excluded: [])
[HUDSON] Archiving C:\hudson\hudson-slave\workspace\OpenJPA-trunk\trunk\openjpa-lib\pom.xml to /home/hudson/hudson/jobs/OpenJPA-trunk/modules/org.apache.openjpa$openjpa-lib/builds/2010-11-10_14-49-47/archive/org.apache.openjpa/openjpa-lib/2.1.0-SNAPSHOT/pom.xml
[INFO] ------------------------------------------------------------------------
[ERROR] BUILD ERROR
[INFO] ------------------------------------------------------------------------
[INFO] Failed to delete directory: C:\hudson\hudson-slave\workspace\OpenJPA-trunk\trunk\openjpa-lib\target. Reason: Unable to delete file C:\hudson\hudson-slave\workspace\OpenJPA-trunk\trunk\openjpa-lib\target\openjpa-lib-2.1.0-SNAPSHOT.jar
[INFO] ------------------------------------------------------------------------
[INFO] For more information, run Maven with the -e switch
[INFO] ------------------------------------------------------------------------
[INFO] Total time: 19 minutes 19 seconds
[INFO] Finished at: Tue Nov 09 22:09:34 GMT 2010
[INFO] Final Memory: 64M/176M
[INFO] ------------------------------------------------------------------------
Sending e-mails to: commits@openjpa.apache.org
channel stopped
Build failed in Hudson: OpenJPA-trunk #326
Posted by Apache Hudson Server <hu...@hudson.apache.org>.
See <https://hudson.apache.org/hudson/job/OpenJPA-trunk/326/changes>
Changes:
[faywang] OPENJPA-1762: fix test case problem
------------------------------------------
Started by an SCM change
Building remotely on windows1
Updating https://svn.apache.org/repos/asf/openjpa/trunk
U openjpa-persistence-locking\src\test\java\org\apache\openjpa\persistence\lockmgr\Person.java
At revision 1032795
WARNING: clock of the subversion server appears to be out of sync. This can result in inconsistent check out behavior.
Parsing POMs
[trunk] $ c:\hudson\tools\java\latest-1.6-64/bin/java -Xmx1024m -XX:MaxPermSize=256m -cp c:\hudson\hudson-slave\maven-agent.jar;c:\hudson\tools\maven\apache-maven-2.2.1\boot\classworlds-1.1.jar hudson.maven.agent.Main c:\hudson\tools\maven\apache-maven-2.2.1 C:\Users\hudson\AppData\LocalLow\Sun\Java\Deployment\cache\6.0\11\186ce08b-3b0b3d36 c:\hudson\hudson-slave\maven-interceptor.jar 60028 c:\hudson\hudson-slave\maven2.1-interceptor.jar
<===[HUDSON REMOTING CAPACITY]===> channel started
Executing Maven: -B -f <https://hudson.apache.org/hudson/job/OpenJPA-trunk/ws/trunk\pom.xml> clean install
[INFO] Scanning for projects...
[INFO] Reactor build order:
[INFO] OpenJPA Parent POM
[INFO] OpenJPA Utilities Library
[INFO] OpenJPA Kernel
[INFO] OpenJPA JDBC
[INFO] OpenJPA Persistence
[INFO] OpenJPA Persistence JDBC
[INFO] OpenJPA Persistence Locking Tests
[INFO] OpenJPA XML Store
[INFO] OpenJPA Slice
[INFO] OpenJPA Aggregate Jar
[INFO] OpenJPA Aggregate Jar with Dependencies
[INFO] OpenJPA Project Docs and Assemblies
[INFO] OpenJPA Examples
[INFO] OpenJPA Examples - Simple
[INFO] OpenJPA Examples - image-gallery
[INFO] OpenJPA Examples - OpenBooks
[INFO] OpenJPA Integration Tests
[INFO] OpenJPA Integration Tests - Daytrader
[INFO] OpenJPA Integration Tests - Examples
[INFO] OpenJPA Integration Tests - SLF4JLogFactory
[INFO] OpenJPA Integration Tests - JPA TCK
[INFO] OpenJPA Integration Tests - Bean Validation
[INFO] OpenJPA Integration Tests - JMX Platform MBeans
[INFO] ------------------------------------------------------------------------
[INFO] Building OpenJPA Parent POM
[INFO] task-segment: [clean, install]
[INFO] ------------------------------------------------------------------------
[INFO] [clean:clean {execution: default-clean}]
[INFO] Deleting file set: <https://hudson.apache.org/hudson/job/OpenJPA-trunk/ws/trunk\target> (included: [**], excluded: [])
[INFO] [buildnumber:create {execution: default}]
[INFO] Checking for local modifications: skipped.
[INFO] Updating project files from SCM: skipped.
[INFO] Executing: cmd.exe /X /C "svn --non-interactive info"
[INFO] Working directory: <https://hudson.apache.org/hudson/job/OpenJPA-trunk/ws/trunk>
[INFO] Storing buildNumber: 1032791 at timestamp: November 8, 2010 at 7:41 AM
[INFO] Executing: cmd.exe /X /C "svn --non-interactive info"
[INFO] Working directory: <https://hudson.apache.org/hudson/job/OpenJPA-trunk/ws/trunk>
[INFO] Storing buildScmBranch: trunk
[INFO] [enforcer:enforce {execution: default}]
[INFO] Setting property: classpath.resource.loader.class => 'org.codehaus.plexus.velocity.ContextClassLoaderResourceLoader'.
[INFO] Setting property: velocimacro.messages.on => 'false'.
[INFO] Setting property: resource.loader => 'classpath'.
[INFO] Setting property: resource.manager.logwhenfound => 'false'.
[INFO] [checkstyle:checkstyle {execution: default}]
[INFO] Source directory does not exist - skipping report.
[INFO] Setting property: classpath.resource.loader.class => 'org.codehaus.plexus.velocity.ContextClassLoaderResourceLoader'.
[INFO] Setting property: velocimacro.messages.on => 'false'.
[INFO] Setting property: resource.loader => 'classpath'.
[INFO] Setting property: resource.manager.logwhenfound => 'false'.
[INFO] [remote-resources:process {execution: default}]
[INFO] [site:attach-descriptor {execution: default-attach-descriptor}]
[INFO] Parent project loaded from repository.
[INFO] [ianal:verify-legal-files {execution: default}]
[INFO] [apache-rat:check {execution: default}]
[INFO] Exclude: **/.*/**
[INFO] Exclude: **/target/**/*
[INFO] [install:install {execution: default-install}]
[INFO] Installing <https://hudson.apache.org/hudson/job/OpenJPA-trunk/ws/trunk\pom.xml> to C:\Users\hudson\.m2\repository\org\apache\openjpa\openjpa-parent\2.1.0-SNAPSHOT\openjpa-parent-2.1.0-SNAPSHOT.pom
[HUDSON] Archiving <https://hudson.apache.org/hudson/job/OpenJPA-trunk/ws/trunk\pom.xml> to /home/hudson/hudson/jobs/OpenJPA-trunk/modules/org.apache.openjpa$openjpa-parent/builds/2010-11-09_00-41-07/archive/org.apache.openjpa/openjpa-parent/2.1.0-SNAPSHOT/pom.xml
[HUDSON] Archiving C:\Users\hudson\.m2\repository\org\apache\openjpa\openjpa-parent\2.1.0-SNAPSHOT\openjpa-parent-2.1.0-SNAPSHOT.pom to /home/hudson/hudson/jobs/OpenJPA-trunk/modules/org.apache.openjpa$openjpa-parent/builds/2010-11-09_00-41-07/archive/org.apache.openjpa/openjpa-parent/2.1.0-SNAPSHOT/openjpa-parent-2.1.0-SNAPSHOT.pom
[INFO] ------------------------------------------------------------------------
[INFO] Building OpenJPA Utilities Library
[INFO] task-segment: [clean, install]
[INFO] ------------------------------------------------------------------------
[INFO] [clean:clean {execution: default-clean}]
[INFO] Deleting file set: C:\hudson\hudson-slave\workspace\OpenJPA-trunk\trunk\openjpa-lib\target (included: [**], excluded: [])
[HUDSON] Archiving C:\hudson\hudson-slave\workspace\OpenJPA-trunk\trunk\openjpa-lib\pom.xml to /home/hudson/hudson/jobs/OpenJPA-trunk/modules/org.apache.openjpa$openjpa-lib/builds/2010-11-09_00-41-07/archive/org.apache.openjpa/openjpa-lib/2.1.0-SNAPSHOT/pom.xml
[INFO] ------------------------------------------------------------------------
[ERROR] BUILD ERROR
[INFO] ------------------------------------------------------------------------
[INFO] Failed to delete directory: C:\hudson\hudson-slave\workspace\OpenJPA-trunk\trunk\openjpa-lib\target. Reason: Unable to delete file C:\hudson\hudson-slave\workspace\OpenJPA-trunk\trunk\openjpa-lib\target\openjpa-lib-2.1.0-SNAPSHOT.jar
[INFO] ------------------------------------------------------------------------
[INFO] For more information, run Maven with the -e switch
[INFO] ------------------------------------------------------------------------
[INFO] Total time: 1 minute 54 seconds
[INFO] Finished at: Mon Nov 08 07:43:23 GMT 2010
[INFO] Final Memory: 65M/166M
[INFO] ------------------------------------------------------------------------
Sending e-mails to: commits@openjpa.apache.org
channel stopped
Build failed in Hudson: OpenJPA-trunk #325
Posted by Apache Hudson Server <hu...@hudson.apache.org>.
See <https://hudson.apache.org/hudson/job/OpenJPA-trunk/325/changes>
Changes:
[faywang] OPENJPA-1762: lock join table when pessimistic scope is set to EXTENDED
------------------------------------------
Started by an SCM change
Building remotely on windows1
Updating https://svn.apache.org/repos/asf/openjpa/trunk
U openjpa-jdbc\src\main\java\org\apache\openjpa\jdbc\kernel\PessimisticLockManager.java
U openjpa-persistence\src\main\java\org\apache\openjpa\persistence\EntityManagerImpl.java
At revision 1032693
WARNING: clock of the subversion server appears to be out of sync. This can result in inconsistent check out behavior.
Parsing POMs
[trunk] $ c:\hudson\tools\java\latest-1.6-64/bin/java -Xmx1024m -XX:MaxPermSize=256m -cp c:\hudson\hudson-slave\maven-agent.jar;c:\hudson\tools\maven\apache-maven-2.2.1\boot\classworlds-1.1.jar hudson.maven.agent.Main c:\hudson\tools\maven\apache-maven-2.2.1 C:\Users\hudson\AppData\LocalLow\Sun\Java\Deployment\cache\6.0\11\186ce08b-3b0b3d36 c:\hudson\hudson-slave\maven-interceptor.jar 59973 c:\hudson\hudson-slave\maven2.1-interceptor.jar
<===[HUDSON REMOTING CAPACITY]===> channel started
Executing Maven: -B -f <https://hudson.apache.org/hudson/job/OpenJPA-trunk/ws/trunk\pom.xml> clean install
[INFO] Scanning for projects...
[INFO] Reactor build order:
[INFO] OpenJPA Parent POM
[INFO] OpenJPA Utilities Library
[INFO] OpenJPA Kernel
[INFO] OpenJPA JDBC
[INFO] OpenJPA Persistence
[INFO] OpenJPA Persistence JDBC
[INFO] OpenJPA Persistence Locking Tests
[INFO] OpenJPA XML Store
[INFO] OpenJPA Slice
[INFO] OpenJPA Aggregate Jar
[INFO] OpenJPA Aggregate Jar with Dependencies
[INFO] OpenJPA Project Docs and Assemblies
[INFO] OpenJPA Examples
[INFO] OpenJPA Examples - Simple
[INFO] OpenJPA Examples - image-gallery
[INFO] OpenJPA Examples - OpenBooks
[INFO] OpenJPA Integration Tests
[INFO] OpenJPA Integration Tests - Daytrader
[INFO] OpenJPA Integration Tests - Examples
[INFO] OpenJPA Integration Tests - SLF4JLogFactory
[INFO] OpenJPA Integration Tests - JPA TCK
[INFO] OpenJPA Integration Tests - Bean Validation
[INFO] OpenJPA Integration Tests - JMX Platform MBeans
[INFO] ------------------------------------------------------------------------
[INFO] Building OpenJPA Parent POM
[INFO] task-segment: [clean, install]
[INFO] ------------------------------------------------------------------------
[INFO] [clean:clean {execution: default-clean}]
[INFO] Deleting file set: <https://hudson.apache.org/hudson/job/OpenJPA-trunk/ws/trunk\target> (included: [**], excluded: [])
[INFO] [buildnumber:create {execution: default}]
[INFO] Checking for local modifications: skipped.
[INFO] Updating project files from SCM: skipped.
[INFO] Executing: cmd.exe /X /C "svn --non-interactive info"
[INFO] Working directory: <https://hudson.apache.org/hudson/job/OpenJPA-trunk/ws/trunk>
[INFO] Storing buildNumber: 1032686 at timestamp: November 8, 2010 at 3:41 AM
[INFO] Executing: cmd.exe /X /C "svn --non-interactive info"
[INFO] Working directory: <https://hudson.apache.org/hudson/job/OpenJPA-trunk/ws/trunk>
[INFO] Storing buildScmBranch: trunk
[INFO] [enforcer:enforce {execution: default}]
[INFO] Setting property: classpath.resource.loader.class => 'org.codehaus.plexus.velocity.ContextClassLoaderResourceLoader'.
[INFO] Setting property: velocimacro.messages.on => 'false'.
[INFO] Setting property: resource.loader => 'classpath'.
[INFO] Setting property: resource.manager.logwhenfound => 'false'.
[INFO] [checkstyle:checkstyle {execution: default}]
[INFO] Source directory does not exist - skipping report.
[INFO] Setting property: classpath.resource.loader.class => 'org.codehaus.plexus.velocity.ContextClassLoaderResourceLoader'.
[INFO] Setting property: velocimacro.messages.on => 'false'.
[INFO] Setting property: resource.loader => 'classpath'.
[INFO] Setting property: resource.manager.logwhenfound => 'false'.
[INFO] [remote-resources:process {execution: default}]
[INFO] [site:attach-descriptor {execution: default-attach-descriptor}]
[INFO] Parent project loaded from repository.
[INFO] [ianal:verify-legal-files {execution: default}]
[INFO] [apache-rat:check {execution: default}]
[INFO] Exclude: **/.*/**
[INFO] Exclude: **/target/**/*
[INFO] [install:install {execution: default-install}]
[INFO] Installing <https://hudson.apache.org/hudson/job/OpenJPA-trunk/ws/trunk\pom.xml> to C:\Users\hudson\.m2\repository\org\apache\openjpa\openjpa-parent\2.1.0-SNAPSHOT\openjpa-parent-2.1.0-SNAPSHOT.pom
[HUDSON] Archiving <https://hudson.apache.org/hudson/job/OpenJPA-trunk/ws/trunk\pom.xml> to /home/hudson/hudson/jobs/OpenJPA-trunk/modules/org.apache.openjpa$openjpa-parent/builds/2010-11-08_20-40-49/archive/org.apache.openjpa/openjpa-parent/2.1.0-SNAPSHOT/pom.xml
[HUDSON] Archiving C:\Users\hudson\.m2\repository\org\apache\openjpa\openjpa-parent\2.1.0-SNAPSHOT\openjpa-parent-2.1.0-SNAPSHOT.pom to /home/hudson/hudson/jobs/OpenJPA-trunk/modules/org.apache.openjpa$openjpa-parent/builds/2010-11-08_20-40-49/archive/org.apache.openjpa/openjpa-parent/2.1.0-SNAPSHOT/openjpa-parent-2.1.0-SNAPSHOT.pom
[INFO] ------------------------------------------------------------------------
[INFO] Building OpenJPA Utilities Library
[INFO] task-segment: [clean, install]
[INFO] ------------------------------------------------------------------------
[INFO] [clean:clean {execution: default-clean}]
[INFO] Deleting file set: C:\hudson\hudson-slave\workspace\OpenJPA-trunk\trunk\openjpa-lib\target (included: [**], excluded: [])
[HUDSON] Archiving C:\hudson\hudson-slave\workspace\OpenJPA-trunk\trunk\openjpa-lib\pom.xml to /home/hudson/hudson/jobs/OpenJPA-trunk/modules/org.apache.openjpa$openjpa-lib/builds/2010-11-08_20-40-49/archive/org.apache.openjpa/openjpa-lib/2.1.0-SNAPSHOT/pom.xml
[INFO] ------------------------------------------------------------------------
[ERROR] BUILD ERROR
[INFO] ------------------------------------------------------------------------
[INFO] Failed to delete directory: C:\hudson\hudson-slave\workspace\OpenJPA-trunk\trunk\openjpa-lib\target. Reason: Unable to delete file C:\hudson\hudson-slave\workspace\OpenJPA-trunk\trunk\openjpa-lib\target\openjpa-lib-2.1.0-SNAPSHOT.jar
[INFO] ------------------------------------------------------------------------
[INFO] For more information, run Maven with the -e switch
[INFO] ------------------------------------------------------------------------
[INFO] Total time: 2 minutes 47 seconds
[INFO] Finished at: Mon Nov 08 03:43:56 GMT 2010
[INFO] Final Memory: 65M/166M
[INFO] ------------------------------------------------------------------------
Sending e-mails to: commits@openjpa.apache.org
channel stopped
Build failed in Hudson: OpenJPA-trunk #324
Posted by Apache Hudson Server <hu...@hudson.apache.org>.
See <https://hudson.apache.org/hudson/job/OpenJPA-trunk/324/>
------------------------------------------
Started by an SCM change
Building remotely on windows1
Updating https://svn.apache.org/repos/asf/openjpa/trunk
U openjpa-jdbc\src\main\java\org\apache\openjpa\jdbc\sql\OracleDictionary.java
U openjpa-jdbc\src\main\java\org\apache\openjpa\jdbc\schema\Table.java
At revision 1032661
WARNING: clock of the subversion server appears to be out of sync. This can result in inconsistent check out behavior.
no revision recorded for https://svn.apache.org/repos/asf/openjpa/trunk in the previous build
Parsing POMs
[trunk] $ c:\hudson\tools\java\latest-1.6-64/bin/java -Xmx1024m -XX:MaxPermSize=256m -cp c:\hudson\hudson-slave\maven-agent.jar;c:\hudson\tools\maven\apache-maven-2.2.1\boot\classworlds-1.1.jar hudson.maven.agent.Main c:\hudson\tools\maven\apache-maven-2.2.1 C:\Users\hudson\AppData\LocalLow\Sun\Java\Deployment\cache\6.0\11\186ce08b-3b0b3d36 c:\hudson\hudson-slave\maven-interceptor.jar 59947 c:\hudson\hudson-slave\maven2.1-interceptor.jar
<===[HUDSON REMOTING CAPACITY]===> channel started
Executing Maven: -B -f <https://hudson.apache.org/hudson/job/OpenJPA-trunk/ws/trunk\pom.xml> clean install
[INFO] Scanning for projects...
[INFO] Reactor build order:
[INFO] OpenJPA Parent POM
[INFO] OpenJPA Utilities Library
[INFO] OpenJPA Kernel
[INFO] OpenJPA JDBC
[INFO] OpenJPA Persistence
[INFO] OpenJPA Persistence JDBC
[INFO] OpenJPA Persistence Locking Tests
[INFO] OpenJPA XML Store
[INFO] OpenJPA Slice
[INFO] OpenJPA Aggregate Jar
[INFO] OpenJPA Aggregate Jar with Dependencies
[INFO] OpenJPA Project Docs and Assemblies
[INFO] OpenJPA Examples
[INFO] OpenJPA Examples - Simple
[INFO] OpenJPA Examples - image-gallery
[INFO] OpenJPA Examples - OpenBooks
[INFO] OpenJPA Integration Tests
[INFO] OpenJPA Integration Tests - Daytrader
[INFO] OpenJPA Integration Tests - Examples
[INFO] OpenJPA Integration Tests - SLF4JLogFactory
[INFO] OpenJPA Integration Tests - JPA TCK
[INFO] OpenJPA Integration Tests - Bean Validation
[INFO] OpenJPA Integration Tests - JMX Platform MBeans
[INFO] ------------------------------------------------------------------------
[INFO] Building OpenJPA Parent POM
[INFO] task-segment: [clean, install]
[INFO] ------------------------------------------------------------------------
[INFO] [clean:clean {execution: default-clean}]
[INFO] Deleting file set: <https://hudson.apache.org/hudson/job/OpenJPA-trunk/ws/trunk\target> (included: [**], excluded: [])
[INFO] [buildnumber:create {execution: default}]
[INFO] Checking for local modifications: skipped.
[INFO] Updating project files from SCM: skipped.
[INFO] Executing: cmd.exe /X /C "svn --non-interactive info"
[INFO] Working directory: <https://hudson.apache.org/hudson/job/OpenJPA-trunk/ws/trunk>
[INFO] Storing buildNumber: 1032646 at timestamp: November 8, 2010 at 1:44 AM
[INFO] Executing: cmd.exe /X /C "svn --non-interactive info"
[INFO] Working directory: <https://hudson.apache.org/hudson/job/OpenJPA-trunk/ws/trunk>
[INFO] Storing buildScmBranch: trunk
[INFO] [enforcer:enforce {execution: default}]
[INFO] Setting property: classpath.resource.loader.class => 'org.codehaus.plexus.velocity.ContextClassLoaderResourceLoader'.
[INFO] Setting property: velocimacro.messages.on => 'false'.
[INFO] Setting property: resource.loader => 'classpath'.
[INFO] Setting property: resource.manager.logwhenfound => 'false'.
[INFO] [checkstyle:checkstyle {execution: default}]
[INFO] Source directory does not exist - skipping report.
[INFO] Setting property: classpath.resource.loader.class => 'org.codehaus.plexus.velocity.ContextClassLoaderResourceLoader'.
[INFO] Setting property: velocimacro.messages.on => 'false'.
[INFO] Setting property: resource.loader => 'classpath'.
[INFO] Setting property: resource.manager.logwhenfound => 'false'.
[INFO] [remote-resources:process {execution: default}]
[INFO] [site:attach-descriptor {execution: default-attach-descriptor}]
[INFO] Parent project loaded from repository.
[INFO] [ianal:verify-legal-files {execution: default}]
[INFO] [apache-rat:check {execution: default}]
[INFO] Exclude: **/.*/**
[INFO] Exclude: **/target/**/*
[INFO] [install:install {execution: default-install}]
[INFO] Installing <https://hudson.apache.org/hudson/job/OpenJPA-trunk/ws/trunk\pom.xml> to C:\Users\hudson\.m2\repository\org\apache\openjpa\openjpa-parent\2.1.0-SNAPSHOT\openjpa-parent-2.1.0-SNAPSHOT.pom
[HUDSON] Archiving <https://hudson.apache.org/hudson/job/OpenJPA-trunk/ws/trunk\pom.xml> to /home/hudson/hudson/jobs/OpenJPA-trunk/modules/org.apache.openjpa$openjpa-parent/builds/2010-11-08_18-42-52/archive/org.apache.openjpa/openjpa-parent/2.1.0-SNAPSHOT/pom.xml
[HUDSON] Archiving C:\Users\hudson\.m2\repository\org\apache\openjpa\openjpa-parent\2.1.0-SNAPSHOT\openjpa-parent-2.1.0-SNAPSHOT.pom to /home/hudson/hudson/jobs/OpenJPA-trunk/modules/org.apache.openjpa$openjpa-parent/builds/2010-11-08_18-42-52/archive/org.apache.openjpa/openjpa-parent/2.1.0-SNAPSHOT/openjpa-parent-2.1.0-SNAPSHOT.pom
[INFO] ------------------------------------------------------------------------
[INFO] Building OpenJPA Utilities Library
[INFO] task-segment: [clean, install]
[INFO] ------------------------------------------------------------------------
[INFO] [clean:clean {execution: default-clean}]
[INFO] Deleting file set: C:\hudson\hudson-slave\workspace\OpenJPA-trunk\trunk\openjpa-lib\target (included: [**], excluded: [])
[HUDSON] Archiving C:\hudson\hudson-slave\workspace\OpenJPA-trunk\trunk\openjpa-lib\pom.xml to /home/hudson/hudson/jobs/OpenJPA-trunk/modules/org.apache.openjpa$openjpa-lib/builds/2010-11-08_18-42-52/archive/org.apache.openjpa/openjpa-lib/2.1.0-SNAPSHOT/pom.xml
[INFO] ------------------------------------------------------------------------
[ERROR] BUILD ERROR
[INFO] ------------------------------------------------------------------------
[INFO] Failed to delete directory: C:\hudson\hudson-slave\workspace\OpenJPA-trunk\trunk\openjpa-lib\target. Reason: Unable to delete file C:\hudson\hudson-slave\workspace\OpenJPA-trunk\trunk\openjpa-lib\target\openjpa-lib-2.1.0-SNAPSHOT.jar
[INFO] ------------------------------------------------------------------------
[INFO] For more information, run Maven with the -e switch
[INFO] ------------------------------------------------------------------------
[INFO] Total time: 19 minutes 57 seconds
[INFO] Finished at: Mon Nov 08 02:03:12 GMT 2010
[INFO] Final Memory: 64M/163M
[INFO] ------------------------------------------------------------------------
Sending e-mails to: commits@openjpa.apache.org
channel stopped
Build failed in Hudson: OpenJPA-trunk #323
Posted by Apache Hudson Server <hu...@hudson.apache.org>.
See <https://hudson.apache.org/hudson/job/OpenJPA-trunk/323/>
------------------------------------------
Started by an SCM change
Building remotely on windows1
Updating https://svn.apache.org/repos/asf/openjpa/trunk
ERROR: Failed to update https://svn.apache.org/repos/asf/openjpa/trunk
org.tmatesoft.svn.core.SVNException: svn: Software caused connection abort: recv failed
svn: PROPFIND request failed on '/repos/asf/openjpa/trunk'
at org.tmatesoft.svn.core.internal.wc.SVNErrorManager.error(SVNErrorManager.java:64)
at org.tmatesoft.svn.core.internal.wc.SVNErrorManager.error(SVNErrorManager.java:51)
at org.tmatesoft.svn.core.internal.io.dav.DAVUtil.findStartingProperties(DAVUtil.java:136)
at org.tmatesoft.svn.core.internal.io.dav.DAVUtil.getVCCPath(DAVUtil.java:172)
at org.tmatesoft.svn.core.internal.io.dav.DAVRepository.runReport(DAVRepository.java:1256)
at org.tmatesoft.svn.core.internal.io.dav.DAVRepository.update(DAVRepository.java:820)
at org.tmatesoft.svn.core.wc.SVNUpdateClient.update(SVNUpdateClient.java:564)
at org.tmatesoft.svn.core.wc.SVNUpdateClient.doUpdate(SVNUpdateClient.java:401)
at hudson.scm.SubversionSCM$CheckOutTask.invoke(SubversionSCM.java:635)
at hudson.scm.SubversionSCM$CheckOutTask.invoke(SubversionSCM.java:596)
at hudson.FilePath$FileCallableWrapper.call(FilePath.java:1899)
at hudson.remoting.UserRequest.perform(UserRequest.java:114)
at hudson.remoting.UserRequest.perform(UserRequest.java:48)
at hudson.remoting.Request$2.run(Request.java:270)
at java.util.concurrent.Executors$RunnableAdapter.call(Unknown Source)
at java.util.concurrent.FutureTask$Sync.innerRun(Unknown Source)
at java.util.concurrent.FutureTask.run(Unknown Source)
at java.util.concurrent.ThreadPoolExecutor$Worker.runTask(Unknown Source)
at java.util.concurrent.ThreadPoolExecutor$Worker.run(Unknown Source)
at hudson.remoting.Engine$1$1.run(Engine.java:58)
at java.lang.Thread.run(Unknown Source)
Caused by: java.net.SocketException: Software caused connection abort: recv failed
at java.net.SocketInputStream.socketRead0(Native Method)
at java.net.SocketInputStream.read(Unknown Source)
at com.sun.net.ssl.internal.ssl.InputRecord.readFully(Unknown Source)
at com.sun.net.ssl.internal.ssl.InputRecord.read(Unknown Source)
at com.sun.net.ssl.internal.ssl.SSLSocketImpl.readRecord(Unknown Source)
at com.sun.net.ssl.internal.ssl.SSLSocketImpl.readDataRecord(Unknown Source)
at com.sun.net.ssl.internal.ssl.AppInputStream.read(Unknown Source)
at java.io.BufferedInputStream.fill(Unknown Source)
at java.io.BufferedInputStream.read(Unknown Source)
at org.tmatesoft.svn.core.internal.io.dav.http.HTTPParser.readPlainLine(HTTPParser.java:69)
at org.tmatesoft.svn.core.internal.io.dav.http.HTTPParser.readLine(HTTPParser.java:51)
at org.tmatesoft.svn.core.internal.io.dav.http.HTTPParser.parseStatus(HTTPParser.java:39)
at org.tmatesoft.svn.core.internal.io.dav.http.HTTPConnection.readHeader(HTTPConnection.java:197)
at org.tmatesoft.svn.core.internal.io.dav.http.HTTPRequest.dispatch(HTTPRequest.java:175)
at org.tmatesoft.svn.core.internal.io.dav.http.HTTPConnection.request(HTTPConnection.java:351)
at org.tmatesoft.svn.core.internal.io.dav.http.HTTPConnection.request(HTTPConnection.java:275)
at org.tmatesoft.svn.core.internal.io.dav.http.HTTPConnection.request(HTTPConnection.java:263)
at org.tmatesoft.svn.core.internal.io.dav.DAVConnection.doPropfind(DAVConnection.java:126)
at org.tmatesoft.svn.core.internal.io.dav.DAVUtil.getProperties(DAVUtil.java:73)
at org.tmatesoft.svn.core.internal.io.dav.DAVUtil.getResourceProperties(DAVUtil.java:79)
at org.tmatesoft.svn.core.internal.io.dav.DAVUtil.getStartingProperties(DAVUtil.java:103)
at org.tmatesoft.svn.core.internal.io.dav.DAVUtil.findStartingProperties(DAVUtil.java:125)
... 18 more