You are viewing a plain text version of this content. The canonical link for it is here.
Posted to dev@kafka.apache.org by Apache Jenkins Server <je...@builds.apache.org> on 2018/05/26 04:09:45 UTC

Build failed in Jenkins: kafka-1.0-jdk7 #193

See <https://builds.apache.org/job/kafka-1.0-jdk7/193/display/redirect?page=changes>

Changes:

[junrao] KAFKA-6937: In-sync replica delayed during fetch if replica throttle is

------------------------------------------
[...truncated 216.31 KB...]
kafka.api.TransactionsTest > testSendOffsets PASSED

kafka.api.ConsumerBounceTest > testCloseDuringRebalance STARTED

kafka.api.ConsumerBounceTest > testCloseDuringRebalance PASSED

kafka.api.ConsumerBounceTest > testClose STARTED

kafka.api.ConsumerBounceTest > testClose PASSED

kafka.api.ConsumerBounceTest > testSeekAndCommitWithBrokerFailures STARTED

kafka.api.ConsumerBounceTest > testSeekAndCommitWithBrokerFailures PASSED

kafka.api.ConsumerBounceTest > testSubscribeWhenTopicUnavailable STARTED

kafka.api.ConsumerBounceTest > testSubscribeWhenTopicUnavailable PASSED

kafka.api.ConsumerBounceTest > testConsumptionWithBrokerFailures STARTED

kafka.api.ConsumerBounceTest > testConsumptionWithBrokerFailures SKIPPED

kafka.api.UserQuotaTest > testProducerConsumerOverrideUnthrottled STARTED

kafka.api.UserQuotaTest > testProducerConsumerOverrideUnthrottled PASSED

kafka.api.UserQuotaTest > testThrottledProducerConsumer STARTED

kafka.api.UserQuotaTest > testThrottledProducerConsumer PASSED

kafka.api.UserQuotaTest > testQuotaOverrideDelete STARTED

kafka.api.UserQuotaTest > testQuotaOverrideDelete PASSED

kafka.api.UserQuotaTest > testThrottledRequest STARTED

kafka.api.UserQuotaTest > testThrottledRequest PASSED

kafka.api.ApiVersionTest > testMinVersionForMessageFormat STARTED

kafka.api.ApiVersionTest > testMinVersionForMessageFormat PASSED

kafka.api.ApiVersionTest > testApply STARTED

kafka.api.ApiVersionTest > testApply PASSED

kafka.api.SaslMultiMechanismConsumerTest > testMultipleBrokerMechanisms STARTED

kafka.api.SaslMultiMechanismConsumerTest > testMultipleBrokerMechanisms PASSED

kafka.api.SaslMultiMechanismConsumerTest > testCoordinatorFailover STARTED

kafka.api.SaslMultiMechanismConsumerTest > testCoordinatorFailover PASSED

kafka.api.SaslMultiMechanismConsumerTest > testSimpleConsumption STARTED

kafka.api.SaslMultiMechanismConsumerTest > testSimpleConsumption PASSED

kafka.api.GroupCoordinatorIntegrationTest > testGroupCoordinatorPropagatesOfffsetsTopicCompressionCodec STARTED

kafka.api.GroupCoordinatorIntegrationTest > testGroupCoordinatorPropagatesOfffsetsTopicCompressionCodec PASSED

kafka.api.SslEndToEndAuthorizationTest > testNoConsumeWithoutDescribeAclViaSubscribe STARTED

kafka.api.SslEndToEndAuthorizationTest > testNoConsumeWithoutDescribeAclViaSubscribe PASSED

kafka.api.SslEndToEndAuthorizationTest > testProduceConsumeViaAssign STARTED

kafka.api.SslEndToEndAuthorizationTest > testProduceConsumeViaAssign PASSED

kafka.api.SslEndToEndAuthorizationTest > testNoConsumeWithDescribeAclViaAssign STARTED

kafka.api.SslEndToEndAuthorizationTest > testNoConsumeWithDescribeAclViaAssign PASSED

kafka.api.SslEndToEndAuthorizationTest > testNoConsumeWithDescribeAclViaSubscribe STARTED

kafka.api.SslEndToEndAuthorizationTest > testNoConsumeWithDescribeAclViaSubscribe PASSED

kafka.api.SslEndToEndAuthorizationTest > testNoConsumeWithoutDescribeAclViaAssign STARTED

kafka.api.SslEndToEndAuthorizationTest > testNoConsumeWithoutDescribeAclViaAssign PASSED

kafka.api.SslEndToEndAuthorizationTest > testNoGroupAcl STARTED

kafka.api.SslEndToEndAuthorizationTest > testNoGroupAcl PASSED

kafka.api.SslEndToEndAuthorizationTest > testNoProduceWithDescribeAcl STARTED

kafka.api.SslEndToEndAuthorizationTest > testNoProduceWithDescribeAcl PASSED

kafka.api.SslEndToEndAuthorizationTest > testProduceConsumeViaSubscribe STARTED

kafka.api.SslEndToEndAuthorizationTest > testProduceConsumeViaSubscribe PASSED

kafka.api.SslEndToEndAuthorizationTest > testNoProduceWithoutDescribeAcl STARTED

kafka.api.SslEndToEndAuthorizationTest > testNoProduceWithoutDescribeAcl PASSED

kafka.api.SaslPlainPlaintextConsumerTest > testZkAclsDisabled STARTED

kafka.api.SaslPlainPlaintextConsumerTest > testZkAclsDisabled PASSED

kafka.api.SaslPlainPlaintextConsumerTest > testCoordinatorFailover STARTED

kafka.api.SaslPlainPlaintextConsumerTest > testCoordinatorFailover PASSED

kafka.api.SaslPlainPlaintextConsumerTest > testSimpleConsumption STARTED

kafka.api.SaslPlainPlaintextConsumerTest > testSimpleConsumption PASSED

kafka.api.MetricsTest > testMetrics STARTED

kafka.api.MetricsTest > testMetrics PASSED

kafka.api.SslProducerSendTest > testSendNonCompressedMessageWithCreateTime STARTED

kafka.api.SslProducerSendTest > testSendNonCompressedMessageWithCreateTime PASSED

kafka.api.SslProducerSendTest > testClose STARTED

kafka.api.SslProducerSendTest > testClose PASSED

kafka.api.SslProducerSendTest > testFlush STARTED

kafka.api.SslProducerSendTest > testFlush PASSED

kafka.api.SslProducerSendTest > testSendToPartition STARTED

kafka.api.SslProducerSendTest > testSendToPartition PASSED

kafka.api.SslProducerSendTest > testSendOffset STARTED

kafka.api.SslProducerSendTest > testSendOffset PASSED

kafka.api.SslProducerSendTest > testSendCompressedMessageWithCreateTime STARTED

kafka.api.SslProducerSendTest > testSendCompressedMessageWithCreateTime PASSED

kafka.api.SslProducerSendTest > testCloseWithZeroTimeoutFromCallerThread STARTED

kafka.api.SslProducerSendTest > testCloseWithZeroTimeoutFromCallerThread PASSED

kafka.api.SslProducerSendTest > testCloseWithZeroTimeoutFromSenderThread STARTED

kafka.api.SslProducerSendTest > testCloseWithZeroTimeoutFromSenderThread PASSED

kafka.api.SslProducerSendTest > testSendBeforeAndAfterPartitionExpansion STARTED

kafka.api.SslProducerSendTest > testSendBeforeAndAfterPartitionExpansion PASSED

kafka.api.SaslPlainSslEndToEndAuthorizationTest > testAcls STARTED

kafka.api.SaslPlainSslEndToEndAuthorizationTest > testAcls PASSED

kafka.api.SaslPlainSslEndToEndAuthorizationTest > testTwoConsumersWithDifferentSaslCredentials STARTED

kafka.api.SaslPlainSslEndToEndAuthorizationTest > testTwoConsumersWithDifferentSaslCredentials PASSED

kafka.api.SaslPlainSslEndToEndAuthorizationTest > testNoConsumeWithoutDescribeAclViaSubscribe STARTED

kafka.api.SaslPlainSslEndToEndAuthorizationTest > testNoConsumeWithoutDescribeAclViaSubscribe PASSED

kafka.api.SaslPlainSslEndToEndAuthorizationTest > testProduceConsumeViaAssign STARTED

kafka.api.SaslPlainSslEndToEndAuthorizationTest > testProduceConsumeViaAssign PASSED

kafka.api.SaslPlainSslEndToEndAuthorizationTest > testNoConsumeWithDescribeAclViaAssign STARTED

kafka.api.SaslPlainSslEndToEndAuthorizationTest > testNoConsumeWithDescribeAclViaAssign PASSED

kafka.api.SaslPlainSslEndToEndAuthorizationTest > testNoConsumeWithDescribeAclViaSubscribe STARTED

kafka.api.SaslPlainSslEndToEndAuthorizationTest > testNoConsumeWithDescribeAclViaSubscribe PASSED

kafka.api.SaslPlainSslEndToEndAuthorizationTest > testNoConsumeWithoutDescribeAclViaAssign STARTED

kafka.api.SaslPlainSslEndToEndAuthorizationTest > testNoConsumeWithoutDescribeAclViaAssign PASSED

kafka.api.SaslPlainSslEndToEndAuthorizationTest > testNoGroupAcl STARTED

kafka.api.SaslPlainSslEndToEndAuthorizationTest > testNoGroupAcl PASSED

kafka.api.SaslPlainSslEndToEndAuthorizationTest > testNoProduceWithDescribeAcl STARTED

kafka.api.SaslPlainSslEndToEndAuthorizationTest > testNoProduceWithDescribeAcl PASSED

kafka.api.SaslPlainSslEndToEndAuthorizationTest > testProduceConsumeViaSubscribe STARTED

kafka.api.SaslPlainSslEndToEndAuthorizationTest > testProduceConsumeViaSubscribe PASSED

kafka.api.SaslPlainSslEndToEndAuthorizationTest > testNoProduceWithoutDescribeAcl STARTED

kafka.api.SaslPlainSslEndToEndAuthorizationTest > testNoProduceWithoutDescribeAcl PASSED

kafka.api.PlaintextConsumerTest > testEarliestOrLatestOffsets STARTED

kafka.api.PlaintextConsumerTest > testEarliestOrLatestOffsets PASSED

kafka.api.PlaintextConsumerTest > testPartitionsForAutoCreate STARTED

kafka.api.PlaintextConsumerTest > testPartitionsForAutoCreate PASSED

kafka.api.PlaintextConsumerTest > testShrinkingTopicSubscriptions STARTED

kafka.api.PlaintextConsumerTest > testShrinkingTopicSubscriptions PASSED

kafka.api.PlaintextConsumerTest > testMaxPollIntervalMs STARTED

kafka.api.PlaintextConsumerTest > testMaxPollIntervalMs PASSED

kafka.api.PlaintextConsumerTest > testOffsetsForTimes STARTED

kafka.api.PlaintextConsumerTest > testOffsetsForTimes PASSED

kafka.api.PlaintextConsumerTest > testSubsequentPatternSubscription STARTED

kafka.api.PlaintextConsumerTest > testSubsequentPatternSubscription PASSED

kafka.api.PlaintextConsumerTest > testConsumeMessagesWithCreateTime STARTED

kafka.api.PlaintextConsumerTest > testConsumeMessagesWithCreateTime PASSED

kafka.api.PlaintextConsumerTest > testAsyncCommit STARTED

kafka.api.PlaintextConsumerTest > testAsyncCommit PASSED

kafka.api.PlaintextConsumerTest > testLowMaxFetchSizeForRequestAndPartition STARTED
ERROR: Could not install GRADLE_3_5_HOME
java.lang.NullPointerException
ERROR: Could not install GRADLE_3_5_HOME
java.lang.NullPointerException
ERROR: Could not install GRADLE_3_5_HOME
java.lang.NullPointerException
Build timed out (after 240 minutes). Marking the build as failed.
Build was aborted
[FINDBUGS] Collecting findbugs analysis files...
Setting GRADLE_3_5_HOME=/home/jenkins/tools/gradle/3.5
[FINDBUGS] Searching for all files in <https://builds.apache.org/job/kafka-1.0-jdk7/ws/> that match the pattern **/build/reports/findbugs/*.xml
[FINDBUGS] Parsing 1 file in <https://builds.apache.org/job/kafka-1.0-jdk7/ws/>
[FINDBUGS] Successfully parsed file <https://builds.apache.org/job/kafka-1.0-jdk7/ws/core/build/reports/findbugs/main.xml> with 0 unique warnings and 0 duplicates.
Setting GRADLE_3_5_HOME=/home/jenkins/tools/gradle/3.5
Setting GRADLE_3_5_HOME=/home/jenkins/tools/gradle/3.5
<Git Blamer> Using GitBlamer to create author and commit information for all warnings.
<Git Blamer> GIT_COMMIT=274bb7af895ab5988b38794e0753a45a76f779ae, workspace=<https://builds.apache.org/job/kafka-1.0-jdk7/ws/>
[FINDBUGS] Computing warning deltas based on reference build #192
Recording test results
Setting GRADLE_3_5_HOME=/home/jenkins/tools/gradle/3.5
ERROR: Step ?Publish JUnit test result report? failed: No test report files were found. Configuration error?
Setting GRADLE_3_5_HOME=/home/jenkins/tools/gradle/3.5

Jenkins build is back to normal : kafka-1.0-jdk7 #195

Posted by Apache Jenkins Server <je...@builds.apache.org>.
See <https://builds.apache.org/job/kafka-1.0-jdk7/195/display/redirect?page=changes>


Build failed in Jenkins: kafka-1.0-jdk7 #194

Posted by Apache Jenkins Server <je...@builds.apache.org>.
See <https://builds.apache.org/job/kafka-1.0-jdk7/194/display/redirect?page=changes>

Changes:

[wangguoz] KAFKA-6925: fix parentSensors memory leak (#5108) (#5119)

------------------------------------------
[...truncated 373.13 KB...]

kafka.admin.ResetConsumerGroupOffsetTest > testResetOffsetsToEarliest STARTED

kafka.admin.ResetConsumerGroupOffsetTest > testResetOffsetsToEarliest PASSED

kafka.admin.ResetConsumerGroupOffsetTest > testResetOffsetsExportImportPlan STARTED

kafka.admin.ResetConsumerGroupOffsetTest > testResetOffsetsExportImportPlan PASSED

kafka.admin.ResetConsumerGroupOffsetTest > testResetOffsetsToSpecificOffset STARTED

kafka.admin.ResetConsumerGroupOffsetTest > testResetOffsetsToSpecificOffset PASSED

kafka.admin.ResetConsumerGroupOffsetTest > testResetOffsetsShiftPlus STARTED

kafka.admin.ResetConsumerGroupOffsetTest > testResetOffsetsShiftPlus PASSED

kafka.admin.ResetConsumerGroupOffsetTest > testResetOffsetsToLatest STARTED

kafka.admin.ResetConsumerGroupOffsetTest > testResetOffsetsToLatest PASSED

kafka.admin.ResetConsumerGroupOffsetTest > testResetOffsetsNewConsumerExistingTopic STARTED

kafka.admin.ResetConsumerGroupOffsetTest > testResetOffsetsNewConsumerExistingTopic PASSED

kafka.admin.ResetConsumerGroupOffsetTest > testResetOffsetsShiftByLowerThanEarliest STARTED

kafka.admin.ResetConsumerGroupOffsetTest > testResetOffsetsShiftByLowerThanEarliest PASSED

kafka.admin.ResetConsumerGroupOffsetTest > testResetOffsetsByDuration STARTED

kafka.admin.ResetConsumerGroupOffsetTest > testResetOffsetsByDuration PASSED

kafka.admin.ResetConsumerGroupOffsetTest > testResetOffsetsToLocalDateTime STARTED

kafka.admin.ResetConsumerGroupOffsetTest > testResetOffsetsToLocalDateTime PASSED

kafka.admin.ResetConsumerGroupOffsetTest > testResetOffsetsToEarliestOnTopicsAndPartitions STARTED

kafka.admin.ResetConsumerGroupOffsetTest > testResetOffsetsToEarliestOnTopicsAndPartitions PASSED

kafka.admin.ResetConsumerGroupOffsetTest > testResetOffsetsToEarliestOnTopics STARTED

kafka.admin.ResetConsumerGroupOffsetTest > testResetOffsetsToEarliestOnTopics PASSED

kafka.admin.ReassignPartitionsCommandArgsTest > shouldFailIfBlankArg STARTED

kafka.admin.ReassignPartitionsCommandArgsTest > shouldFailIfBlankArg PASSED

kafka.admin.ReassignPartitionsCommandArgsTest > shouldNotAllowVerifyWithoutReassignmentOption STARTED

kafka.admin.ReassignPartitionsCommandArgsTest > shouldNotAllowVerifyWithoutReassignmentOption PASSED

kafka.admin.ReassignPartitionsCommandArgsTest > shouldNotAllowGenerateWithoutBrokersOption STARTED

kafka.admin.ReassignPartitionsCommandArgsTest > shouldNotAllowGenerateWithoutBrokersOption PASSED

kafka.admin.ReassignPartitionsCommandArgsTest > shouldNotAllowTopicsOptionWithVerify STARTED

kafka.admin.ReassignPartitionsCommandArgsTest > shouldNotAllowTopicsOptionWithVerify PASSED

kafka.admin.ReassignPartitionsCommandArgsTest > shouldNotAllowGenerateWithThrottleOption STARTED

kafka.admin.ReassignPartitionsCommandArgsTest > shouldNotAllowGenerateWithThrottleOption PASSED

kafka.admin.ReassignPartitionsCommandArgsTest > shouldFailIfNoArgs STARTED

kafka.admin.ReassignPartitionsCommandArgsTest > shouldFailIfNoArgs PASSED

kafka.admin.ReassignPartitionsCommandArgsTest > shouldNotAllowExecuteWithoutReassignmentOption STARTED

kafka.admin.ReassignPartitionsCommandArgsTest > shouldNotAllowExecuteWithoutReassignmentOption PASSED

kafka.admin.ReassignPartitionsCommandArgsTest > shouldNotAllowBrokersListWithVerifyOption STARTED

kafka.admin.ReassignPartitionsCommandArgsTest > shouldNotAllowBrokersListWithVerifyOption PASSED

kafka.admin.ReassignPartitionsCommandArgsTest > shouldCorrectlyParseValidMinimumExecuteOptions STARTED

kafka.admin.ReassignPartitionsCommandArgsTest > shouldCorrectlyParseValidMinimumExecuteOptions PASSED

kafka.admin.ReassignPartitionsCommandArgsTest > shouldNotAllowGenerateWithReassignmentOption STARTED

kafka.admin.ReassignPartitionsCommandArgsTest > shouldNotAllowGenerateWithReassignmentOption PASSED

kafka.admin.ReassignPartitionsCommandArgsTest > shouldCorrectlyParseValidMinimumGenerateOptions STARTED

kafka.admin.ReassignPartitionsCommandArgsTest > shouldCorrectlyParseValidMinimumGenerateOptions PASSED

kafka.admin.ReassignPartitionsCommandArgsTest > shouldNotAllowGenerateWithoutBrokersAndTopicsOptions STARTED

kafka.admin.ReassignPartitionsCommandArgsTest > shouldNotAllowGenerateWithoutBrokersAndTopicsOptions PASSED

kafka.admin.ReassignPartitionsCommandArgsTest > shouldNotAllowThrottleWithVerifyOption STARTED

kafka.admin.ReassignPartitionsCommandArgsTest > shouldNotAllowThrottleWithVerifyOption PASSED

kafka.admin.ReassignPartitionsCommandArgsTest > shouldUseDefaultsIfEnabled STARTED

kafka.admin.ReassignPartitionsCommandArgsTest > shouldUseDefaultsIfEnabled PASSED

kafka.admin.ReassignPartitionsCommandArgsTest > shouldAllowThrottleOptionOnExecute STARTED

kafka.admin.ReassignPartitionsCommandArgsTest > shouldAllowThrottleOptionOnExecute PASSED

kafka.admin.ReassignPartitionsCommandArgsTest > shouldNotAllowExecuteWithBrokers STARTED

kafka.admin.ReassignPartitionsCommandArgsTest > shouldNotAllowExecuteWithBrokers PASSED

kafka.admin.ReassignPartitionsCommandArgsTest > shouldNotAllowExecuteWithTopicsOption STARTED

kafka.admin.ReassignPartitionsCommandArgsTest > shouldNotAllowExecuteWithTopicsOption PASSED

kafka.admin.ReassignPartitionsCommandArgsTest > shouldCorrectlyParseValidMinimumVerifyOptions STARTED

kafka.admin.ReassignPartitionsCommandArgsTest > shouldCorrectlyParseValidMinimumVerifyOptions PASSED

kafka.admin.ReassignPartitionsCommandArgsTest > shouldNotAllowGenerateWithoutTopicsOption STARTED

kafka.admin.ReassignPartitionsCommandArgsTest > shouldNotAllowGenerateWithoutTopicsOption PASSED

kafka.admin.BrokerApiVersionsCommandTest > checkBrokerApiVersionCommandOutput STARTED

kafka.admin.BrokerApiVersionsCommandTest > checkBrokerApiVersionCommandOutput PASSED

kafka.admin.TopicCommandTest > testCreateIfNotExists STARTED

kafka.admin.TopicCommandTest > testCreateIfNotExists PASSED

kafka.admin.TopicCommandTest > testCreateAlterTopicWithRackAware STARTED

kafka.admin.TopicCommandTest > testCreateAlterTopicWithRackAware PASSED

kafka.admin.TopicCommandTest > testTopicDeletion STARTED

kafka.admin.TopicCommandTest > testTopicDeletion PASSED

kafka.admin.TopicCommandTest > testConfigPreservationAcrossPartitionAlteration STARTED

kafka.admin.TopicCommandTest > testConfigPreservationAcrossPartitionAlteration PASSED

kafka.admin.TopicCommandTest > testAlterIfExists STARTED

kafka.admin.TopicCommandTest > testAlterIfExists PASSED

kafka.admin.TopicCommandTest > testDescribeAndListTopicsMarkedForDeletion STARTED

kafka.admin.TopicCommandTest > testDescribeAndListTopicsMarkedForDeletion PASSED

kafka.admin.TopicCommandTest > testDeleteIfExists STARTED

kafka.admin.TopicCommandTest > testDeleteIfExists PASSED

unit.kafka.server.KafkaApisTest > shouldRespondWithUnsupportedForMessageFormatOnHandleWriteTxnMarkersWhenMagicLowerThanRequired STARTED

unit.kafka.server.KafkaApisTest > shouldRespondWithUnsupportedForMessageFormatOnHandleWriteTxnMarkersWhenMagicLowerThanRequired PASSED

unit.kafka.server.KafkaApisTest > shouldThrowUnsupportedVersionExceptionOnHandleTxnOffsetCommitRequestWhenInterBrokerProtocolNotSupported STARTED

unit.kafka.server.KafkaApisTest > shouldThrowUnsupportedVersionExceptionOnHandleTxnOffsetCommitRequestWhenInterBrokerProtocolNotSupported PASSED

unit.kafka.server.KafkaApisTest > shouldThrowUnsupportedVersionExceptionOnHandleAddPartitionsToTxnRequestWhenInterBrokerProtocolNotSupported STARTED

unit.kafka.server.KafkaApisTest > shouldThrowUnsupportedVersionExceptionOnHandleAddPartitionsToTxnRequestWhenInterBrokerProtocolNotSupported PASSED

unit.kafka.server.KafkaApisTest > testReadUncommittedConsumerListOffsetLatest STARTED

unit.kafka.server.KafkaApisTest > testReadUncommittedConsumerListOffsetLatest PASSED

unit.kafka.server.KafkaApisTest > shouldAppendToLogOnWriteTxnMarkersWhenCorrectMagicVersion STARTED

unit.kafka.server.KafkaApisTest > shouldAppendToLogOnWriteTxnMarkersWhenCorrectMagicVersion PASSED

unit.kafka.server.KafkaApisTest > shouldThrowUnsupportedVersionExceptionOnHandleWriteTxnMarkersRequestWhenInterBrokerProtocolNotSupported STARTED

unit.kafka.server.KafkaApisTest > shouldThrowUnsupportedVersionExceptionOnHandleWriteTxnMarkersRequestWhenInterBrokerProtocolNotSupported PASSED

unit.kafka.server.KafkaApisTest > shouldRespondWithUnknownTopicWhenPartitionIsNotHosted STARTED

unit.kafka.server.KafkaApisTest > shouldRespondWithUnknownTopicWhenPartitionIsNotHosted PASSED

unit.kafka.server.KafkaApisTest > testReadCommittedConsumerListOffsetEarliestOffsetEqualsLastStableOffset STARTED

unit.kafka.server.KafkaApisTest > testReadCommittedConsumerListOffsetEarliestOffsetEqualsLastStableOffset PASSED

unit.kafka.server.KafkaApisTest > testReadCommittedConsumerListOffsetLatest STARTED

unit.kafka.server.KafkaApisTest > testReadCommittedConsumerListOffsetLatest PASSED

unit.kafka.server.KafkaApisTest > testReadCommittedConsumerListOffsetLimitedAtLastStableOffset STARTED

unit.kafka.server.KafkaApisTest > testReadCommittedConsumerListOffsetLimitedAtLastStableOffset PASSED

unit.kafka.server.KafkaApisTest > testReadUncommittedConsumerListOffsetEarliestOffsetEqualsHighWatermark STARTED

unit.kafka.server.KafkaApisTest > testReadUncommittedConsumerListOffsetEarliestOffsetEqualsHighWatermark PASSED

unit.kafka.server.KafkaApisTest > testReadUncommittedConsumerListOffsetLimitedAtHighWatermark STARTED

unit.kafka.server.KafkaApisTest > testReadUncommittedConsumerListOffsetLimitedAtHighWatermark PASSED

unit.kafka.server.KafkaApisTest > shouldThrowUnsupportedVersionExceptionOnHandleAddOffsetToTxnRequestWhenInterBrokerProtocolNotSupported STARTED

unit.kafka.server.KafkaApisTest > shouldThrowUnsupportedVersionExceptionOnHandleAddOffsetToTxnRequestWhenInterBrokerProtocolNotSupported PASSED

unit.kafka.server.KafkaApisTest > shouldRespondWithUnsupportedMessageFormatForBadPartitionAndNoErrorsForGoodPartition STARTED

unit.kafka.server.KafkaApisTest > shouldRespondWithUnsupportedMessageFormatForBadPartitionAndNoErrorsForGoodPartition PASSED

unit.kafka.server.KafkaApisTest > shouldThrowUnsupportedVersionExceptionOnHandleEndTxnRequestWhenInterBrokerProtocolNotSupported STARTED

unit.kafka.server.KafkaApisTest > shouldThrowUnsupportedVersionExceptionOnHandleEndTxnRequestWhenInterBrokerProtocolNotSupported PASSED

unit.kafka.server.KafkaApisTest > shouldRespondWithUnknownTopicOrPartitionForBadPartitionAndNoErrorsForGoodPartition STARTED

unit.kafka.server.KafkaApisTest > shouldRespondWithUnknownTopicOrPartitionForBadPartitionAndNoErrorsForGoodPartition PASSED

1644 tests completed, 1 failed, 4 skipped
:kafka-1.0-jdk7:core:test FAILED
:test_core_2_11 FAILED

FAILURE: Build failed with an exception.

* What went wrong:
Execution failed for task ':kafka-1.0-jdk7:core:test'.
> There were failing tests. See the report at: file://<https://builds.apache.org/job/kafka-1.0-jdk7/ws/core/build/reports/tests/test/index.html>

* Try:
Run with --stacktrace option to get the stack trace. Run with --info or --debug option to get more log output.

* Get more help at https://help.gradle.org

BUILD FAILED in 54m 54s
20 actionable tasks: 2 executed, 18 up-to-date
Build step 'Execute shell' marked build as failure
[FINDBUGS] Collecting findbugs analysis files...
Setting GRADLE_3_5_HOME=/home/jenkins/tools/gradle/3.5
[FINDBUGS] Searching for all files in <https://builds.apache.org/job/kafka-1.0-jdk7/ws/> that match the pattern **/build/reports/findbugs/*.xml
[FINDBUGS] Parsing 1 file in <https://builds.apache.org/job/kafka-1.0-jdk7/ws/>
[FINDBUGS] Successfully parsed file <https://builds.apache.org/job/kafka-1.0-jdk7/ws/core/build/reports/findbugs/main.xml> with 0 unique warnings and 0 duplicates.
Setting GRADLE_3_5_HOME=/home/jenkins/tools/gradle/3.5
Setting GRADLE_3_5_HOME=/home/jenkins/tools/gradle/3.5
<Git Blamer> Using GitBlamer to create author and commit information for all warnings.
<Git Blamer> GIT_COMMIT=fb87ba31fe018b11ba2c939bc42ea1a2795eec99, workspace=<https://builds.apache.org/job/kafka-1.0-jdk7/ws/>
[FINDBUGS] Computing warning deltas based on reference build #192
Recording test results
Setting GRADLE_3_5_HOME=/home/jenkins/tools/gradle/3.5
Setting GRADLE_3_5_HOME=/home/jenkins/tools/gradle/3.5
Not sending mail to unregistered user wangguoz@gmail.com