You are viewing a plain text version of this content. The canonical link for it is here.
Posted to commits@beam.apache.org by Apache Jenkins Server <je...@builds.apache.org> on 2017/05/19 00:12:16 UTC
Build failed in Jenkins: beam_PostCommit_Java_MavenInstall #3849
See <https://builds.apache.org/job/beam_PostCommit_Java_MavenInstall/3849/display/redirect>
------------------------------------------
[...truncated 623.59 KB...]
2017-05-19T00:11:49.283 [INFO] Downloading: https://repo.maven.apache.org/maven2/org/apache/lucene/lucene-queryparser/5.5.2/lucene-queryparser-5.5.2.jar
2017-05-19T00:11:49.373 [INFO] Downloaded: https://repo.maven.apache.org/maven2/org/apache/lucene/lucene-highlighter/5.5.2/lucene-highlighter-5.5.2.jar (142 KB at 216.6 KB/sec)
2017-05-19T00:11:49.373 [INFO] Downloading: https://repo.maven.apache.org/maven2/org/apache/lucene/lucene-sandbox/5.5.2/lucene-sandbox-5.5.2.jar
2017-05-19T00:11:49.469 [INFO] Downloaded: https://repo.maven.apache.org/maven2/org/apache/lucene/lucene-queryparser/5.5.2/lucene-queryparser-5.5.2.jar (393 KB at 524.5 KB/sec)
2017-05-19T00:11:49.469 [INFO] Downloading: https://repo.maven.apache.org/maven2/org/apache/lucene/lucene-suggest/5.5.2/lucene-suggest-5.5.2.jar
2017-05-19T00:11:49.494 [INFO] Downloaded: https://repo.maven.apache.org/maven2/org/apache/lucene/lucene-sandbox/5.5.2/lucene-sandbox-5.5.2.jar (227 KB at 293.0 KB/sec)
2017-05-19T00:11:49.494 [INFO] Downloading: https://repo.maven.apache.org/maven2/org/apache/lucene/lucene-misc/5.5.2/lucene-misc-5.5.2.jar
2017-05-19T00:11:49.574 [INFO] Downloaded: https://repo.maven.apache.org/maven2/org/apache/lucene/lucene-suggest/5.5.2/lucene-suggest-5.5.2.jar (241 KB at 281.5 KB/sec)
2017-05-19T00:11:49.574 [INFO] Downloading: https://repo.maven.apache.org/maven2/org/apache/lucene/lucene-join/5.5.2/lucene-join-5.5.2.jar
2017-05-19T00:11:49.575 [INFO] Downloaded: https://repo.maven.apache.org/maven2/org/apache/lucene/lucene-misc/5.5.2/lucene-misc-5.5.2.jar (169 KB at 196.8 KB/sec)
2017-05-19T00:11:49.575 [INFO] Downloading: https://repo.maven.apache.org/maven2/org/apache/lucene/lucene-grouping/5.5.2/lucene-grouping-5.5.2.jar
2017-05-19T00:11:49.603 [INFO] Downloading: https://repo.maven.apache.org/maven2/org/apache/lucene/lucene-spatial/5.5.2/lucene-spatial-5.5.2.jar
2017-05-19T00:11:49.627 [INFO] Downloaded: https://repo.maven.apache.org/maven2/org/apache/lucene/lucene-grouping/5.5.2/lucene-grouping-5.5.2.jar (105 KB at 115.4 KB/sec)
2017-05-19T00:11:49.627 [INFO] Downloading: https://repo.maven.apache.org/maven2/org/apache/lucene/lucene-spatial3d/5.5.2/lucene-spatial3d-5.5.2.jar
2017-05-19T00:11:49.628 [INFO] Downloaded: https://repo.maven.apache.org/maven2/org/apache/lucene/lucene-analyzers-common/5.5.2/lucene-analyzers-common-5.5.2.jar (1540 KB at 1695.6 KB/sec)
2017-05-19T00:11:49.628 [INFO] Downloading: https://repo.maven.apache.org/maven2/com/spatial4j/spatial4j/0.5/spatial4j-0.5.jar
2017-05-19T00:11:49.643 [INFO] Downloaded: https://repo.maven.apache.org/maven2/org/apache/lucene/lucene-join/5.5.2/lucene-join-5.5.2.jar (133 KB at 144.1 KB/sec)
2017-05-19T00:11:49.643 [INFO] Downloading: https://repo.maven.apache.org/maven2/org/elasticsearch/securesm/1.0/securesm-1.0.jar
2017-05-19T00:11:49.657 [INFO] Downloaded: https://repo.maven.apache.org/maven2/org/apache/lucene/lucene-core/5.5.2/lucene-core-5.5.2.jar (2313 KB at 2468.3 KB/sec)
2017-05-19T00:11:49.657 [INFO] Downloading: https://repo.maven.apache.org/maven2/com/carrotsearch/hppc/0.7.1/hppc-0.7.1.jar
2017-05-19T00:11:49.675 [INFO] Downloaded: https://repo.maven.apache.org/maven2/com/spatial4j/spatial4j/0.5/spatial4j-0.5.jar (146 KB at 151.9 KB/sec)
2017-05-19T00:11:49.675 [INFO] Downloading: https://repo.maven.apache.org/maven2/org/joda/joda-convert/1.2/joda-convert-1.2.jar
2017-05-19T00:11:49.681 [INFO] Downloaded: https://repo.maven.apache.org/maven2/org/elasticsearch/securesm/1.0/securesm-1.0.jar (7 KB at 7.1 KB/sec)
2017-05-19T00:11:49.681 [INFO] Downloading: https://repo.maven.apache.org/maven2/com/fasterxml/jackson/dataformat/jackson-dataformat-smile/2.8.1/jackson-dataformat-smile-2.8.1.jar
2017-05-19T00:11:49.685 [INFO] Downloaded: https://repo.maven.apache.org/maven2/org/apache/lucene/lucene-spatial3d/5.5.2/lucene-spatial3d-5.5.2.jar (193 KB at 199.7 KB/sec)
2017-05-19T00:11:49.685 [INFO] Downloading: https://repo.maven.apache.org/maven2/com/fasterxml/jackson/dataformat/jackson-dataformat-cbor/2.8.1/jackson-dataformat-cbor-2.8.1.jar
2017-05-19T00:11:49.711 [INFO] Downloaded: https://repo.maven.apache.org/maven2/org/joda/joda-convert/1.2/joda-convert-1.2.jar (38 KB at 37.9 KB/sec)
2017-05-19T00:11:49.711 [INFO] Downloading: https://repo.maven.apache.org/maven2/org/yaml/snakeyaml/1.15/snakeyaml-1.15.jar
2017-05-19T00:11:49.718 [INFO] Downloaded: https://repo.maven.apache.org/maven2/org/apache/lucene/lucene-spatial/5.5.2/lucene-spatial-5.5.2.jar (256 KB at 255.6 KB/sec)
2017-05-19T00:11:49.718 [INFO] Downloading: https://repo.maven.apache.org/maven2/io/netty/netty/3.10.6.Final/netty-3.10.6.Final.jar
2017-05-19T00:11:49.720 [INFO] Downloaded: https://repo.maven.apache.org/maven2/com/fasterxml/jackson/dataformat/jackson-dataformat-smile/2.8.1/jackson-dataformat-smile-2.8.1.jar (72 KB at 71.2 KB/sec)
2017-05-19T00:11:49.720 [INFO] Downloading: https://repo.maven.apache.org/maven2/com/ning/compress-lzf/1.0.2/compress-lzf-1.0.2.jar
2017-05-19T00:11:49.721 [INFO] Downloaded: https://repo.maven.apache.org/maven2/com/fasterxml/jackson/dataformat/jackson-dataformat-cbor/2.8.1/jackson-dataformat-cbor-2.8.1.jar (50 KB at 49.0 KB/sec)
2017-05-19T00:11:49.721 [INFO] Downloading: https://repo.maven.apache.org/maven2/com/tdunning/t-digest/3.0/t-digest-3.0.jar
2017-05-19T00:11:49.776 [INFO] Downloaded: https://repo.maven.apache.org/maven2/com/tdunning/t-digest/3.0/t-digest-3.0.jar (49 KB at 46.0 KB/sec)
2017-05-19T00:11:49.776 [INFO] Downloading: https://repo.maven.apache.org/maven2/org/hdrhistogram/HdrHistogram/2.1.6/HdrHistogram-2.1.6.jar
2017-05-19T00:11:49.783 [INFO] Downloaded: https://repo.maven.apache.org/maven2/org/yaml/snakeyaml/1.15/snakeyaml-1.15.jar (263 KB at 247.4 KB/sec)
2017-05-19T00:11:49.783 [INFO] Downloading: https://repo.maven.apache.org/maven2/com/twitter/jsr166e/1.1.0/jsr166e-1.1.0.jar
2017-05-19T00:11:49.784 [INFO] Downloaded: https://repo.maven.apache.org/maven2/com/ning/compress-lzf/1.0.2/compress-lzf-1.0.2.jar (78 KB at 73.2 KB/sec)
2017-05-19T00:11:49.784 [INFO] Downloading: https://repo.maven.apache.org/maven2/commons-io/commons-io/1.3.2/commons-io-1.3.2.jar
2017-05-19T00:11:49.836 [INFO] Downloaded: https://repo.maven.apache.org/maven2/com/twitter/jsr166e/1.1.0/jsr166e-1.1.0.jar (61 KB at 54.5 KB/sec)
2017-05-19T00:11:49.836 [INFO] Downloaded: https://repo.maven.apache.org/maven2/org/hdrhistogram/HdrHistogram/2.1.6/HdrHistogram-2.1.6.jar (108 KB at 96.0 KB/sec)
2017-05-19T00:11:49.853 [INFO] Downloaded: https://repo.maven.apache.org/maven2/commons-io/commons-io/1.3.2/commons-io-1.3.2.jar (86 KB at 75.7 KB/sec)
2017-05-19T00:11:49.889 [INFO] Downloaded: https://repo.maven.apache.org/maven2/com/carrotsearch/hppc/0.7.1/hppc-0.7.1.jar (1114 KB at 952.6 KB/sec)
2017-05-19T00:11:49.942 [INFO] Downloaded: https://repo.maven.apache.org/maven2/io/netty/netty/3.10.6.Final/netty-3.10.6.Final.jar (1263 KB at 1033.1 KB/sec)
[JENKINS] Archiving disabled
2017-05-19T00:11:50.510 [INFO]
2017-05-19T00:11:50.510 [INFO] ------------------------------------------------------------------------
2017-05-19T00:11:50.510 [INFO] Skipping Apache Beam :: Parent
2017-05-19T00:11:50.510 [INFO] This project has been banned from the build due to previous failures.
2017-05-19T00:11:50.510 [INFO] ------------------------------------------------------------------------
[JENKINS] Archiving disabled
[JENKINS] Archiving disabled
[JENKINS] Archiving disabled
[JENKINS] Archiving disabled
[JENKINS] Archiving disabled
[JENKINS] Archiving disabled
[JENKINS] Archiving disabled
[JENKINS] Archiving disabled
[JENKINS] Archiving disabled
[JENKINS] Archiving disabled
[JENKINS] Archiving disabled
[JENKINS] Archiving disabled
[JENKINS] Archiving disabled
[JENKINS] Archiving disabled
[JENKINS] Archiving disabled
[JENKINS] Archiving disabled
[JENKINS] Archiving disabled
[JENKINS] Archiving disabled
[JENKINS] Archiving disabled
[JENKINS] Archiving disabled
[JENKINS] Archiving disabled
[JENKINS] Archiving disabled
[JENKINS] Archiving disabled
[JENKINS] Archiving disabled
[JENKINS] Archiving disabled
[JENKINS] Archiving disabled
[JENKINS] Archiving disabled
[JENKINS] Archiving disabled
[JENKINS] Archiving disabled
[JENKINS] Archiving disabled
[JENKINS] Archiving disabled
[JENKINS] Archiving disabled
[JENKINS] Archiving disabled
[JENKINS] Archiving disabled
[JENKINS] Archiving disabled
[JENKINS] Archiving disabled
[JENKINS] Archiving disabled
[JENKINS] Archiving disabled
[JENKINS] Archiving disabled
[JENKINS] Archiving disabled
[JENKINS] Archiving disabled
[JENKINS] Archiving disabled
[JENKINS] Archiving disabled
[JENKINS] Archiving disabled
[JENKINS] Archiving disabled
[JENKINS] Archiving disabled
2017-05-19T00:12:03.871 [INFO] ------------------------------------------------------------------------
2017-05-19T00:12:03.871 [INFO] Reactor Summary:
2017-05-19T00:12:03.871 [INFO]
2017-05-19T00:12:03.871 [INFO] Apache Beam :: Parent .............................. SUCCESS [ 24.448 s]
2017-05-19T00:12:03.871 [INFO] Apache Beam :: SDKs :: Java :: Build Tools ......... SUCCESS [ 12.193 s]
2017-05-19T00:12:03.871 [INFO] Apache Beam :: SDKs ................................ SUCCESS [ 7.049 s]
2017-05-19T00:12:03.871 [INFO] Apache Beam :: SDKs :: Common ...................... SUCCESS [ 1.794 s]
2017-05-19T00:12:03.871 [INFO] Apache Beam :: SDKs :: Common :: Fn API ............ SUCCESS [ 19.717 s]
2017-05-19T00:12:03.871 [INFO] Apache Beam :: SDKs :: Common :: Runner API ........ SUCCESS [ 16.063 s]
2017-05-19T00:12:03.871 [INFO] Apache Beam :: SDKs :: Java ........................ SUCCESS [ 2.383 s]
2017-05-19T00:12:03.871 [INFO] Apache Beam :: SDKs :: Java :: Core ................ SUCCESS [03:17 min]
2017-05-19T00:12:03.872 [INFO] Apache Beam :: SDKs :: Java :: IO .................. SUCCESS [ 2.535 s]
2017-05-19T00:12:03.872 [INFO] Apache Beam :: SDKs :: Java :: IO :: Common ........ SUCCESS [ 8.640 s]
2017-05-19T00:12:03.872 [INFO] Apache Beam :: Runners ............................. SUCCESS [ 2.114 s]
2017-05-19T00:12:03.872 [INFO] Apache Beam :: Runners :: Core Construction Java ... SUCCESS [ 29.893 s]
2017-05-19T00:12:03.872 [INFO] Apache Beam :: Runners :: Core Java ................ SUCCESS [01:02 min]
2017-05-19T00:12:03.872 [INFO] Apache Beam :: Runners :: Direct Java .............. SUCCESS [03:40 min]
2017-05-19T00:12:03.872 [INFO] Apache Beam :: SDKs :: Java :: IO :: Elasticsearch . FAILURE [ 3.671 s]
2017-05-19T00:12:03.872 [INFO] Apache Beam :: SDKs :: Java :: Extensions .......... SKIPPED
2017-05-19T00:12:03.872 [INFO] Apache Beam :: SDKs :: Java :: Extensions :: Google Cloud Platform Core SKIPPED
2017-05-19T00:12:03.872 [INFO] Apache Beam :: SDKs :: Java :: Extensions :: Protobuf SKIPPED
2017-05-19T00:12:03.872 [INFO] Apache Beam :: SDKs :: Java :: IO :: Google Cloud Platform SKIPPED
2017-05-19T00:12:03.872 [INFO] Apache Beam :: SDKs :: Java :: IO :: Hadoop Common . SKIPPED
2017-05-19T00:12:03.872 [INFO] Apache Beam :: SDKs :: Java :: IO :: Hadoop File System SKIPPED
2017-05-19T00:12:03.872 [INFO] Apache Beam :: SDKs :: Java :: IO :: Hadoop ........ SKIPPED
2017-05-19T00:12:03.872 [INFO] Apache Beam :: SDKs :: Java :: IO :: Hadoop :: input-format SKIPPED
2017-05-19T00:12:03.872 [INFO] Apache Beam :: Runners :: Google Cloud Dataflow .... SKIPPED
2017-05-19T00:12:03.872 [INFO] Apache Beam :: SDKs :: Java :: IO :: Hadoop :: jdk1.8-tests SKIPPED
2017-05-19T00:12:03.872 [INFO] Apache Beam :: SDKs :: Java :: IO :: HBase ......... SKIPPED
2017-05-19T00:12:03.872 [INFO] Apache Beam :: SDKs :: Java :: IO :: JDBC .......... SKIPPED
2017-05-19T00:12:03.872 [INFO] Apache Beam :: SDKs :: Java :: IO :: JMS ........... SKIPPED
2017-05-19T00:12:03.872 [INFO] Apache Beam :: SDKs :: Java :: IO :: Kafka ......... SKIPPED
2017-05-19T00:12:03.872 [INFO] Apache Beam :: SDKs :: Java :: IO :: Kinesis ....... SKIPPED
2017-05-19T00:12:03.872 [INFO] Apache Beam :: SDKs :: Java :: IO :: MongoDB ....... SKIPPED
2017-05-19T00:12:03.872 [INFO] Apache Beam :: SDKs :: Java :: IO :: MQTT .......... SKIPPED
2017-05-19T00:12:03.872 [INFO] Apache Beam :: SDKs :: Java :: IO :: XML ........... SKIPPED
2017-05-19T00:12:03.872 [INFO] Apache Beam :: SDKs :: Java :: Maven Archetypes .... SKIPPED
2017-05-19T00:12:03.872 [INFO] Apache Beam :: SDKs :: Java :: Maven Archetypes :: Starter SKIPPED
2017-05-19T00:12:03.872 [INFO] Apache Beam :: Examples ............................ SKIPPED
2017-05-19T00:12:03.872 [INFO] Apache Beam :: Examples :: Java .................... SKIPPED
2017-05-19T00:12:03.872 [INFO] Apache Beam :: SDKs :: Java :: Maven Archetypes :: Examples SKIPPED
2017-05-19T00:12:03.872 [INFO] Apache Beam :: Examples :: Java 8 .................. SKIPPED
2017-05-19T00:12:03.872 [INFO] Apache Beam :: SDKs :: Java :: Maven Archetypes :: Examples - Java 8 SKIPPED
2017-05-19T00:12:03.872 [INFO] Apache Beam :: SDKs :: Java :: Extensions :: Jackson SKIPPED
2017-05-19T00:12:03.872 [INFO] Apache Beam :: SDKs :: Java :: Extensions :: Join library SKIPPED
2017-05-19T00:12:03.872 [INFO] Apache Beam :: SDKs :: Java :: Extensions :: Sorter SKIPPED
2017-05-19T00:12:03.872 [INFO] Apache Beam :: SDKs :: Java :: Harness ............. SKIPPED
2017-05-19T00:12:03.872 [INFO] Apache Beam :: SDKs :: Java :: Java 8 Tests ........ SKIPPED
2017-05-19T00:12:03.872 [INFO] Apache Beam :: SDKs :: Python ...................... SKIPPED
2017-05-19T00:12:03.872 [INFO] Apache Beam :: Runners :: Flink .................... SKIPPED
2017-05-19T00:12:03.872 [INFO] Apache Beam :: Runners :: Spark .................... SKIPPED
2017-05-19T00:12:03.872 [INFO] Apache Beam :: Runners :: Apex ..................... SKIPPED
2017-05-19T00:12:03.872 [INFO] Apache Beam :: SDKs :: Java :: Aggregated Javadoc .. SKIPPED
2017-05-19T00:12:03.872 [INFO] ------------------------------------------------------------------------
2017-05-19T00:12:03.872 [INFO] BUILD FAILURE
2017-05-19T00:12:03.872 [INFO] ------------------------------------------------------------------------
2017-05-19T00:12:03.872 [INFO] Total time: 10:52 min
2017-05-19T00:12:03.873 [INFO] Finished at: 2017-05-19T00:12:03+00:00
2017-05-19T00:12:04.656 [INFO] Final Memory: 134M/1504M
2017-05-19T00:12:04.656 [INFO] ------------------------------------------------------------------------
2017-05-19T00:12:04.662 [ERROR] Failed to execute goal on project beam-sdks-java-io-elasticsearch: Could not resolve dependencies for project org.apache.beam:beam-sdks-java-io-elasticsearch:jar:2.1.0-SNAPSHOT: Could not transfer artifact org.elasticsearch:elasticsearch:jar:2.4.1 from/to central (https://repo.maven.apache.org/maven2): GET request of: org/elasticsearch/elasticsearch/2.4.1/elasticsearch-2.4.1.jar from central failed: Connection reset -> [Help 1]
org.apache.maven.lifecycle.LifecycleExecutionException: Failed to execute goal on project beam-sdks-java-io-elasticsearch: Could not resolve dependencies for project org.apache.beam:beam-sdks-java-io-elasticsearch:jar:2.1.0-SNAPSHOT: Could not transfer artifact org.elasticsearch:elasticsearch:jar:2.4.1 from/to central (https://repo.maven.apache.org/maven2): GET request of: org/elasticsearch/elasticsearch/2.4.1/elasticsearch-2.4.1.jar from central failed
at org.apache.maven.lifecycle.internal.LifecycleDependencyResolver.getDependencies(LifecycleDependencyResolver.java:221)
at org.apache.maven.lifecycle.internal.LifecycleDependencyResolver.resolveProjectDependencies(LifecycleDependencyResolver.java:127)
at org.apache.maven.lifecycle.internal.MojoExecutor.ensureDependenciesAreResolved(MojoExecutor.java:257)
at org.apache.maven.lifecycle.internal.MojoExecutor.execute(MojoExecutor.java:200)
at org.apache.maven.lifecycle.internal.MojoExecutor.execute(MojoExecutor.java:153)
at org.apache.maven.lifecycle.internal.MojoExecutor.execute(MojoExecutor.java:145)
at org.apache.maven.lifecycle.internal.LifecycleModuleBuilder.buildProject(LifecycleModuleBuilder.java:116)
at org.apache.maven.lifecycle.internal.LifecycleModuleBuilder.buildProject(LifecycleModuleBuilder.java:80)
at org.apache.maven.lifecycle.internal.builder.singlethreaded.SingleThreadedBuilder.build(SingleThreadedBuilder.java:51)
at org.apache.maven.lifecycle.internal.LifecycleStarter.execute(LifecycleStarter.java:128)
at org.apache.maven.DefaultMaven.doExecute(DefaultMaven.java:307)
at org.apache.maven.DefaultMaven.doExecute(DefaultMaven.java:193)
at org.apache.maven.DefaultMaven.execute(DefaultMaven.java:106)
at org.jvnet.hudson.maven3.launcher.Maven33Launcher.main(Maven33Launcher.java:129)
at sun.reflect.NativeMethodAccessorImpl.invoke0(Native Method)
at sun.reflect.NativeMethodAccessorImpl.invoke(NativeMethodAccessorImpl.java:62)
at sun.reflect.DelegatingMethodAccessorImpl.invoke(DelegatingMethodAccessorImpl.java:43)
at java.lang.reflect.Method.invoke(Method.java:498)
at org.codehaus.plexus.classworlds.launcher.Launcher.launchStandard(Launcher.java:330)
at org.codehaus.plexus.classworlds.launcher.Launcher.launch(Launcher.java:238)
at jenkins.maven3.agent.Maven33Main.launch(Maven33Main.java:176)
at sun.reflect.NativeMethodAccessorImpl.invoke0(Native Method)
at sun.reflect.NativeMethodAccessorImpl.invoke(NativeMethodAccessorImpl.java:62)
at sun.reflect.DelegatingMethodAccessorImpl.invoke(DelegatingMethodAccessorImpl.java:43)
at java.lang.reflect.Method.invoke(Method.java:498)
at hudson.maven.Maven3Builder.call(Maven3Builder.java:139)
at hudson.maven.Maven3Builder.call(Maven3Builder.java:70)
at hudson.remoting.UserRequest.perform(UserRequest.java:153)
at hudson.remoting.UserRequest.perform(UserRequest.java:50)
at hudson.remoting.Request$2.run(Request.java:336)
at hudson.remoting.InterceptingExecutorService$1.call(InterceptingExecutorService.java:68)
at java.util.concurrent.FutureTask.run(FutureTask.java:266)
at java.util.concurrent.ThreadPoolExecutor.runWorker(ThreadPoolExecutor.java:1142)
at java.util.concurrent.ThreadPoolExecutor$Worker.run(ThreadPoolExecutor.java:617)
at java.lang.Thread.run(Thread.java:745)
Caused by: org.apache.maven.project.DependencyResolutionException: Could not resolve dependencies for project org.apache.beam:beam-sdks-java-io-elasticsearch:jar:2.1.0-SNAPSHOT: Could not transfer artifact org.elasticsearch:elasticsearch:jar:2.4.1 from/to central (https://repo.maven.apache.org/maven2): GET request of: org/elasticsearch/elasticsearch/2.4.1/elasticsearch-2.4.1.jar from central failed
at org.apache.maven.project.DefaultProjectDependenciesResolver.resolve(DefaultProjectDependenciesResolver.java:211)
at org.apache.maven.lifecycle.internal.LifecycleDependencyResolver.getDependencies(LifecycleDependencyResolver.java:195)
... 34 more
Caused by: org.eclipse.aether.resolution.DependencyResolutionException: Could not transfer artifact org.elasticsearch:elasticsearch:jar:2.4.1 from/to central (https://repo.maven.apache.org/maven2): GET request of: org/elasticsearch/elasticsearch/2.4.1/elasticsearch-2.4.1.jar from central failed
at org.eclipse.aether.internal.impl.DefaultRepositorySystem.resolveDependencies(DefaultRepositorySystem.java:384)
at org.apache.maven.project.DefaultProjectDependenciesResolver.resolve(DefaultProjectDependenciesResolver.java:205)
... 35 more
Caused by: org.eclipse.aether.resolution.ArtifactResolutionException: Could not transfer artifact org.elasticsearch:elasticsearch:jar:2.4.1 from/to central (https://repo.maven.apache.org/maven2): GET request of: org/elasticsearch/elasticsearch/2.4.1/elasticsearch-2.4.1.jar from central failed
at org.eclipse.aether.internal.impl.DefaultArtifactResolver.resolve(DefaultArtifactResolver.java:444)
at org.eclipse.aether.internal.impl.DefaultArtifactResolver.resolveArtifacts(DefaultArtifactResolver.java:246)
at org.eclipse.aether.internal.impl.DefaultRepositorySystem.resolveDependencies(DefaultRepositorySystem.java:367)
... 36 more
Caused by: org.eclipse.aether.transfer.ArtifactTransferException: Could not transfer artifact org.elasticsearch:elasticsearch:jar:2.4.1 from/to central (https://repo.maven.apache.org/maven2): GET request of: org/elasticsearch/elasticsearch/2.4.1/elasticsearch-2.4.1.jar from central failed
at org.eclipse.aether.connector.basic.ArtifactTransportListener.transferFailed(ArtifactTransportListener.java:43)
at org.eclipse.aether.connector.basic.BasicRepositoryConnector$TaskRunner.run(BasicRepositoryConnector.java:355)
at org.eclipse.aether.util.concurrency.RunnableErrorForwarder$1.run(RunnableErrorForwarder.java:67)
... 3 more
Caused by: org.apache.maven.wagon.TransferFailedException: GET request of: org/elasticsearch/elasticsearch/2.4.1/elasticsearch-2.4.1.jar from central failed
at org.apache.maven.wagon.AbstractWagon.getTransfer(AbstractWagon.java:363)
at org.apache.maven.wagon.AbstractWagon.getTransfer(AbstractWagon.java:316)
at org.apache.maven.wagon.AbstractWagon.getTransfer(AbstractWagon.java:285)
at org.apache.maven.wagon.StreamWagon.getIfNewer(StreamWagon.java:97)
at org.apache.maven.wagon.StreamWagon.get(StreamWagon.java:61)
at org.eclipse.aether.transport.wagon.WagonTransporter$GetTaskRunner.run(WagonTransporter.java:560)
at org.eclipse.aether.transport.wagon.WagonTransporter.execute(WagonTransporter.java:427)
at org.eclipse.aether.transport.wagon.WagonTransporter.get(WagonTransporter.java:404)
at org.eclipse.aether.connector.basic.BasicRepositoryConnector$GetTaskRunner.runTask(BasicRepositoryConnector.java:447)
at org.eclipse.aether.connector.basic.BasicRepositoryConnector$TaskRunner.run(BasicRepositoryConnector.java:350)
... 4 more
Caused by: java.net.SocketException: Connection reset
at java.net.SocketInputStream.read(SocketInputStream.java:210)
at java.net.SocketInputStream.read(SocketInputStream.java:141)
at sun.security.ssl.InputRecord.readFully(InputRecord.java:465)
at sun.security.ssl.InputRecord.readV3Record(InputRecord.java:593)
at sun.security.ssl.InputRecord.read(InputRecord.java:532)
at sun.security.ssl.SSLSocketImpl.readRecord(SSLSocketImpl.java:973)
at sun.security.ssl.SSLSocketImpl.readDataRecord(SSLSocketImpl.java:930)
at sun.security.ssl.AppInputStream.read(AppInputStream.java:105)
at org.apache.maven.wagon.providers.http.httpclient.impl.io.SessionInputBufferImpl.streamRead(SessionInputBufferImpl.java:136)
at org.apache.maven.wagon.providers.http.httpclient.impl.io.SessionInputBufferImpl.read(SessionInputBufferImpl.java:195)
at org.apache.maven.wagon.providers.http.httpclient.impl.io.ContentLengthInputStream.read(ContentLengthInputStream.java:178)
at org.apache.maven.wagon.providers.http.httpclient.conn.EofSensorInputStream.read(EofSensorInputStream.java:137)
at org.apache.maven.wagon.AbstractWagon.transfer(AbstractWagon.java:531)
at org.apache.maven.wagon.AbstractWagon.getTransfer(AbstractWagon.java:353)
... 13 more
2017-05-19T00:12:04.671 [ERROR]
2017-05-19T00:12:04.671 [ERROR] Re-run Maven using the -X switch to enable full debug logging.
2017-05-19T00:12:04.672 [ERROR]
2017-05-19T00:12:04.672 [ERROR] For more information about the errors and possible solutions, please read the following articles:
2017-05-19T00:12:04.672 [ERROR] [Help 1] http://cwiki.apache.org/confluence/display/MAVEN/DependencyResolutionException
2017-05-19T00:12:04.672 [ERROR]
2017-05-19T00:12:04.672 [ERROR] After correcting the problems, you can resume the build with the command
2017-05-19T00:12:04.672 [ERROR] mvn <goals> -rf :beam-sdks-java-io-elasticsearch
channel stopped
Jenkins build is back to normal : beam_PostCommit_Java_MavenInstall
#3850
Posted by Apache Jenkins Server <je...@builds.apache.org>.
See <https://builds.apache.org/job/beam_PostCommit_Java_MavenInstall/3850/display/redirect>