You are viewing a plain text version of this content. The canonical link for it is here.
Posted to builds@mesos.apache.org by Apache Jenkins Server <je...@builds.apache.org> on 2017/10/04 00:25:58 UTC

Build failed in Jenkins: Mesos-Buildbot » autotools,gcc,--verbose,GLOG_v=1 MESOS_VERBOSE=1,centos:7,(ubuntu)&&(!ubuntu-us1)&&(!ubuntu-eu2)&&(!qnode3)&&(!H23) #4284

See <https://builds.apache.org/job/Mesos-Buildbot/BUILDTOOL=autotools,COMPILER=gcc,CONFIGURATION=--verbose,ENVIRONMENT=GLOG_v=1%20MESOS_VERBOSE=1,OS=centos%3A7,label_exp=(ubuntu)&&(!ubuntu-us1)&&(!ubuntu-eu2)&&(!qnode3)&&(!H23)/4284/display/redirect?page=changes>

Changes:

[yujie.jay] Handled discarded case in launch nested container handler.

------------------------------------------
[...truncated 31.65 MB...]
I1004 00:25:47.027885  6805 http.cpp:1045] Creating default 'basic' HTTP authenticator for realm 'mesos-agent-readwrite'
I1004 00:25:47.030153  6805 slave.cpp:585] Agent resources: [{"name":"cpus","scalar":{"value":2.0},"type":"SCALAR"},{"name":"mem","scalar":{"value":1024.0},"type":"SCALAR"},{"name":"disk","scalar":{"value":1024.0},"type":"SCALAR"},{"name":"ports","ranges":{"range":[{"begin":31000,"end":32000}]},"type":"RANGES"}]
I1004 00:25:47.030403  6805 slave.cpp:593] Agent attributes: [  ]
I1004 00:25:47.030416  6805 slave.cpp:602] Agent hostname: fc1c649b8c55
I1004 00:25:47.030608  6823 status_update_manager.cpp:177] Pausing sending status updates
I1004 00:25:47.032263  6828 state.cpp:64] Recovering state from '/tmp/Endpoint_SlaveEndpointTest_AuthorizedRequest_2_qRGDYB/meta'
I1004 00:25:47.032650  6810 status_update_manager.cpp:203] Recovering status update manager
I1004 00:25:47.032907  6818 containerizer.cpp:648] Recovering containerizer
I1004 00:25:47.034734  6806 provisioner.cpp:416] Provisioner recovery complete
I1004 00:25:47.035171  6823 slave.cpp:6310] Finished recovery
I1004 00:25:47.035675  6823 slave.cpp:6492] Querying resource estimator for oversubscribable resources
I1004 00:25:47.035955  6828 slave.cpp:6506] Received oversubscribable resources {} from the resource estimator
I1004 00:25:47.039608  6826 process.cpp:3929] Handling HTTP event for process 'slave(817)' with path: '/slave(817)/containers'
I1004 00:25:47.040985  6807 http.cpp:1185] HTTP GET for /slave(817)/containers from 172.17.0.8:48156
I1004 00:25:47.041085  6807 http.cpp:976] Authorizing principal 'test-principal' to GET the '/containers' endpoint
I1004 00:25:47.044986  6786 slave.cpp:869] Agent terminating
[       OK ] Endpoint/SlaveEndpointTest.AuthorizedRequest/2 (36 ms)
[ RUN      ] Endpoint/SlaveEndpointTest.UnauthorizedRequest/0
I1004 00:25:47.057406  6786 containerizer.cpp:292] Using isolation { environment_secret, posix/cpu, posix/mem, filesystem/posix, network/cni }
W1004 00:25:47.057987  6786 backend.cpp:76] Failed to create 'aufs' backend: AufsBackend requires root privileges
W1004 00:25:47.058106  6786 backend.cpp:76] Failed to create 'bind' backend: BindBackend requires root privileges
I1004 00:25:47.058154  6786 provisioner.cpp:255] Using default backend 'copy'
I1004 00:25:47.062091  6808 slave.cpp:254] Mesos agent started on (818)@172.17.0.8:45877
I1004 00:25:47.062119  6808 slave.cpp:255] Flags at startup: --acls="" --appc_simple_discovery_uri_prefix="http://" --appc_store_dir="/tmp/Endpoint_SlaveEndpointTest_UnauthorizedRequest_0_ybBE2A/store/appc" --authenticate_http_readonly="true" --authenticate_http_readwrite="true" --authenticatee="crammd5" --authentication_backoff_factor="1secs" --authorizer="local" --cgroups_cpu_enable_pids_and_tids_count="false" --cgroups_enable_cfs="false" --cgroups_hierarchy="/sys/fs/cgroup" --cgroups_limit_swap="false" --cgroups_root="mesos" --container_disk_watch_interval="15secs" --containerizers="mesos" --credential="/tmp/Endpoint_SlaveEndpointTest_UnauthorizedRequest_0_ybBE2A/credential" --default_role="*" --disallow_sharing_agent_pid_namespace="false" --disk_watch_interval="1mins" --docker="docker" --docker_kill_orphans="true" --docker_registry="https://registry-1.docker.io" --docker_remove_delay="6hrs" --docker_socket="/var/run/docker.sock" --docker_stop_timeout="0ns" --docker_store_dir="/tmp/Endpoint_SlaveEndpointTest_UnauthorizedRequest_0_ybBE2A/store/docker" --docker_volume_checkpoint_dir="/var/run/mesos/isolators/docker/volume" --enforce_container_disk_quota="false" --executor_registration_timeout="1mins" --executor_reregistration_timeout="2secs" --executor_shutdown_grace_period="5secs" --fetcher_cache_dir="/tmp/Endpoint_SlaveEndpointTest_UnauthorizedRequest_0_ybBE2A/fetch" --fetcher_cache_size="2GB" --frameworks_home="" --gc_delay="1weeks" --gc_disk_headroom="0.1" --hadoop_home="" --help="false" --hostname_lookup="true" --http_command_executor="false" --http_credentials="/tmp/Endpoint_SlaveEndpointTest_UnauthorizedRequest_0_ybBE2A/http_credentials" --http_heartbeat_interval="30secs" --initialize_driver_logging="true" --isolation="posix/cpu,posix/mem" --launcher="posix" --launcher_dir="/mesos/mesos-1.5.0/_build/src" --logbufsecs="0" --logging_level="INFO" --max_completed_executors_per_framework="150" --oversubscribed_resources_interval="15secs" --perf_duration="10secs" --perf_interval="1mins" --port="5051" --qos_correction_interval_min="0ns" --quiet="false" --recover="reconnect" --recovery_timeout="15mins" --registration_backoff_factor="10ms" --resources="cpus:2;gpus:0;mem:1024;disk:1024;ports:[31000-32000]" --revocable_cpu_low_priority="true" --runtime_dir="/tmp/Endpoint_SlaveEndpointTest_UnauthorizedRequest_0_ybBE2A" --sandbox_directory="/mnt/mesos/sandbox" --strict="true" --switch_user="true" --systemd_enable_support="true" --systemd_runtime_directory="/run/systemd/system" --version="false" --work_dir="/tmp/Endpoint_SlaveEndpointTest_UnauthorizedRequest_0_GGRJNo" --zk_session_timeout="10secs"
I1004 00:25:47.062585  6808 credentials.hpp:86] Loading credential for authentication from '/tmp/Endpoint_SlaveEndpointTest_UnauthorizedRequest_0_ybBE2A/credential'
I1004 00:25:47.062783  6808 slave.cpp:287] Agent using credential for: test-principal
I1004 00:25:47.062814  6808 credentials.hpp:37] Loading credentials for authentication from '/tmp/Endpoint_SlaveEndpointTest_UnauthorizedRequest_0_ybBE2A/http_credentials'
I1004 00:25:47.063110  6808 http.cpp:1045] Creating default 'basic' HTTP authenticator for realm 'mesos-agent-readonly'
I1004 00:25:47.063304  6808 http.cpp:1045] Creating default 'basic' HTTP authenticator for realm 'mesos-agent-readwrite'
I1004 00:25:47.064796  6808 slave.cpp:585] Agent resources: [{"name":"cpus","scalar":{"value":2.0},"type":"SCALAR"},{"name":"mem","scalar":{"value":1024.0},"type":"SCALAR"},{"name":"disk","scalar":{"value":1024.0},"type":"SCALAR"},{"name":"ports","ranges":{"range":[{"begin":31000,"end":32000}]},"type":"RANGES"}]
I1004 00:25:47.065062  6808 slave.cpp:593] Agent attributes: [  ]
I1004 00:25:47.065104  6808 slave.cpp:602] Agent hostname: fc1c649b8c55
I1004 00:25:47.065311  6811 status_update_manager.cpp:177] Pausing sending status updates
I1004 00:25:47.066902  6817 state.cpp:64] Recovering state from '/tmp/Endpoint_SlaveEndpointTest_UnauthorizedRequest_0_GGRJNo/meta'
I1004 00:25:47.067291  6814 status_update_manager.cpp:203] Recovering status update manager
I1004 00:25:47.067499  6822 containerizer.cpp:648] Recovering containerizer
I1004 00:25:47.069222  6807 provisioner.cpp:416] Provisioner recovery complete
I1004 00:25:47.069665  6816 slave.cpp:6310] Finished recovery
I1004 00:25:47.070240  6816 slave.cpp:6492] Querying resource estimator for oversubscribable resources
I1004 00:25:47.070567  6825 slave.cpp:6506] Received oversubscribable resources {} from the resource estimator
I1004 00:25:47.073869  6806 process.cpp:3929] Handling HTTP event for process 'slave(818)' with path: '/slave(818)/monitor/statistics'
I1004 00:25:47.075224  6826 http.cpp:1185] HTTP GET for /slave(818)/monitor/statistics from 172.17.0.8:48160
I1004 00:25:47.075301  6826 http.cpp:976] Authorizing principal 'test-principal' to GET the '/monitor/statistics' endpoint
I1004 00:25:47.077778  6820 slave.cpp:869] Agent terminating
[       OK ] Endpoint/SlaveEndpointTest.UnauthorizedRequest/0 (32 ms)
[ RUN      ] Endpoint/SlaveEndpointTest.UnauthorizedRequest/1
I1004 00:25:47.090873  6786 containerizer.cpp:292] Using isolation { environment_secret, posix/cpu, posix/mem, filesystem/posix, network/cni }
W1004 00:25:47.091439  6786 backend.cpp:76] Failed to create 'aufs' backend: AufsBackend requires root privileges
W1004 00:25:47.091560  6786 backend.cpp:76] Failed to create 'bind' backend: BindBackend requires root privileges
I1004 00:25:47.091595  6786 provisioner.cpp:255] Using default backend 'copy'
I1004 00:25:47.095574  6825 slave.cpp:254] Mesos agent started on (819)@172.17.0.8:45877
I1004 00:25:47.095604  6825 slave.cpp:255] Flags at startup: --acls="" --appc_simple_discovery_uri_prefix="http://" --appc_store_dir="/tmp/Endpoint_SlaveEndpointTest_UnauthorizedRequest_1_urC2go/store/appc" --authenticate_http_readonly="true" --authenticate_http_readwrite="true" --authenticatee="crammd5" --authentication_backoff_factor="1secs" --authorizer="local" --cgroups_cpu_enable_pids_and_tids_count="false" --cgroups_enable_cfs="false" --cgroups_hierarchy="/sys/fs/cgroup" --cgroups_limit_swap="false" --cgroups_root="mesos" --container_disk_watch_interval="15secs" --containerizers="mesos" --credential="/tmp/Endpoint_SlaveEndpointTest_UnauthorizedRequest_1_urC2go/credential" --default_role="*" --disallow_sharing_agent_pid_namespace="false" --disk_watch_interval="1mins" --docker="docker" --docker_kill_orphans="true" --docker_registry="https://registry-1.docker.io" --docker_remove_delay="6hrs" --docker_socket="/var/run/docker.sock" --docker_stop_timeout="0ns" --docker_store_dir="/tmp/Endpoint_SlaveEndpointTest_UnauthorizedRequest_1_urC2go/store/docker" --docker_volume_checkpoint_dir="/var/run/mesos/isolators/docker/volume" --enforce_container_disk_quota="false" --executor_registration_timeout="1mins" --executor_reregistration_timeout="2secs" --executor_shutdown_grace_period="5secs" --fetcher_cache_dir="/tmp/Endpoint_SlaveEndpointTest_UnauthorizedRequest_1_urC2go/fetch" --fetcher_cache_size="2GB" --frameworks_home="" --gc_delay="1weeks" --gc_disk_headroom="0.1" --hadoop_home="" --help="false" --hostname_lookup="true" --http_command_executor="false" --http_credentials="/tmp/Endpoint_SlaveEndpointTest_UnauthorizedRequest_1_urC2go/http_credentials" --http_heartbeat_interval="30secs" --initialize_driver_logging="true" --isolation="posix/cpu,posix/mem" --launcher="posix" --launcher_dir="/mesos/mesos-1.5.0/_build/src" --logbufsecs="0" --logging_level="INFO" --max_completed_executors_per_framework="150" --oversubscribed_resources_interval="15secs" --perf_duration="10secs" --perf_interval="1mins" --port="5051" --qos_correction_interval_min="0ns" --quiet="false" --recover="reconnect" --recovery_timeout="15mins" --registration_backoff_factor="10ms" --resources="cpus:2;gpus:0;mem:1024;disk:1024;ports:[31000-32000]" --revocable_cpu_low_priority="true" --runtime_dir="/tmp/Endpoint_SlaveEndpointTest_UnauthorizedRequest_1_urC2go" --sandbox_directory="/mnt/mesos/sandbox" --strict="true" --switch_user="true" --systemd_enable_support="true" --systemd_runtime_directory="/run/systemd/system" --version="false" --work_dir="/tmp/Endpoint_SlaveEndpointTest_UnauthorizedRequest_1_azfbXb" --zk_session_timeout="10secs"
I1004 00:25:47.096029  6825 credentials.hpp:86] Loading credential for authentication from '/tmp/Endpoint_SlaveEndpointTest_UnauthorizedRequest_1_urC2go/credential'
I1004 00:25:47.096210  6825 slave.cpp:287] Agent using credential for: test-principal
I1004 00:25:47.096233  6825 credentials.hpp:37] Loading credentials for authentication from '/tmp/Endpoint_SlaveEndpointTest_UnauthorizedRequest_1_urC2go/http_credentials'
I1004 00:25:47.096484  6825 http.cpp:1045] Creating default 'basic' HTTP authenticator for realm 'mesos-agent-readonly'
I1004 00:25:47.096657  6825 http.cpp:1045] Creating default 'basic' HTTP authenticator for realm 'mesos-agent-readwrite'
I1004 00:25:47.098106  6825 slave.cpp:585] Agent resources: [{"name":"cpus","scalar":{"value":2.0},"type":"SCALAR"},{"name":"mem","scalar":{"value":1024.0},"type":"SCALAR"},{"name":"disk","scalar":{"value":1024.0},"type":"SCALAR"},{"name":"ports","ranges":{"range":[{"begin":31000,"end":32000}]},"type":"RANGES"}]
I1004 00:25:47.098346  6825 slave.cpp:593] Agent attributes: [  ]
I1004 00:25:47.098361  6825 slave.cpp:602] Agent hostname: fc1c649b8c55
I1004 00:25:47.098498  6809 status_update_manager.cpp:177] Pausing sending status updates
I1004 00:25:47.100080  6823 state.cpp:64] Recovering state from '/tmp/Endpoint_SlaveEndpointTest_UnauthorizedRequest_1_azfbXb/meta'
I1004 00:25:47.100497  6805 status_update_manager.cpp:203] Recovering status update manager
I1004 00:25:47.100802  6812 containerizer.cpp:648] Recovering containerizer
I1004 00:25:47.102452  6817 provisioner.cpp:416] Provisioner recovery complete
I1004 00:25:47.102881  6813 slave.cpp:6310] Finished recovery
I1004 00:25:47.103382  6813 slave.cpp:6492] Querying resource estimator for oversubscribable resources
I1004 00:25:47.103665  6824 slave.cpp:6506] Received oversubscribable resources {} from the resource estimator
I1004 00:25:47.107512  6814 process.cpp:3929] Handling HTTP event for process 'slave(819)' with path: '/slave(819)/monitor/statistics.json'
I1004 00:25:47.108842  6828 http.cpp:1185] HTTP GET for /slave(819)/monitor/statistics.json from 172.17.0.8:48162
I1004 00:25:47.108947  6828 http.cpp:976] Authorizing principal 'test-principal' to GET the '/monitor/statistics.json' endpoint
I1004 00:25:47.111699  6814 slave.cpp:869] Agent terminating
[       OK ] Endpoint/SlaveEndpointTest.UnauthorizedRequest/1 (34 ms)
[ RUN      ] Endpoint/SlaveEndpointTest.UnauthorizedRequest/2
I1004 00:25:47.124013  6786 containerizer.cpp:292] Using isolation { environment_secret, posix/cpu, posix/mem, filesystem/posix, network/cni }
W1004 00:25:47.124579  6786 backend.cpp:76] Failed to create 'aufs' backend: AufsBackend requires root privileges
W1004 00:25:47.124694  6786 backend.cpp:76] Failed to create 'bind' backend: BindBackend requires root privileges
I1004 00:25:47.124727  6786 provisioner.cpp:255] Using default backend 'copy'
I1004 00:25:47.128424  6813 slave.cpp:254] Mesos agent started on (820)@172.17.0.8:45877
I1004 00:25:47.128450  6813 slave.cpp:255] Flags at startup: --acls="" --appc_simple_discovery_uri_prefix="http://" --appc_store_dir="/tmp/Endpoint_SlaveEndpointTest_UnauthorizedRequest_2_2sBnPb/store/appc" --authenticate_http_readonly="true" --authenticate_http_readwrite="true" --authenticatee="crammd5" --authentication_backoff_factor="1secs" --authorizer="local" --cgroups_cpu_enable_pids_and_tids_count="false" --cgroups_enable_cfs="false" --cgroups_hierarchy="/sys/fs/cgroup" --cgroups_limit_swap="false" --cgroups_root="mesos" --container_disk_watch_interval="15secs" --containerizers="mesos" --credential="/tmp/Endpoint_SlaveEndpointTest_UnauthorizedRequest_2_2sBnPb/credential" --default_role="*" --disallow_sharing_agent_pid_namespace="false" --disk_watch_interval="1mins" --docker="docker" --docker_kill_orphans="true" --docker_registry="https://registry-1.docker.io" --docker_remove_delay="6hrs" --docker_socket="/var/run/docker.sock" --docker_stop_timeout="0ns" --docker_store_dir="/tmp/Endpoint_SlaveEndpointTest_UnauthorizedRequest_2_2sBnPb/store/docker" --docker_volume_checkpoint_dir="/var/run/mesos/isolators/docker/volume" --enforce_container_disk_quota="false" --executor_registration_timeout="1mins" --executor_reregistration_timeout="2secs" --executor_shutdown_grace_period="5secs" --fetcher_cache_dir="/tmp/Endpoint_SlaveEndpointTest_UnauthorizedRequest_2_2sBnPb/fetch" --fetcher_cache_size="2GB" --frameworks_home="" --gc_delay="1weeks" --gc_disk_headroom="0.1" --hadoop_home="" --help="false" --hostname_lookup="true" --http_command_executor="false" --http_credentials="/tmp/Endpoint_SlaveEndpointTest_UnauthorizedRequest_2_2sBnPb/http_credentials" --http_heartbeat_interval="30secs" --initialize_driver_logging="true" --isolation="posix/cpu,posix/mem" --launcher="posix" --launcher_dir="/mesos/mesos-1.5.0/_build/src" --logbufsecs="0" --logging_level="INFO" --max_completed_executors_per_framework="150" --oversubscribed_resources_interval="15secs" --perf_duration="10secs" --perf_interval="1mins" --port="5051" --qos_correction_interval_min="0ns" --quiet="false" --recover="reconnect" --recovery_timeout="15mins" --registration_backoff_factor="10ms" --resources="cpus:2;gpus:0;mem:1024;disk:1024;ports:[31000-32000]" --revocable_cpu_low_priority="true" --runtime_dir="/tmp/Endpoint_SlaveEndpointTest_UnauthorizedRequest_2_2sBnPb" --sandbox_directory="/mnt/mesos/sandbox" --strict="true" --switch_user="true" --systemd_enable_support="true" --systemd_runtime_directory="/run/systemd/system" --version="false" --work_dir="/tmp/Endpoint_SlaveEndpointTest_UnauthorizedRequest_2_iJ7wqZ" --zk_session_timeout="10secs"
I1004 00:25:47.128844  6813 credentials.hpp:86] Loading credential for authentication from '/tmp/Endpoint_SlaveEndpointTest_UnauthorizedRequest_2_2sBnPb/credential'
I1004 00:25:47.129011  6813 slave.cpp:287] Agent using credential for: test-principal
I1004 00:25:47.129035  6813 credentials.hpp:37] Loading credentials for authentication from '/tmp/Endpoint_SlaveEndpointTest_UnauthorizedRequest_2_2sBnPb/http_credentials'
I1004 00:25:47.129299  6813 http.cpp:1045] Creating default 'basic' HTTP authenticator for realm 'mesos-agent-readonly'
I1004 00:25:47.129462  6813 http.cpp:1045] Creating default 'basic' HTTP authenticator for realm 'mesos-agent-readwrite'
I1004 00:25:47.130894  6813 slave.cpp:585] Agent resources: [{"name":"cpus","scalar":{"value":2.0},"type":"SCALAR"},{"name":"mem","scalar":{"value":1024.0},"type":"SCALAR"},{"name":"disk","scalar":{"value":1024.0},"type":"SCALAR"},{"name":"ports","ranges":{"range":[{"begin":31000,"end":32000}]},"type":"RANGES"}]
I1004 00:25:47.131134  6813 slave.cpp:593] Agent attributes: [  ]
I1004 00:25:47.131150  6813 slave.cpp:602] Agent hostname: fc1c649b8c55
I1004 00:25:47.131359  6809 status_update_manager.cpp:177] Pausing sending status updates
I1004 00:25:47.132845  6814 state.cpp:64] Recovering state from '/tmp/Endpoint_SlaveEndpointTest_UnauthorizedRequest_2_iJ7wqZ/meta'
I1004 00:25:47.133168  6806 status_update_manager.cpp:203] Recovering status update manager
I1004 00:25:47.133402  6819 containerizer.cpp:648] Recovering containerizer
I1004 00:25:47.135187  6810 provisioner.cpp:416] Provisioner recovery complete
I1004 00:25:47.135578  6809 slave.cpp:6310] Finished recovery
I1004 00:25:47.136169  6809 slave.cpp:6492] Querying resource estimator for oversubscribable resources
I1004 00:25:47.136561  6817 slave.cpp:6506] Received oversubscribable resources {} from the resource estimator
I1004 00:25:47.139868  6826 process.cpp:3929] Handling HTTP event for process 'slave(820)' with path: '/slave(820)/containers'
I1004 00:25:47.141422  6818 http.cpp:1185] HTTP GET for /slave(820)/containers from 172.17.0.8:48164
I1004 00:25:47.141511  6818 http.cpp:976] Authorizing principal 'test-principal' to GET the '/containers' endpoint
I1004 00:25:47.143844  6786 slave.cpp:869] Agent terminating
[       OK ] Endpoint/SlaveEndpointTest.UnauthorizedRequest/2 (32 ms)
[ RUN      ] Endpoint/SlaveEndpointTest.NoAuthorizer/0
I1004 00:25:47.157321  6786 containerizer.cpp:292] Using isolation { environment_secret, posix/cpu, posix/mem, filesystem/posix, network/cni }
W1004 00:25:47.157961  6786 backend.cpp:76] Failed to create 'aufs' backend: AufsBackend requires root privileges
W1004 00:25:47.158082  6786 backend.cpp:76] Failed to create 'bind' backend: BindBackend requires root privileges
I1004 00:25:47.158119  6786 provisioner.cpp:255] Using default backend 'copy'
I1004 00:25:47.160027  6786 cluster.cpp:448] Creating default 'local' authorizer
I1004 00:25:47.162324  6825 slave.cpp:254] Mesos agent started on (821)@172.17.0.8:45877
I1004 00:25:47.162369  6825 slave.cpp:255] Flags at startup: --acls="" --appc_simple_discovery_uri_prefix="http://" --appc_store_dir="/tmp/Endpoint_SlaveEndpointTest_NoAuthorizer_0_8lU8GZ/store/appc" --authenticate_http_readonly="true" --authenticate_http_readwrite="true" --authenticatee="crammd5" --authentication_backoff_factor="1secs" --authorizer="local" --cgroups_cpu_enable_pids_and_tids_count="false" --cgroups_enable_cfs="false" --cgroups_hierarchy="/sys/fs/cgroup" --cgroups_limit_swap="false" --cgroups_root="mesos" --container_disk_watch_interval="15secs" --containerizers="mesos" --credential="/tmp/Endpoint_SlaveEndpointTest_NoAuthorizer_0_8lU8GZ/credential" --default_role="*" --disallow_sharing_agent_pid_namespace="false" --disk_watch_interval="1mins" --docker="docker" --docker_kill_orphans="true" --docker_registry="https://registry-1.docker.io" --docker_remove_delay="6hrs" --docker_socket="/var/run/docker.sock" --docker_stop_timeout="0ns" --docker_store_dir="/tmp/Endpoint_SlaveEndpointTest_NoAuthorizer_0_8lU8GZ/store/docker" --docker_volume_checkpoint_dir="/var/run/mesos/isolators/docker/volume" --enforce_container_disk_quota="false" --executor_registration_timeout="1mins" --executor_reregistration_timeout="2secs" --executor_shutdown_grace_period="5secs" --fetcher_cache_dir="/tmp/Endpoint_SlaveEndpointTest_NoAuthorizer_0_8lU8GZ/fetch" --fetcher_cache_size="2GB" --frameworks_home="" --gc_delay="1weeks" --gc_disk_headroom="0.1" --hadoop_home="" --help="false" --hostname_lookup="true" --http_command_executor="false" --http_credentials="/tmp/Endpoint_SlaveEndpointTest_NoAuthorizer_0_8lU8GZ/http_credentials" --http_heartbeat_interval="30secs" --initialize_driver_logging="true" --isolation="posix/cpu,posix/mem" --launcher="posix" --launcher_dir="/mesos/mesos-1.5.0/_build/src" --logbufsecs="0" --logging_level="INFO" --max_completed_executors_per_framework="150" --oversubscribed_resources_interval="15secs" --perf_duration="10secs" --perf_interval="1mins" --port="5051" --qos_correction_interval_min="0ns" --quiet="false" --recover="reconnect" --recovery_timeout="15mins" --registration_backoff_factor="10ms" --resources="cpus:2;gpus:0;mem:1024;disk:1024;ports:[31000-32000]" --revocable_cpu_low_priority="true" --runtime_dir="/tmp/Endpoint_SlaveEndpointTest_NoAuthorizer_0_8lU8GZ" --sandbox_directory="/mnt/mesos/sandbox" --strict="true" --switch_user="true" --systemd_enable_support="true" --systemd_runtime_directory="/run/systemd/system" --version="false" --work_dir="/tmp/Endpoint_SlaveEndpointTest_NoAuthorizer_0_SezrdN" --zk_session_timeout="10secs"
I1004 00:25:47.162868  6825 credentials.hpp:86] Loading credential for authentication from '/tmp/Endpoint_SlaveEndpointTest_NoAuthorizer_0_8lU8GZ/credential'
I1004 00:25:47.163070  6825 slave.cpp:287] Agent using credential for: test-principal
I1004 00:25:47.163094  6825 credentials.hpp:37] Loading credentials for authentication from '/tmp/Endpoint_SlaveEndpointTest_NoAuthorizer_0_8lU8GZ/http_credentials'
I1004 00:25:47.163352  6825 http.cpp:1045] Creating default 'basic' HTTP authenticator for realm 'mesos-agent-readonly'
I1004 00:25:47.163538  6825 http.cpp:1045] Creating default 'basic' HTTP authenticator for realm 'mesos-agent-readwrite'
I1004 00:25:47.165019  6825 slave.cpp:585] Agent resources: [{"name":"cpus","scalar":{"value":2.0},"type":"SCALAR"},{"name":"mem","scalar":{"value":1024.0},"type":"SCALAR"},{"name":"disk","scalar":{"value":1024.0},"type":"SCALAR"},{"name":"ports","ranges":{"range":[{"begin":31000,"end":32000}]},"type":"RANGES"}]
I1004 00:25:47.165292  6825 slave.cpp:593] Agent attributes: [  ]
I1004 00:25:47.165307  6825 slave.cpp:602] Agent hostname: fc1c649b8c55
I1004 00:25:47.165463  6819 status_update_manager.cpp:177] Pausing sending status updates
I1004 00:25:47.167228  6810 state.cpp:64] Recovering state from '/tmp/Endpoint_SlaveEndpointTest_NoAuthorizer_0_SezrdN/meta'
I1004 00:25:47.167628  6813 status_update_manager.cpp:203] Recovering status update manager
I1004 00:25:47.167860  6812 containerizer.cpp:648] Recovering containerizer
I1004 00:25:47.169339  6807 provisioner.cpp:416] Provisioner recovery complete
I1004 00:25:47.169708  6807 slave.cpp:6310] Finished recovery
I1004 00:25:47.170193  6807 slave.cpp:6492] Querying resource estimator for oversubscribable resources
I1004 00:25:47.170476  6816 slave.cpp:6506] Received oversubscribable resources {} from the resource estimator
I1004 00:25:47.173869  6827 process.cpp:3929] Handling HTTP event for process 'slave(821)' with path: '/slave(821)/monitor/statistics'
I1004 00:25:47.175323  6828 http.cpp:1185] HTTP GET for /slave(821)/monitor/statistics from 172.17.0.8:48166
I1004 00:25:47.175402  6828 http.cpp:976] Authorizing principal 'test-principal' to GET the '/monitor/statistics' endpoint
I1004 00:25:47.179338  6786 slave.cpp:869] Agent terminating
[       OK ] Endpoint/SlaveEndpointTest.NoAuthorizer/0 (34 ms)
[ RUN      ] Endpoint/SlaveEndpointTest.NoAuthorizer/1
I1004 00:25:47.191743  6786 containerizer.cpp:292] Using isolation { environment_secret, posix/cpu, posix/mem, filesystem/posix, network/cni }
W1004 00:25:47.192296  6786 backend.cpp:76] Failed to create 'aufs' backend: AufsBackend requires root privileges
W1004 00:25:47.192410  6786 backend.cpp:76] Failed to create 'bind' backend: BindBackend requires root privileges
I1004 00:25:47.192445  6786 provisioner.cpp:255] Using default backend 'copy'
I1004 00:25:47.194211  6786 cluster.cpp:448] Creating default 'local' authorizer
I1004 00:25:47.196272  6818 slave.cpp:254] Mesos agent started on (822)@172.17.0.8:45877
I1004 00:25:47.196305  6818 slave.cpp:255] Flags at startup: --acls="" --appc_simple_discovery_uri_prefix="http://" --appc_store_dir="/tmp/Endpoint_SlaveEndpointTest_NoAuthorizer_1_aDHtTN/store/appc" --authenticate_http_readonly="true" --authenticate_http_readwrite="true" --authenticatee="crammd5" --authentication_backoff_factor="1secs" --authorizer="local" --cgroups_cpu_enable_pids_and_tids_count="false" --cgroups_enable_cfs="false" --cgroups_hierarchy="/sys/fs/cgroup" --cgroups_limit_swap="false" --cgroups_root="mesos" --container_disk_watch_interval="15secs" --containerizers="mesos" --credential="/tmp/Endpoint_SlaveEndpointTest_NoAuthorizer_1_aDHtTN/credential" --default_role="*" --disallow_sharing_agent_pid_namespace="false" --disk_watch_interval="1mins" --docker="docker" --docker_kill_orphans="true" --docker_registry="https://registry-1.docker.io" --docker_remove_delay="6hrs" --docker_socket="/var/run/docker.sock" --docker_stop_timeout="0ns" --docker_store_dir="/tmp/Endpoint_SlaveEndpointTest_NoAuthorizer_1_aDHtTN/store/docker" --docker_volume_checkpoint_dir="/var/run/mesos/isolators/docker/volume" --enforce_container_disk_quota="false" --executor_registration_timeout="1mins" --executor_reregistration_timeout="2secs" --executor_shutdown_grace_period="5secs" --fetcher_cache_dir="/tmp/Endpoint_SlaveEndpointTest_NoAuthorizer_1_aDHtTN/fetch" --fetcher_cache_size="2GB" --frameworks_home="" --gc_delay="1weeks" --gc_disk_headroom="0.1" --hadoop_home="" --help="false" --hostname_lookup="true" --http_command_executor="false" --http_credentials="/tmp/Endpoint_SlaveEndpointTest_NoAuthorizer_1_aDHtTN/http_credentials" --http_heartbeat_interval="30secs" --initialize_driver_logging="true" --isolation="posix/cpu,posix/mem" --launcher="posix" --launcher_dir="/mesos/mesos-1.5.0/_build/src" --logbufsecs="0" --logging_level="INFO" --max_completed_executors_per_framework="150" --oversubscribed_resources_interval="15secs" --perf_duration="10secs" --perf_interval="1mins" --port="5051" --qos_correction_interval_min="0ns" --quiet="false" --recover="reconnect" --recovery_timeout="15mins" --registration_backoff_factor="10ms" --resources="cpus:2;gpus:0;mem:1024;disk:1024;ports:[31000-32000]" --revocable_cpu_low_priority="true" --runtime_dir="/tmp/Endpoint_SlaveEndpointTest_NoAuthorizer_1_aDHtTN" --sandbox_directory="/mnt/mesos/sandbox" --strict="true" --switch_user="true" --systemd_enable_support="true" --systemd_runtime_directory="/run/systemd/system" --version="false" --work_dir="/tmp/Endpoint_SlaveEndpointTest_NoAuthorizer_1_eYlCkB" --zk_session_timeout="10secs"
I1004 00:25:47.196844  6818 credentials.hpp:86] Loading credential for authentication from '/tmp/Endpoint_SlaveEndpointTest_NoAuthorizer_1_aDHtTN/credential'
I1004 00:25:47.197110  6818 slave.cpp:287] Agent using credential for: test-principal
I1004 00:25:47.197135  6818 credentials.hpp:37] Loading credentials for authentication from '/tmp/Endpoint_SlaveEndpointTest_NoAuthorizer_1_aDHtTN/http_credentials'
I1004 00:25:47.197427  6818 http.cpp:1045] Creating default 'basic' HTTP authenticator for realm 'mesos-agent-readonly'
I1004 00:25:47.197660  6818 http.cpp:1045] Creating default 'basic' HTTP authenticator for realm 'mesos-agent-readwrite'
I1004 00:25:47.199273  6818 slave.cpp:585] Agent resources: [{"name":"cpus","scalar":{"value":2.0},"type":"SCALAR"},{"name":"mem","scalar":{"value":1024.0},"type":"SCALAR"},{"name":"disk","scalar":{"value":1024.0},"type":"SCALAR"},{"name":"ports","ranges":{"range":[{"begin":31000,"end":32000}]},"type":"RANGES"}]
I1004 00:25:47.199529  6818 slave.cpp:593] Agent attributes: [  ]
I1004 00:25:47.199544  6818 slave.cpp:602] Agent hostname: fc1c649b8c55
I1004 00:25:47.199719  6805 status_update_manager.cpp:177] Pausing sending status updates
I1004 00:25:47.201617  6825 state.cpp:64] Recovering state from '/tmp/Endpoint_SlaveEndpointTest_NoAuthorizer_1_eYlCkB/meta'
I1004 00:25:47.201982  6813 status_update_manager.cpp:203] Recovering status update manager
I1004 00:25:47.202201  6827 containerizer.cpp:648] Recovering containerizer
I1004 00:25:47.203750  6808 provisioner.cpp:416] Provisioner recovery complete
I1004 00:25:47.204116  6805 slave.cpp:6310] Finished recovery
I1004 00:25:47.204622  6805 slave.cpp:6492] Querying resource estimator for oversubscribable resources
I1004 00:25:47.204892  6823 slave.cpp:6506] Received oversubscribable resources {} from the resource estimator
I1004 00:25:47.207864  6820 process.cpp:3929] Handling HTTP event for process 'slave(822)' with path: '/slave(822)/monitor/statistics.json'
I1004 00:25:47.210415  6822 http.cpp:1185] HTTP GET for /slave(822)/monitor/statistics.json from 172.17.0.8:48168
I1004 00:25:47.210533  6822 http.cpp:976] Authorizing principal 'test-principal' to GET the '/monitor/statistics.json' endpoint
I1004 00:25:47.214715  6786 slave.cpp:869] Agent terminating
[       OK ] Endpoint/SlaveEndpointTest.NoAuthorizer/1 (35 ms)
[ RUN      ] Endpoint/SlaveEndpointTest.NoAuthorizer/2
I1004 00:25:47.227103  6786 containerizer.cpp:292] Using isolation { environment_secret, posix/cpu, posix/mem, filesystem/posix, network/cni }
W1004 00:25:47.227655  6786 backend.cpp:76] Failed to create 'aufs' backend: AufsBackend requires root privileges
W1004 00:25:47.227769  6786 backend.cpp:76] Failed to create 'bind' backend: BindBackend requires root privileges
I1004 00:25:47.227802  6786 provisioner.cpp:255] Using default backend 'copy'
I1004 00:25:47.229537  6786 cluster.cpp:448] Creating default 'local' authorizer
I1004 00:25:47.231534  6806 slave.cpp:254] Mesos agent started on (823)@172.17.0.8:45877
I1004 00:25:47.231561  6806 slave.cpp:255] Flags at startup: --acls="" --appc_simple_discovery_uri_prefix="http://" --appc_store_dir="/tmp/Endpoint_SlaveEndpointTest_NoAuthorizer_2_I1tLqC/store/appc" --authenticate_http_readonly="true" --authenticate_http_readwrite="true" --authenticatee="crammd5" --authentication_backoff_factor="1secs" --authorizer="local" --cgroups_cpu_enable_pids_and_tids_count="false" --cgroups_enable_cfs="false" --cgroups_hierarchy="/sys/fs/cgroup" --cgroups_limit_swap="false" --cgroups_root="mesos" --container_disk_watch_interval="15secs" --containerizers="mesos" --credential="/tmp/Endpoint_SlaveEndpointTest_NoAuthorizer_2_I1tLqC/credential" --default_role="*" --disallow_sharing_agent_pid_namespace="false" --disk_watch_interval="1mins" --docker="docker" --docker_kill_orphans="true" --docker_registry="https://registry-1.docker.io" --docker_remove_delay="6hrs" --docker_socket="/var/run/docker.sock" --docker_stop_timeout="0ns" --docker_store_dir="/tmp/Endpoint_SlaveEndpointTest_NoAuthorizer_2_I1tLqC/store/docker" --docker_volume_checkpoint_dir="/var/run/mesos/isolators/docker/volume" --enforce_container_disk_quota="false" --executor_registration_timeout="1mins" --executor_reregistration_timeout="2secs" --executor_shutdown_grace_period="5secs" --fetcher_cache_dir="/tmp/Endpoint_SlaveEndpointTest_NoAuthorizer_2_I1tLqC/fetch" --fetcher_cache_size="2GB" --frameworks_home="" --gc_delay="1weeks" --gc_disk_headroom="0.1" --hadoop_home="" --help="false" --hostname_lookup="true" --http_command_executor="false" --http_credentials="/tmp/Endpoint_SlaveEndpointTest_NoAuthorizer_2_I1tLqC/http_credentials" --http_heartbeat_interval="30secs" --initialize_driver_logging="true" --isolation="posix/cpu,posix/mem" --launcher="posix" --launcher_dir="/mesos/mesos-1.5.0/_build/src" --logbufsecs="0" --logging_level="INFO" --max_completed_executors_per_framework="150" --oversubscribed_resources_interval="15secs" --perf_duration="10secs" --perf_interval="1mins" --port="5051" --qos_correction_interval_min="0ns" --quiet="false" --recover="reconnect" --recovery_timeout="15mins" --registration_backoff_factor="10ms" --resources="cpus:2;gpus:0;mem:1024;disk:1024;ports:[31000-32000]" --revocable_cpu_low_priority="true" --runtime_dir="/tmp/Endpoint_SlaveEndpointTest_NoAuthorizer_2_I1tLqC" --sandbox_directory="/mnt/mesos/sandbox" --strict="true" --switch_user="true" --systemd_enable_support="true" --systemd_runtime_directory="/run/systemd/system" --version="false" --work_dir="/tmp/Endpoint_SlaveEndpointTest_NoAuthorizer_2_GE7CMp" --zk_session_timeout="10secs"
I1004 00:25:47.231953  6806 credentials.hpp:86] Loading credential for authentication from '/tmp/Endpoint_SlaveEndpointTest_NoAuthorizer_2_I1tLqC/credential'
I1004 00:25:47.232125  6806 slave.cpp:287] Agent using credential for: test-principal
I1004 00:25:47.232154  6806 credentials.hpp:37] Loading credentials for authentication from '/tmp/Endpoint_SlaveEndpointTest_NoAuthorizer_2_I1tLqC/http_credentials'
I1004 00:25:47.232448  6806 http.cpp:1045] Creating default 'basic' HTTP authenticator for realm 'mesos-agent-readonly'
I1004 00:25:47.232625  6806 http.cpp:1045] Creating default 'basic' HTTP authenticator for realm 'mesos-agent-readwrite'
I1004 00:25:47.234139  6806 slave.cpp:585] Agent resources: [{"name":"cpus","scalar":{"value":2.0},"type":"SCALAR"},{"name":"mem","scalar":{"value":1024.0},"type":"SCALAR"},{"name":"disk","scalar":{"value":1024.0},"type":"SCALAR"},{"name":"ports","ranges":{"range":[{"begin":31000,"end":32000}]},"type":"RANGES"}]
I1004 00:25:47.234386  6806 slave.cpp:593] Agent attributes: [  ]
I1004 00:25:47.234400  6806 slave.cpp:602] Agent hostname: fc1c649b8c55
I1004 00:25:47.234580  6818 status_update_manager.cpp:177] Pausing sending status updates
I1004 00:25:47.236096  6805 state.cpp:64] Recovering state from '/tmp/Endpoint_SlaveEndpointTest_NoAuthorizer_2_GE7CMp/meta'
I1004 00:25:47.236546  6825 status_update_manager.cpp:203] Recovering status update manager
I1004 00:25:47.236762  6828 containerizer.cpp:648] Recovering containerizer
I1004 00:25:47.238281  6816 provisioner.cpp:416] Provisioner recovery complete
I1004 00:25:47.238672  6822 slave.cpp:6310] Finished recovery
I1004 00:25:47.239189  6822 slave.cpp:6492] Querying resource estimator for oversubscribable resources
I1004 00:25:47.239537  6814 slave.cpp:6506] Received oversubscribable resources {} from the resource estimator
I1004 00:25:47.242683  6820 process.cpp:3929] Handling HTTP event for process 'slave(823)' with path: '/slave(823)/containers'
I1004 00:25:47.244069  6824 http.cpp:1185] HTTP GET for /slave(823)/containers from 172.17.0.8:48170
I1004 00:25:47.244148  6824 http.cpp:976] Authorizing principal 'test-principal' to GET the '/containers' endpoint
I1004 00:25:47.248378  6786 slave.cpp:869] Agent terminating
[       OK ] Endpoint/SlaveEndpointTest.NoAuthorizer/2 (34 ms)
[----------] 9 tests from Endpoint/SlaveEndpointTest (312 ms total)

[----------] 2 tests from ContainerizerType/DefaultContainerDNSFlagTest
[ RUN      ] ContainerizerType/DefaultContainerDNSFlagTest.ValidateFlag/0
[       OK ] ContainerizerType/DefaultContainerDNSFlagTest.ValidateFlag/0 (10 ms)
[ RUN      ] ContainerizerType/DefaultContainerDNSFlagTest.ValidateFlag/1
[       OK ] ContainerizerType/DefaultContainerDNSFlagTest.ValidateFlag/1 (12 ms)
[----------] 2 tests from ContainerizerType/DefaultContainerDNSFlagTest (22 ms total)

[----------] Global test environment tear-down
[==========] 1682 tests from 184 test cases ran. (528499 ms total)
[  PASSED  ] 1681 tests.
[  FAILED  ] 1 test, listed below:
[  FAILED  ] ExamplesTest.PersistentVolumeFramework

 1 FAILED TEST
  YOU HAVE 21 DISABLED TESTS

I1004 00:25:47.345449  6829 process.cpp:1068] Failed to accept socket: future discarded
make[4]: *** [check-local] Error 1
make[4]: Leaving directory `/mesos/mesos-1.5.0/_build/src'
make[3]: *** [check-am] Error 2
make[3]: Leaving directory `/mesos/mesos-1.5.0/_build/src'
make[2]: *** [check] Error 2
make[2]: Leaving directory `/mesos/mesos-1.5.0/_build/src'
make[1]: *** [check-recursive] Error 1
make[1]: Leaving directory `/mesos/mesos-1.5.0/_build'
make: *** [distcheck] Error 1
+ docker rmi mesos-1507074071-1796
Untagged: mesos-1507074071-1796:latest
Deleted: sha256:7157c4021fdca57306f4721e378c5fc79420288808f68d05c51122cc65d32399
Deleted: sha256:9cd09608e0f1bbb41389f1905bf294c89efa1e3c490b42a9e248fa974221cfd1
Deleted: sha256:fe43e2d62aa22306f5a500e254d17b7324f2c052c4eeebbd7a9bc46f594bccfe
Deleted: sha256:9cdb96654713ce5d79265617179c05f5a4aa27cd2af228fa3d27833019655bce
Deleted: sha256:160a41150f8fd4eac3473b8ee91865806288daac08e7fa160bc20a134ff10b2d
Deleted: sha256:20d142bca1160c4954cd4580ea16165c66c352b89d2f26f57324c9b534176e16
Deleted: sha256:21dee112329ff46c7f13a9940da61e1ba00cba3ecd0bf10aedaee7fcd48647a5
Deleted: sha256:748431b65da10732579c3c67b01d32e04805bfb57217d3b64243c0daacbe84b9
Deleted: sha256:91860c1cb33f0d6dcc3aee75d97fa9a7a574241241cfa12b05da1af801f8d58b
Deleted: sha256:d42e235935f477f7f07eb7d606fe80c157691c8da357b35b386ab80b69c58731
Deleted: sha256:0fd88ad1afea3c8af322fa93e5bfb34b120a9dd534f9d425f8b5881f19153e55
Deleted: sha256:2a7fa596b63c735ae57c3cc7aa126854485ad3a4424071c34edbbdca24aed4a0
Deleted: sha256:61eddae80d7ecf2a5e10268f0933053c2e07c0411a605700aa470a36a4cffac4
Deleted: sha256:43029219fc0cd191fe319588e74c19fb41f6a9edf333ee4d97a48a25f3ae29a2
Deleted: sha256:4a944a85b64a8dcce44afe897e659a6342c9fe3e7b7fbf0987be0e3ba8878bf3
Deleted: sha256:3416ad2e8c1b51da7a61a6625107387193c1da05fcda1f58233f8edbb2c1dc25
Deleted: sha256:babdbe789f2f3dd5170b8b7f7c35f816dbc713e242b454540a9843728445394f
Deleted: sha256:8266dd0baac2f7022be20966056516ba076ceea4d183b8d342f3296f2fbd4e29
Deleted: sha256:c5e1e86d7ef1aca97349748447d1164dcca3706e72b05b4a4933c65e47d8248c
Deleted: sha256:fc1a9c4509f966fb72c8330036da48752b4f6e74e98f06585254c21ce6ad77eb
Deleted: sha256:f0acdd840a2cb63063756c5b9d1cfc0cfd247dc65d206b4954a99c86622ebcdb
Deleted: sha256:cc589b24086ccc9762c2a11de48e27c0a50129151ed14ad04b3ef894bb9e9140
Deleted: sha256:7196c6086e4d6e905513cc76909b1c8f79854b99715a4a3a1589812d4bdef47f
Deleted: sha256:fdd20decf0ea20c3f07e4d05b010cafb26c5e326aa173d2803f8e92afe77a146
Deleted: sha256:405b7cbe621400a3f8bbeac585d3c2a0cfca5b786015f737e46591eff37c23ed
Deleted: sha256:3d6cc35932bf95fca8b2dcf5bfe281124a6d0284f672fd9b146f72309938c70e
Deleted: sha256:6ec10b2131983853dc65a2c57a56ce50f1cad2be1d5e50db0ae3373ffdadc834
Deleted: sha256:24978064346e87e8b171bcde8ed4a24de4c2af72c6c57b126de9a171b8c80365
Deleted: sha256:499778b564c4a66938795c4e5095e46adb9f3bd0e21440912c5901ef2cef2973
Build step 'Execute shell' marked build as failure
Not sending mail to unregistered user yujie.jay@gmail.com

Jenkins build is back to normal : Mesos-Buildbot » autotools,gcc,--verbose,GLOG_v=1 MESOS_VERBOSE=1,centos:7,(ubuntu)&&(!ubuntu-us1)&&(!ubuntu-eu2)&&(!qnode3)&&(!H23) #4285

Posted by Apache Jenkins Server <je...@builds.apache.org>.
See <https://builds.apache.org/job/Mesos-Buildbot/BUILDTOOL=autotools,COMPILER=gcc,CONFIGURATION=--verbose,ENVIRONMENT=GLOG_v=1%20MESOS_VERBOSE=1,OS=centos%3A7,label_exp=(ubuntu)&&(!ubuntu-us1)&&(!ubuntu-eu2)&&(!qnode3)&&(!H23)/4285/display/redirect?page=changes>