You are viewing a plain text version of this content. The canonical link for it is here.
Posted to notifications@maven.apache.org by Apache Jenkins Server <je...@builds.apache.org> on 2019/04/04 04:33:35 UTC

Build failed in Jenkins: Maven TLP » maven-surefire » 1546-1222 #8

See https://builds.apache.org/job/maven-box/job/maven-surefire/job/1546-1222/8/

Changes:

* display name in TEST-*.txt and encoding in IT
* display name in TEST-*.txt and encoding in IT
* display name in TEST-*.txt and encoding in IT
* display name in TEST-*.txt and encoding in IT

1 tests failed.
FAILED:  org.apache.maven.surefire.its.JUnitPlatformIT.testJupiterEngineWithDisplayNames

Error Message:
Did not find expected message in log

Stack Trace:
junit.framework.AssertionFailedError: Did not find expected message in log
	at org.apache.maven.surefire.its.JUnitPlatformIT.testJupiterEngineWithDisplayNames(JUnitPlatformIT.java:57)




Build log:
[...truncated 44235 lines...]
[2019-04-04T04:32:23.617Z] org.apache.maven.lifecycle.LifecycleExecutionException: Failed to execute goal org.apache.maven.plugins:maven-failsafe-plugin:3.0.0-M3:verify (default) on project surefire-its: There are test failures.
[2019-04-04T04:32:23.617Z] 
[2019-04-04T04:32:23.617Z] Please refer to /home/jenkins/jenkins-slave/workspace/ven-box_maven-surefire_1546-1222@2/surefire-its/target/failsafe-reports for the individual test results.
[2019-04-04T04:32:23.617Z] Please refer to dump files (if any exist) [date].dump, [date]-jvmRun[N].dump and [date].dumpstream.
[2019-04-04T04:32:23.617Z]     at org.apache.maven.lifecycle.internal.MojoExecutor.execute (MojoExecutor.java:215)
[2019-04-04T04:32:23.617Z]     at org.apache.maven.lifecycle.internal.MojoExecutor.execute (MojoExecutor.java:156)
[2019-04-04T04:32:23.617Z]     at org.apache.maven.lifecycle.internal.MojoExecutor.execute (MojoExecutor.java:148)
[2019-04-04T04:32:23.617Z]     at org.apache.maven.lifecycle.internal.LifecycleModuleBuilder.buildProject (LifecycleModuleBuilder.java:117)
[2019-04-04T04:32:23.617Z]     at org.apache.maven.lifecycle.internal.LifecycleModuleBuilder.buildProject (LifecycleModuleBuilder.java:81)
[2019-04-04T04:32:23.617Z]     at org.apache.maven.lifecycle.internal.builder.singlethreaded.SingleThreadedBuilder.build (SingleThreadedBuilder.java:56)
[2019-04-04T04:32:23.617Z]     at org.apache.maven.lifecycle.internal.LifecycleStarter.execute (LifecycleStarter.java:128)
[2019-04-04T04:32:23.617Z]     at org.apache.maven.DefaultMaven.doExecute (DefaultMaven.java:305)
[2019-04-04T04:32:23.617Z]     at org.apache.maven.DefaultMaven.doExecute (DefaultMaven.java:192)
[2019-04-04T04:32:23.617Z]     at org.apache.maven.DefaultMaven.execute (DefaultMaven.java:105)
[2019-04-04T04:32:23.617Z]     at org.apache.maven.cli.MavenCli.execute (MavenCli.java:956)
[2019-04-04T04:32:23.617Z]     at org.apache.maven.cli.MavenCli.doMain (MavenCli.java:288)
[2019-04-04T04:32:23.617Z]     at org.apache.maven.cli.MavenCli.main (MavenCli.java:192)
[2019-04-04T04:32:23.618Z]     at sun.reflect.NativeMethodAccessorImpl.invoke0 (Native Method)
[2019-04-04T04:32:23.618Z]     at sun.reflect.NativeMethodAccessorImpl.invoke (NativeMethodAccessorImpl.java:62)
[2019-04-04T04:32:23.618Z]     at sun.reflect.DelegatingMethodAccessorImpl.invoke (DelegatingMethodAccessorImpl.java:43)
[2019-04-04T04:32:23.618Z]     at java.lang.reflect.Method.invoke (Method.java:498)
[2019-04-04T04:32:23.618Z]     at org.codehaus.plexus.classworlds.launcher.Launcher.launchEnhanced (Launcher.java:289)
[2019-04-04T04:32:23.618Z]     at org.codehaus.plexus.classworlds.launcher.Launcher.launch (Launcher.java:229)
[2019-04-04T04:32:23.618Z]     at org.codehaus.plexus.classworlds.launcher.Launcher.mainWithExitCode (Launcher.java:415)
[2019-04-04T04:32:23.618Z]     at org.codehaus.plexus.classworlds.launcher.Launcher.main (Launcher.java:356)
[2019-04-04T04:32:23.618Z] Caused by: org.apache.maven.plugin.MojoFailureException: There are test failures.
[2019-04-04T04:32:23.618Z] 
[2019-04-04T04:32:23.618Z] Please refer to /home/jenkins/jenkins-slave/workspace/ven-box_maven-surefire_1546-1222@2/surefire-its/target/failsafe-reports for the individual test results.
[2019-04-04T04:32:23.618Z] Please refer to dump files (if any exist) [date].dump, [date]-jvmRun[N].dump and [date].dumpstream.
[2019-04-04T04:32:23.618Z]     at org.apache.maven.plugin.surefire.SurefireHelper.throwException (SurefireHelper.java:271)
[2019-04-04T04:32:23.618Z]     at org.apache.maven.plugin.surefire.SurefireHelper.reportExecution (SurefireHelper.java:159)
[2019-04-04T04:32:23.618Z]     at org.apache.maven.plugin.failsafe.VerifyMojo.execute (VerifyMojo.java:192)
[2019-04-04T04:32:23.618Z]     at org.apache.maven.plugin.DefaultBuildPluginManager.executeMojo (DefaultBuildPluginManager.java:137)
[2019-04-04T04:32:23.618Z]     at org.apache.maven.lifecycle.internal.MojoExecutor.execute (MojoExecutor.java:210)
[2019-04-04T04:32:23.618Z]     at org.apache.maven.lifecycle.internal.MojoExecutor.execute (MojoExecutor.java:156)
[2019-04-04T04:32:23.618Z]     at org.apache.maven.lifecycle.internal.MojoExecutor.execute (MojoExecutor.java:148)
[2019-04-04T04:32:23.618Z]     at org.apache.maven.lifecycle.internal.LifecycleModuleBuilder.buildProject (LifecycleModuleBuilder.java:117)
[2019-04-04T04:32:23.618Z]     at org.apache.maven.lifecycle.internal.LifecycleModuleBuilder.buildProject (LifecycleModuleBuilder.java:81)
[2019-04-04T04:32:23.618Z]     at org.apache.maven.lifecycle.internal.builder.singlethreaded.SingleThreadedBuilder.build (SingleThreadedBuilder.java:56)
[2019-04-04T04:32:23.618Z]     at org.apache.maven.lifecycle.internal.LifecycleStarter.execute (LifecycleStarter.java:128)
[2019-04-04T04:32:23.618Z]     at org.apache.maven.DefaultMaven.doExecute (DefaultMaven.java:305)
[2019-04-04T04:32:23.618Z]     at org.apache.maven.DefaultMaven.doExecute (DefaultMaven.java:192)
[2019-04-04T04:32:23.618Z]     at org.apache.maven.DefaultMaven.execute (DefaultMaven.java:105)
[2019-04-04T04:32:23.618Z]     at org.apache.maven.cli.MavenCli.execute (MavenCli.java:956)
[2019-04-04T04:32:23.618Z]     at org.apache.maven.cli.MavenCli.doMain (MavenCli.java:288)
[2019-04-04T04:32:23.618Z]     at org.apache.maven.cli.MavenCli.main (MavenCli.java:192)
[2019-04-04T04:32:23.618Z]     at sun.reflect.NativeMethodAccessorImpl.invoke0 (Native Method)
[2019-04-04T04:32:23.618Z]     at sun.reflect.NativeMethodAccessorImpl.invoke (NativeMethodAccessorImpl.java:62)
[2019-04-04T04:32:23.618Z]     at sun.reflect.DelegatingMethodAccessorImpl.invoke (DelegatingMethodAccessorImpl.java:43)
[2019-04-04T04:32:23.618Z]     at java.lang.reflect.Method.invoke (Method.java:498)
[2019-04-04T04:32:23.618Z]     at org.codehaus.plexus.classworlds.launcher.Launcher.launchEnhanced (Launcher.java:289)
[2019-04-04T04:32:23.618Z]     at org.codehaus.plexus.classworlds.launcher.Launcher.launch (Launcher.java:229)
[2019-04-04T04:32:23.618Z]     at org.codehaus.plexus.classworlds.launcher.Launcher.mainWithExitCode (Launcher.java:415)
[2019-04-04T04:32:23.618Z]     at org.codehaus.plexus.classworlds.launcher.Launcher.main (Launcher.java:356)
[2019-04-04T04:32:23.618Z] [ERROR] 
[2019-04-04T04:32:23.618Z] [ERROR] Re-run Maven using the -X switch to enable full debug logging.
[2019-04-04T04:32:23.618Z] [ERROR] 
[2019-04-04T04:32:23.618Z] [ERROR] For more information about the errors and possible solutions, please read the following articles:
[2019-04-04T04:32:23.618Z] [ERROR] [Help 1] http://cwiki.apache.org/confluence/display/MAVEN/MojoFailureException
[2019-04-04T04:32:23.618Z] [ERROR] 
[2019-04-04T04:32:23.618Z] [ERROR] After correcting the problems, you can resume the build with the command
[2019-04-04T04:32:23.618Z] [ERROR]   mvn <goals> -rf :surefire-its
[Pipeline] }
[Pipeline] // withEnv
[Pipeline] }
[Pipeline] // stage
[Pipeline] openTasks
[2019-04-04T04:32:24.196Z] [TASKS] Skipping publisher since build result is FAILURE
[Pipeline] jacoco
[Pipeline] junit
[2019-04-04T04:32:24.547Z] Recording test results
[Pipeline] fileExists
[Pipeline] zip
[2019-04-04T04:32:26.280Z] Writing zip file of /home/jenkins/jenkins-slave/workspace/ven-box_maven-surefire_1546-1222@2/maven-failsafe-plugin/target/it to /home/jenkins/jenkins-slave/workspace/ven-box_maven-surefire_1546-1222@2/maven-failsafe-plugin--linux-jdk12-maven3.6.x.zip
[2019-04-04T04:32:26.475Z] Zipped 78 entries.
[2019-04-04T04:32:26.475Z] Archiving /home/jenkins/jenkins-slave/workspace/ven-box_maven-surefire_1546-1222@2/maven-failsafe-plugin--linux-jdk12-maven3.6.x.zip
[2019-04-04T04:32:26.475Z] [Fast Archiver] No prior successful build to compare, so performing full copy of artifacts
[Pipeline] fileExists
[Pipeline] zip
[2019-04-04T04:32:27.447Z] Writing zip file of /home/jenkins/jenkins-slave/workspace/ven-box_maven-surefire_1546-1222@2/surefire-its/target to /home/jenkins/jenkins-slave/workspace/ven-box_maven-surefire_1546-1222@2/surefire-its--linux-jdk12-maven3.6.x.zip
[2019-04-04T04:32:28.500Z] Zipped 1964 entries.
[2019-04-04T04:32:28.500Z] Archiving /home/jenkins/jenkins-slave/workspace/ven-box_maven-surefire_1546-1222@2/surefire-its--linux-jdk12-maven3.6.x.zip
[2019-04-04T04:32:28.500Z] [Fast Archiver] No prior successful build to compare, so performing full copy of artifacts
[Pipeline] archiveArtifacts
[2019-04-04T04:32:29.753Z] Archiving artifacts
[2019-04-04T04:32:29.911Z] [Fast Archiver] No prior successful build to compare, so performing full copy of artifacts
[Pipeline] cleanWs
[2019-04-04T04:32:30.702Z] [WS-CLEANUP] Deleting project workspace...
[2019-04-04T04:32:30.702Z] [WS-CLEANUP] Deferred wipeout is used...
[2019-04-04T04:32:32.862Z] [WS-CLEANUP] done
[Pipeline] }
[Pipeline] // ws
[Pipeline] }
[Pipeline] // timestamps
[Pipeline] }
[Pipeline] // node
[Pipeline] }
[2019-04-04T04:33:29.728Z] [ERROR] Tests run: 6, Failures: 1, Errors: 0, Skipped: 0, Time elapsed: 68.105 s <<< FAILURE! - in org.apache.maven.surefire.its.JUnitPlatformIT
[2019-04-04T04:33:29.728Z] [ERROR] testJupiterEngineWithDisplayNames(org.apache.maven.surefire.its.JUnitPlatformIT)  Time elapsed: 9.913 s  <<< FAILURE!
[2019-04-04T04:33:29.728Z] junit.framework.AssertionFailedError: Did not find expected message in log
[2019-04-04T04:33:29.728Z] 	at org.apache.maven.surefire.its.JUnitPlatformIT.testJupiterEngineWithDisplayNames(JUnitPlatformIT.java:57)
[2019-04-04T04:33:29.728Z] 
[2019-04-04T04:33:29.728Z] [INFO] 
[2019-04-04T04:33:29.728Z] [INFO] Results:
[2019-04-04T04:33:29.728Z] [INFO] 
[2019-04-04T04:33:29.728Z] [ERROR] Failures: 
[2019-04-04T04:33:29.728Z] [ERROR]   JUnitPlatformIT.testJupiterEngineWithDisplayNames:57 Did not find expected message in log
[2019-04-04T04:33:29.728Z] [INFO] 
[2019-04-04T04:33:29.728Z] [ERROR] Tests run: 6, Failures: 1, Errors: 0, Skipped: 0
[2019-04-04T04:33:29.728Z] [INFO] 
[2019-04-04T04:33:29.728Z] [INFO] 
[2019-04-04T04:33:29.728Z] [INFO] --- maven-checkstyle-plugin:3.0.0:check (checkstyle-check) @ surefire-its ---
[2019-04-04T04:33:29.728Z] [INFO] 
[2019-04-04T04:33:29.728Z] [INFO] --- maven-failsafe-plugin:3.0.0-M3:verify (default) @ surefire-its ---
[2019-04-04T04:33:29.728Z] [INFO] Failsafe report directory: /home/jenkins/jenkins-slave/workspace/ven-box_maven-surefire_1546-1222@2/surefire-its/target/failsafe-reports
[2019-04-04T04:33:29.728Z] [INFO] ------------------------------------------------------------------------
[2019-04-04T04:33:29.728Z] [INFO] Reactor Summary for Apache Maven Surefire 3.0.0-SNAPSHOT:
[2019-04-04T04:33:29.728Z] [INFO] 
[2019-04-04T04:33:29.728Z] [INFO] Apache Maven Surefire .............................. SUCCESS [ 17.712 s]
[2019-04-04T04:33:29.728Z] [INFO] SureFire Logger API ................................ SUCCESS [  3.815 s]
[2019-04-04T04:33:29.728Z] [INFO] SureFire API ....................................... SUCCESS [ 10.203 s]
[2019-04-04T04:33:29.728Z] [INFO] SureFire Booter .................................... SUCCESS [  9.902 s]
[2019-04-04T04:33:29.728Z] [INFO] Maven Surefire Test-Grouping Support ............... SUCCESS [  4.586 s]
[2019-04-04T04:33:29.728Z] [INFO] SureFire Providers ................................. SUCCESS [  0.801 s]
[2019-04-04T04:33:29.728Z] [INFO] Shared JUnit3 Provider Code ........................ SUCCESS [  2.920 s]
[2019-04-04T04:33:29.728Z] [INFO] Shared Java 5 Provider Base ........................ SUCCESS [  3.655 s]
[2019-04-04T04:33:29.728Z] [INFO] Shared JUnit4 Provider Code ........................ SUCCESS [  3.759 s]
[2019-04-04T04:33:29.728Z] [INFO] Shared JUnit48 Provider Code ....................... SUCCESS [  4.412 s]
[2019-04-04T04:33:29.728Z] [INFO] SureFire JUnit Runner .............................. SUCCESS [  3.340 s]
[2019-04-04T04:33:29.728Z] [INFO] SureFire JUnit4 Runner ............................. SUCCESS [  3.272 s]
[2019-04-04T04:33:29.728Z] [INFO] Maven Surefire Common .............................. SUCCESS [ 26.335 s]
[2019-04-04T04:33:29.728Z] [INFO] SureFire JUnitCore Runner .......................... SUCCESS [02:23 min]
[2019-04-04T04:33:29.728Z] [INFO] SureFire JUnit Platform Runner ..................... SUCCESS [ 16.084 s]
[2019-04-04T04:33:29.728Z] [INFO] SureFire TestNG Utils .............................. SUCCESS [  7.445 s]
[2019-04-04T04:33:29.728Z] [INFO] SureFire TestNG Runner ............................. SUCCESS [  8.851 s]
[2019-04-04T04:33:29.728Z] [INFO] ShadeFire JUnit3 Provider .......................... SUCCESS [  2.425 s]
[2019-04-04T04:33:29.728Z] [INFO] Surefire Report Parser ............................. SUCCESS [ 10.771 s]
[2019-04-04T04:33:29.728Z] [INFO] Maven Surefire Plugin .............................. SUCCESS [ 14.381 s]
[2019-04-04T04:33:29.728Z] [INFO] Maven Failsafe Plugin .............................. SUCCESS [02:08 min]
[2019-04-04T04:33:29.728Z] [INFO] Maven Surefire Report Plugin ....................... SUCCESS [ 24.912 s]
[2019-04-04T04:33:29.729Z] [INFO] Maven Surefire Integration Tests ................... FAILURE [01:28 min]
[2019-04-04T04:33:29.729Z] [INFO] ------------------------------------------------------------------------
[2019-04-04T04:33:29.729Z] [INFO] BUILD FAILURE
[2019-04-04T04:33:29.729Z] [INFO] ------------------------------------------------------------------------
[2019-04-04T04:33:29.729Z] [INFO] Total time:  09:01 min
[2019-04-04T04:33:29.729Z] [INFO] Finished at: 2019-04-04T04:33:27Z
[2019-04-04T04:33:29.729Z] [INFO] ------------------------------------------------------------------------
[2019-04-04T04:33:29.729Z] [ERROR] Failed to execute goal org.apache.maven.plugins:maven-failsafe-plugin:3.0.0-M3:verify (default) on project surefire-its: There are test failures.
[2019-04-04T04:33:29.729Z] [ERROR] 
[2019-04-04T04:33:29.729Z] [ERROR] Please refer to /home/jenkins/jenkins-slave/workspace/ven-box_maven-surefire_1546-1222@2/surefire-its/target/failsafe-reports for the individual test results.
[2019-04-04T04:33:29.729Z] [ERROR] Please refer to dump files (if any exist) [date].dump, [date]-jvmRun[N].dump and [date].dumpstream.
[2019-04-04T04:33:29.729Z] [ERROR] -> [Help 1]
[2019-04-04T04:33:29.729Z] org.apache.maven.lifecycle.LifecycleExecutionException: Failed to execute goal org.apache.maven.plugins:maven-failsafe-plugin:3.0.0-M3:verify (default) on project surefire-its: There are test failures.
[2019-04-04T04:33:29.729Z] 
[2019-04-04T04:33:29.729Z] Please refer to /home/jenkins/jenkins-slave/workspace/ven-box_maven-surefire_1546-1222@2/surefire-its/target/failsafe-reports for the individual test results.
[2019-04-04T04:33:29.729Z] Please refer to dump files (if any exist) [date].dump, [date]-jvmRun[N].dump and [date].dumpstream.
[2019-04-04T04:33:29.729Z]     at org.apache.maven.lifecycle.internal.MojoExecutor.execute (MojoExecutor.java:215)
[2019-04-04T04:33:29.729Z]     at org.apache.maven.lifecycle.internal.MojoExecutor.execute (MojoExecutor.java:156)
[2019-04-04T04:33:29.729Z]     at org.apache.maven.lifecycle.internal.MojoExecutor.execute (MojoExecutor.java:148)
[2019-04-04T04:33:29.729Z]     at org.apache.maven.lifecycle.internal.LifecycleModuleBuilder.buildProject (LifecycleModuleBuilder.java:117)
[2019-04-04T04:33:29.729Z]     at org.apache.maven.lifecycle.internal.LifecycleModuleBuilder.buildProject (LifecycleModuleBuilder.java:81)
[2019-04-04T04:33:29.729Z]     at org.apache.maven.lifecycle.internal.builder.singlethreaded.SingleThreadedBuilder.build (SingleThreadedBuilder.java:56)
[2019-04-04T04:33:29.729Z]     at org.apache.maven.lifecycle.internal.LifecycleStarter.execute (LifecycleStarter.java:128)
[2019-04-04T04:33:29.729Z]     at org.apache.maven.DefaultMaven.doExecute (DefaultMaven.java:305)
[2019-04-04T04:33:29.729Z]     at org.apache.maven.DefaultMaven.doExecute (DefaultMaven.java:192)
[2019-04-04T04:33:29.729Z]     at org.apache.maven.DefaultMaven.execute (DefaultMaven.java:105)
[2019-04-04T04:33:29.729Z]     at org.apache.maven.cli.MavenCli.execute (MavenCli.java:956)
[2019-04-04T04:33:29.729Z]     at org.apache.maven.cli.MavenCli.doMain (MavenCli.java:288)
[2019-04-04T04:33:29.729Z]     at org.apache.maven.cli.MavenCli.main (MavenCli.java:192)
[2019-04-04T04:33:29.729Z]     at sun.reflect.NativeMethodAccessorImpl.invoke0 (Native Method)
[2019-04-04T04:33:29.729Z]     at sun.reflect.NativeMethodAccessorImpl.invoke (NativeMethodAccessorImpl.java:62)
[2019-04-04T04:33:29.729Z]     at sun.reflect.DelegatingMethodAccessorImpl.invoke (DelegatingMethodAccessorImpl.java:43)
[2019-04-04T04:33:29.729Z]     at java.lang.reflect.Method.invoke (Method.java:498)
[2019-04-04T04:33:29.729Z]     at org.codehaus.plexus.classworlds.launcher.Launcher.launchEnhanced (Launcher.java:289)
[2019-04-04T04:33:29.729Z]     at org.codehaus.plexus.classworlds.launcher.Launcher.launch (Launcher.java:229)
[2019-04-04T04:33:29.729Z]     at org.codehaus.plexus.classworlds.launcher.Launcher.mainWithExitCode (Launcher.java:415)
[2019-04-04T04:33:29.729Z]     at org.codehaus.plexus.classworlds.launcher.Launcher.main (Launcher.java:356)
[2019-04-04T04:33:29.729Z] Caused by: org.apache.maven.plugin.MojoFailureException: There are test failures.
[2019-04-04T04:33:29.729Z] 
[2019-04-04T04:33:29.729Z] Please refer to /home/jenkins/jenkins-slave/workspace/ven-box_maven-surefire_1546-1222@2/surefire-its/target/failsafe-reports for the individual test results.
[2019-04-04T04:33:29.729Z] Please refer to dump files (if any exist) [date].dump, [date]-jvmRun[N].dump and [date].dumpstream.
[2019-04-04T04:33:29.729Z]     at org.apache.maven.plugin.surefire.SurefireHelper.throwException (SurefireHelper.java:271)
[2019-04-04T04:33:29.729Z]     at org.apache.maven.plugin.surefire.SurefireHelper.reportExecution (SurefireHelper.java:159)
[2019-04-04T04:33:29.729Z]     at org.apache.maven.plugin.failsafe.VerifyMojo.execute (VerifyMojo.java:192)
[2019-04-04T04:33:29.729Z]     at org.apache.maven.plugin.DefaultBuildPluginManager.executeMojo (DefaultBuildPluginManager.java:137)
[2019-04-04T04:33:29.729Z]     at org.apache.maven.lifecycle.internal.MojoExecutor.execute (MojoExecutor.java:210)
[2019-04-04T04:33:29.729Z]     at org.apache.maven.lifecycle.internal.MojoExecutor.execute (MojoExecutor.java:156)
[2019-04-04T04:33:29.729Z]     at org.apache.maven.lifecycle.internal.MojoExecutor.execute (MojoExecutor.java:148)
[2019-04-04T04:33:29.729Z]     at org.apache.maven.lifecycle.internal.LifecycleModuleBuilder.buildProject (LifecycleModuleBuilder.java:117)
[2019-04-04T04:33:29.729Z]     at org.apache.maven.lifecycle.internal.LifecycleModuleBuilder.buildProject (LifecycleModuleBuilder.java:81)
[2019-04-04T04:33:29.729Z]     at org.apache.maven.lifecycle.internal.builder.singlethreaded.SingleThreadedBuilder.build (SingleThreadedBuilder.java:56)
[2019-04-04T04:33:29.729Z]     at org.apache.maven.lifecycle.internal.LifecycleStarter.execute (LifecycleStarter.java:128)
[2019-04-04T04:33:29.729Z]     at org.apache.maven.DefaultMaven.doExecute (DefaultMaven.java:305)
[2019-04-04T04:33:29.729Z]     at org.apache.maven.DefaultMaven.doExecute (DefaultMaven.java:192)
[2019-04-04T04:33:29.729Z]     at org.apache.maven.DefaultMaven.execute (DefaultMaven.java:105)
[2019-04-04T04:33:29.729Z]     at org.apache.maven.cli.MavenCli.execute (MavenCli.java:956)
[2019-04-04T04:33:29.729Z]     at org.apache.maven.cli.MavenCli.doMain (MavenCli.java:288)
[2019-04-04T04:33:29.729Z]     at org.apache.maven.cli.MavenCli.main (MavenCli.java:192)
[2019-04-04T04:33:29.729Z]     at sun.reflect.NativeMethodAccessorImpl.invoke0 (Native Method)
[2019-04-04T04:33:29.729Z]     at sun.reflect.NativeMethodAccessorImpl.invoke (NativeMethodAccessorImpl.java:62)
[2019-04-04T04:33:29.729Z]     at sun.reflect.DelegatingMethodAccessorImpl.invoke (DelegatingMethodAccessorImpl.java:43)
[2019-04-04T04:33:29.729Z]     at java.lang.reflect.Method.invoke (Method.java:498)
[2019-04-04T04:33:29.729Z]     at org.codehaus.plexus.classworlds.launcher.Launcher.launchEnhanced (Launcher.java:289)
[2019-04-04T04:33:29.729Z]     at org.codehaus.plexus.classworlds.launcher.Launcher.launch (Launcher.java:229)
[2019-04-04T04:33:29.729Z]     at org.codehaus.plexus.classworlds.launcher.Launcher.mainWithExitCode (Launcher.java:415)
[2019-04-04T04:33:29.729Z]     at org.codehaus.plexus.classworlds.launcher.Launcher.main (Launcher.java:356)
[2019-04-04T04:33:29.729Z] [ERROR] 
[2019-04-04T04:33:29.729Z] [ERROR] Re-run Maven using the -X switch to enable full debug logging.
[2019-04-04T04:33:29.730Z] [ERROR] 
[2019-04-04T04:33:29.730Z] [ERROR] For more information about the errors and possible solutions, please read the following articles:
[2019-04-04T04:33:29.730Z] [ERROR] [Help 1] http://cwiki.apache.org/confluence/display/MAVEN/MojoFailureException
[2019-04-04T04:33:29.730Z] [ERROR] 
[2019-04-04T04:33:29.730Z] [ERROR] After correcting the problems, you can resume the build with the command
[2019-04-04T04:33:29.730Z] [ERROR]   mvn <goals> -rf :surefire-its
[Pipeline] }
[Pipeline] // withEnv
[Pipeline] }
[Pipeline] // stage
[Pipeline] fileExists
[Pipeline] zip
[2019-04-04T04:33:30.771Z] Writing zip file of /home/jenkins/jenkins-slave/workspace/ven-box_maven-surefire_1546-1222@2/maven-failsafe-plugin/target/it to /home/jenkins/jenkins-slave/workspace/ven-box_maven-surefire_1546-1222@2/maven-failsafe-plugin--linux-jdk11-maven3.6.x.zip
[2019-04-04T04:33:30.972Z] Zipped 79 entries.
[2019-04-04T04:33:30.972Z] Archiving /home/jenkins/jenkins-slave/workspace/ven-box_maven-surefire_1546-1222@2/maven-failsafe-plugin--linux-jdk11-maven3.6.x.zip
[2019-04-04T04:33:30.972Z] [Fast Archiver] No prior successful build to compare, so performing full copy of artifacts
[Pipeline] fileExists
[Pipeline] zip
[2019-04-04T04:33:31.942Z] Writing zip file of /home/jenkins/jenkins-slave/workspace/ven-box_maven-surefire_1546-1222@2/surefire-its/target to /home/jenkins/jenkins-slave/workspace/ven-box_maven-surefire_1546-1222@2/surefire-its--linux-jdk11-maven3.6.x.zip
[2019-04-04T04:33:32.884Z] Zipped 1964 entries.
[2019-04-04T04:33:32.884Z] Archiving /home/jenkins/jenkins-slave/workspace/ven-box_maven-surefire_1546-1222@2/surefire-its--linux-jdk11-maven3.6.x.zip
[2019-04-04T04:33:32.884Z] [Fast Archiver] No prior successful build to compare, so performing full copy of artifacts
[Pipeline] archiveArtifacts
[2019-04-04T04:33:34.050Z] Archiving artifacts
[2019-04-04T04:33:34.207Z] [Fast Archiver] No prior successful build to compare, so performing full copy of artifacts
[Pipeline] cleanWs
[2019-04-04T04:33:35.100Z] [WS-CLEANUP] Deleting project workspace...
[2019-04-04T04:33:35.100Z] [WS-CLEANUP] Deferred wipeout is used...
[2019-04-04T04:33:35.423Z] [WS-CLEANUP] done
[Pipeline] }
[Pipeline] // ws
[Pipeline] }
[Pipeline] // timestamps
[Pipeline] }
[Pipeline] // node
[Pipeline] }
[Pipeline] // parallel
[Pipeline] echo
Build result: FAILURE
[Pipeline] jiraIssueSelector
[Pipeline] emailext

Build succeeded in Jenkins: Maven TLP » maven-surefire » 1546-1222 #9

Posted by Apache Jenkins Server <je...@builds.apache.org>.
See https://builds.apache.org/job/maven-box/job/maven-surefire/job/1546-1222/9/

Changes:

* Shorten wsDir
* Fix groovy script
* rewrite groovy statement
* Keep original stageId
* Reduce stageDir
* build fix
* build fix
* build fix
* build fix

All tests passed