You are viewing a plain text version of this content. The canonical link for it is here.
Posted to dev@pig.apache.org by Apache Jenkins Server <je...@builds.apache.org> on 2015/08/12 18:48:19 UTC

Build failed in Jenkins: Pig-trunk-commit #2223

See <https://builds.apache.org/job/Pig-trunk-commit/2223/changes>

Changes:

[rohini] Fix double application of patch and code duplication in PIG-4651

[rohini] PIG-4651: Optimize NullablePartitionWritable serialization for skewed join (rohini)

[rohini] PIG-4627: [Pig on Tez] Self join does not handle null values correctly (rohini)

------------------------------------------
[...truncated 4414 lines...]
    [junit] Tests run: 3, Failures: 0, Errors: 0, Skipped: 0, Time elapsed: 36.902 sec
    [junit] Running org.apache.pig.test.TestNewPlanListener
    [junit] Tests run: 4, Failures: 0, Errors: 0, Skipped: 0, Time elapsed: 0.369 sec
    [junit] Running org.apache.pig.test.TestNewPlanLogToPhyTranslationVisitor
    [junit] Tests run: 27, Failures: 0, Errors: 0, Skipped: 0, Time elapsed: 4.921 sec
    [junit] Running org.apache.pig.test.TestNewPlanLogicalOptimizer
    [junit] Tests run: 1, Failures: 0, Errors: 0, Skipped: 0, Time elapsed: 1.396 sec
    [junit] Running org.apache.pig.test.TestNewPlanOperatorPlan
    [junit] Tests run: 47, Failures: 0, Errors: 0, Skipped: 0, Time elapsed: 4.099 sec
    [junit] Running org.apache.pig.test.TestNewPlanPruneMapKeys
    [junit] Tests run: 8, Failures: 0, Errors: 0, Skipped: 0, Time elapsed: 3.092 sec
    [junit] Running org.apache.pig.test.TestNewPlanPushDownForeachFlatten
    [junit] Tests run: 45, Failures: 0, Errors: 0, Skipped: 0, Time elapsed: 7.585 sec
    [junit] Running org.apache.pig.test.TestNewPlanPushUpFilter
    [junit] Tests run: 46, Failures: 0, Errors: 0, Skipped: 0, Time elapsed: 7.848 sec
    [junit] Running org.apache.pig.test.TestNewPlanRule
    [junit] Tests run: 4, Failures: 0, Errors: 0, Skipped: 0, Time elapsed: 0.42 sec
    [junit] Running org.apache.pig.test.TestNotEqualTo
    [junit] Tests run: 28, Failures: 0, Errors: 0, Skipped: 0, Time elapsed: 0.46 sec
    [junit] Running org.apache.pig.test.TestNull
    [junit] Tests run: 2, Failures: 0, Errors: 0, Skipped: 0, Time elapsed: 0.476 sec
    [junit] Running org.apache.pig.test.TestNullConstant
    [junit] Tests run: 8, Failures: 0, Errors: 0, Skipped: 0, Time elapsed: 23.146 sec
    [junit] Running org.apache.pig.test.TestNumberOfReducers
    [junit] Tests run: 10, Failures: 0, Errors: 0, Skipped: 0, Time elapsed: 527.615 sec
    [junit] Running org.apache.pig.test.TestOptimizeLimit
    [junit] Tests run: 12, Failures: 0, Errors: 0, Skipped: 0, Time elapsed: 4.102 sec
    [junit] Running org.apache.pig.test.TestOrderBy3
    [junit] Tests run: 4, Failures: 0, Errors: 0, Skipped: 0, Time elapsed: 13.336 sec
    [junit] Running org.apache.pig.test.TestPOBinCond
    [junit] Tests run: 10, Failures: 0, Errors: 0, Skipped: 0, Time elapsed: 0.455 sec
    [junit] Running org.apache.pig.test.TestPOCast
    [junit] Tests run: 14, Failures: 0, Errors: 0, Skipped: 0, Time elapsed: 0.892 sec
    [junit] Running org.apache.pig.test.TestPODistinct
    [junit] Tests run: 6, Failures: 0, Errors: 0, Skipped: 0, Time elapsed: 0.395 sec
    [junit] Running org.apache.pig.test.TestPOGenerate
    [junit] Tests run: 3, Failures: 0, Errors: 0, Skipped: 0, Time elapsed: 0.377 sec
    [junit] Running org.apache.pig.test.TestPOMapLookUp
    [junit] Tests run: 1, Failures: 0, Errors: 0, Skipped: 0, Time elapsed: 0.361 sec
    [junit] Running org.apache.pig.test.TestPONegative
    [junit] Tests run: 9, Failures: 0, Errors: 0, Skipped: 0, Time elapsed: 6.116 sec
    [junit] Running org.apache.pig.test.TestPOPartialAgg
    [junit] Tests run: 16, Failures: 0, Errors: 0, Skipped: 0, Time elapsed: 3.861 sec
    [junit] Running org.apache.pig.test.TestPOPartialAggPlan
    [junit] Tests run: 1, Failures: 0, Errors: 0, Skipped: 1, Time elapsed: 0.247 sec
    [junit] Running org.apache.pig.test.TestPORegexp
    [junit] Tests run: 2, Failures: 0, Errors: 0, Skipped: 0, Time elapsed: 0.376 sec
    [junit] Running org.apache.pig.test.TestPOSort
    [junit] Tests run: 14, Failures: 0, Errors: 0, Skipped: 0, Time elapsed: 0.45 sec
    [junit] Running org.apache.pig.test.TestPOSplit
    [junit] Tests run: 1, Failures: 0, Errors: 0, Skipped: 0, Time elapsed: 0.369 sec
    [junit] Running org.apache.pig.test.TestPOUserFunc
    [junit] Tests run: 6, Failures: 0, Errors: 0, Skipped: 0, Time elapsed: 0.45 sec
    [junit] Running org.apache.pig.test.TestPackage
    [junit] Tests run: 1, Failures: 0, Errors: 0, Skipped: 0, Time elapsed: 8.459 sec
    [junit] Running org.apache.pig.test.TestParamSubPreproc
    [junit] Tests run: 36, Failures: 0, Errors: 0, Skipped: 0, Time elapsed: 4.463 sec
    [junit] Running org.apache.pig.test.TestParser
    [junit] Tests run: 4, Failures: 0, Errors: 0, Skipped: 0, Time elapsed: 4.988 sec
    [junit] Running org.apache.pig.test.TestPhyOp
    [junit] Tests run: 1, Failures: 0, Errors: 0, Skipped: 0, Time elapsed: 0.477 sec
    [junit] Running org.apache.pig.test.TestPhyPatternMatch
    [junit] Tests run: 4, Failures: 0, Errors: 0, Skipped: 0, Time elapsed: 0.424 sec
    [junit] Running org.apache.pig.test.TestPigContext
    [junit] Tests run: 6, Failures: 0, Errors: 0, Skipped: 0, Time elapsed: 61.976 sec
    [junit] Running org.apache.pig.test.TestPigContextClassCache
    [junit] Tests run: 1, Failures: 0, Errors: 0, Skipped: 0, Time elapsed: 0.346 sec
    [junit] Running org.apache.pig.test.TestPigException
    [junit] Tests run: 2, Failures: 0, Errors: 0, Skipped: 0, Time elapsed: 0.254 sec
    [junit] Running org.apache.pig.test.TestPigProgressReporting
    [junit] Tests run: 1, Failures: 0, Errors: 0, Skipped: 0, Time elapsed: 59.471 sec
    [junit] Running org.apache.pig.test.TestPigRunner
    [junit] Tests run: 30, Failures: 0, Errors: 0, Skipped: 1, Time elapsed: 207.603 sec
    [junit] Running org.apache.pig.test.TestPigScriptParser
    [junit] Tests run: 4, Failures: 0, Errors: 0, Skipped: 0, Time elapsed: 4.6 sec
    [junit] Running org.apache.pig.test.TestPigServer
    [junit] Tests run: 31, Failures: 0, Errors: 0, Skipped: 0, Time elapsed: 73.258 sec
    [junit] Running org.apache.pig.test.TestPigServerLocal
    [junit] Tests run: 7, Failures: 1, Errors: 0, Skipped: 0, Time elapsed: 31.779 sec
    [junit] Test org.apache.pig.test.TestPigServerLocal FAILED
    [junit] Running org.apache.pig.test.TestPigServerWithMacros
    [junit] Tests run: 2, Failures: 0, Errors: 0, Skipped: 0, Time elapsed: 8.886 sec
    [junit] Running org.apache.pig.test.TestPigServerWithMacrosRemote
    [junit] Tests run: 1, Failures: 0, Errors: 0, Skipped: 0, Time elapsed: 30.897 sec
    [junit] Running org.apache.pig.test.TestPigSplit
    [junit] Tests run: 3, Failures: 0, Errors: 1, Skipped: 0, Time elapsed: 66.62 sec
    [junit] Test org.apache.pig.test.TestPigSplit FAILED
    [junit] Running org.apache.pig.test.TestPigStats
    [junit] Tests run: 1, Failures: 0, Errors: 0, Skipped: 1, Time elapsed: 0.234 sec
    [junit] Running org.apache.pig.test.TestPigStorage
    [junit] Tests run: 20, Failures: 0, Errors: 0, Skipped: 0, Time elapsed: 67.196 sec
    [junit] Running org.apache.pig.test.TestPigStreaming
    [junit] Tests run: 13, Failures: 0, Errors: 0, Skipped: 0, Time elapsed: 0.361 sec
    [junit] Running org.apache.pig.test.TestPigTupleRawComparator
    [junit] Tests run: 16, Failures: 0, Errors: 0, Skipped: 0, Time elapsed: 1.611 sec
    [junit] Running org.apache.pig.test.TestPinOptions
    [junit] Tests run: 3, Failures: 0, Errors: 0, Skipped: 0, Time elapsed: 3.105 sec
    [junit] Running org.apache.pig.test.TestPlanGeneration
    [junit] Tests run: 10, Failures: 0, Errors: 0, Skipped: 0, Time elapsed: 2.952 sec
    [junit] Running org.apache.pig.test.TestPoissonSampleLoader
    [junit] Tests run: 1, Failures: 0, Errors: 0, Skipped: 0, Time elapsed: 6.029 sec
    [junit] Running org.apache.pig.test.TestPredeployedJar
    [junit] Tests run: 2, Failures: 0, Errors: 0, Skipped: 0, Time elapsed: 38.756 sec
    [junit] Running org.apache.pig.test.TestProject
    [junit] Tests run: 12, Failures: 0, Errors: 0, Skipped: 0, Time elapsed: 13.019 sec
    [junit] Running org.apache.pig.test.TestProjectRange
    [junit] Tests run: 23, Failures: 0, Errors: 0, Skipped: 0, Time elapsed: 103.035 sec
    [junit] Running org.apache.pig.test.TestProjectStarExpander
    [junit] Tests run: 2, Failures: 0, Errors: 0, Skipped: 0, Time elapsed: 8.473 sec
    [junit] Running org.apache.pig.test.TestProjectStarRangeInUdf
    [junit] Tests run: 15, Failures: 0, Errors: 0, Skipped: 0, Time elapsed: 10.104 sec
    [junit] Running org.apache.pig.test.TestPruneColumn
    [junit] Tests run: 71, Failures: 0, Errors: 0, Skipped: 0, Time elapsed: 164.852 sec
    [junit] Running org.apache.pig.test.TestRank1
    [junit] Tests run: 9, Failures: 0, Errors: 0, Skipped: 0, Time elapsed: 26.445 sec
    [junit] Running org.apache.pig.test.TestRank2
    [junit] Tests run: 4, Failures: 0, Errors: 0, Skipped: 0, Time elapsed: 15.529 sec
    [junit] Running org.apache.pig.test.TestRank3
    [junit] Tests run: 4, Failures: 0, Errors: 0, Skipped: 0, Time elapsed: 20.142 sec
    [junit] Running org.apache.pig.test.TestReadToEndLoader
    [junit] Tests run: 1, Failures: 0, Errors: 0, Skipped: 0, Time elapsed: 1.222 sec
    [junit] Running org.apache.pig.test.TestRegexp
    [junit] Tests run: 2, Failures: 0, Errors: 0, Skipped: 0, Time elapsed: 0.367 sec
    [junit] Running org.apache.pig.test.TestRegisteredJarVisibility
    [junit] Tests run: 4, Failures: 0, Errors: 0, Skipped: 0, Time elapsed: 30.398 sec
    [junit] Running org.apache.pig.test.TestRelationToExprProject
    [junit] Tests run: 5, Failures: 0, Errors: 0, Skipped: 0, Time elapsed: 16.137 sec
    [junit] Running org.apache.pig.test.TestResourceSchema
    [junit] Tests run: 9, Failures: 0, Errors: 0, Skipped: 0, Time elapsed: 0.779 sec
    [junit] Running org.apache.pig.test.TestRollupDimensions
    [junit] Tests run: 1, Failures: 0, Errors: 0, Skipped: 0, Time elapsed: 0.379 sec
    [junit] Running org.apache.pig.test.TestSample
    [junit] Tests run: 7, Failures: 0, Errors: 0, Skipped: 0, Time elapsed: 46.809 sec
    [junit] Running org.apache.pig.test.TestSampleOptimizer
    [junit] Tests run: 5, Failures: 0, Errors: 0, Skipped: 0, Time elapsed: 107.353 sec
    [junit] Running org.apache.pig.test.TestScalarAliases
    [junit] Tests run: 2, Failures: 0, Errors: 0, Skipped: 0, Time elapsed: 42.768 sec
    [junit] Running org.apache.pig.test.TestScalarAliasesLocal
    [junit] Tests run: 12, Failures: 0, Errors: 0, Skipped: 0, Time elapsed: 69.645 sec
    [junit] Running org.apache.pig.test.TestSchema
    [junit] Tests run: 31, Failures: 0, Errors: 0, Skipped: 0, Time elapsed: 52.123 sec
    [junit] Running org.apache.pig.test.TestSchemaUtil
    [junit] Tests run: 2, Failures: 0, Errors: 0, Skipped: 0, Time elapsed: 0.346 sec
    [junit] Running org.apache.pig.test.TestScriptLanguage
    [junit] Tests run: 19, Failures: 0, Errors: 0, Skipped: 1, Time elapsed: 301.311 sec
    [junit] Running org.apache.pig.test.TestScriptLanguageJavaScript
    [junit] Tests run: 2, Failures: 0, Errors: 0, Skipped: 0, Time elapsed: 100.209 sec
    [junit] Running org.apache.pig.test.TestScriptUDF
    [junit] Tests run: 6, Failures: 0, Errors: 0, Skipped: 0, Time elapsed: 248.855 sec
    [junit] Running org.apache.pig.test.TestScriptingLanguagePython
    [junit] Tests run: 1, Failures: 0, Errors: 0, Skipped: 0, Time elapsed: 35.224 sec
    [junit] Running org.apache.pig.test.TestSecondarySort
    [junit] Tests run: 1, Failures: 0, Errors: 0, Skipped: 1, Time elapsed: 0.244 sec
    [junit] Running org.apache.pig.test.TestShortcuts
    [junit] Tests run: 19, Failures: 0, Errors: 0, Skipped: 0, Time elapsed: 9.344 sec
    [junit] Running org.apache.pig.test.TestSkewedJoin
    [junit] Tests run: 14, Failures: 0, Errors: 0, Skipped: 0, Time elapsed: 150.688 sec
    [junit] Running org.apache.pig.test.TestSplit
    [junit] Tests run: 4, Failures: 0, Errors: 0, Skipped: 0, Time elapsed: 12.972 sec
    [junit] Running org.apache.pig.test.TestSplitCombine
    [junit] Tests run: 11, Failures: 0, Errors: 0, Skipped: 0, Time elapsed: 1.301 sec
    [junit] Running org.apache.pig.test.TestSplitIndex
    [junit] Tests run: 2, Failures: 0, Errors: 0, Skipped: 0, Time elapsed: 7.994 sec
    [junit] Running org.apache.pig.test.TestSplitStore
    [junit] Tests run: 9, Failures: 0, Errors: 0, Skipped: 0, Time elapsed: 113.896 sec
    [junit] Running org.apache.pig.test.TestStore
    [junit] Tests run: 18, Failures: 0, Errors: 0, Skipped: 0, Time elapsed: 146.814 sec
    [junit] Running org.apache.pig.test.TestStoreBase
    [junit] Tests run: 1, Failures: 0, Errors: 0, Skipped: 1, Time elapsed: 0.252 sec
    [junit] Running org.apache.pig.test.TestStoreInstances
    [junit] Tests run: 1, Failures: 0, Errors: 0, Skipped: 0, Time elapsed: 70.555 sec
    [junit] Running org.apache.pig.test.TestStoreLocal
    [junit] Tests run: 6, Failures: 0, Errors: 0, Skipped: 0, Time elapsed: 31.071 sec
    [junit] Running org.apache.pig.test.TestStoreOld
    [junit] Tests run: 3, Failures: 0, Errors: 0, Skipped: 0, Time elapsed: 49.053 sec
    [junit] Running org.apache.pig.test.TestStreaming
    [junit] Tests run: 15, Failures: 0, Errors: 0, Skipped: 0, Time elapsed: 332.361 sec
    [junit] Running org.apache.pig.test.TestStreamingLocal
    [junit] Tests run: 7, Failures: 0, Errors: 0, Skipped: 0, Time elapsed: 31.108 sec
    [junit] Running org.apache.pig.test.TestStringUDFs
    [junit] Tests run: 17, Failures: 0, Errors: 0, Skipped: 0, Time elapsed: 0.298 sec
    [junit] Running org.apache.pig.test.TestSubtract
    [junit] Tests run: 1, Failures: 0, Errors: 0, Skipped: 0, Time elapsed: 0.446 sec
    [junit] Running org.apache.pig.test.TestTextDataParser
    [junit] Tests run: 15, Failures: 0, Errors: 0, Skipped: 0, Time elapsed: 0.847 sec
    [junit] Running org.apache.pig.test.TestTmpFileCompression
    [junit] Tests run: 8, Failures: 0, Errors: 0, Skipped: 0, Time elapsed: 318.135 sec
    [junit] Running org.apache.pig.test.TestToolsPigServer
    [junit] Tests run: 2, Failures: 0, Errors: 0, Skipped: 0, Time elapsed: 68.975 sec
    [junit] Running org.apache.pig.test.TestTuple
    [junit] Tests run: 12, Failures: 0, Errors: 0, Skipped: 0, Time elapsed: 0.613 sec
    [junit] Running org.apache.pig.test.TestTypeCheckingValidatorNewLP
    [junit] Tests run: 141, Failures: 1, Errors: 0, Skipped: 0, Time elapsed: 21.739 sec
    [junit] Test org.apache.pig.test.TestTypeCheckingValidatorNewLP FAILED
    [junit] Running org.apache.pig.test.TestTypedMap
    [junit] Tests run: 8, Failures: 0, Errors: 0, Skipped: 0, Time elapsed: 24.537 sec
    [junit] Running org.apache.pig.test.TestUDF
    [junit] Tests run: 10, Failures: 0, Errors: 0, Skipped: 0, Time elapsed: 79.309 sec
    [junit] Running org.apache.pig.test.TestUDFContext
    [junit] Tests run: 2, Failures: 0, Errors: 0, Skipped: 0, Time elapsed: 6.095 sec
    [junit] Running org.apache.pig.test.TestUDFGroovy
    [junit] Tests run: 7, Failures: 0, Errors: 0, Skipped: 0, Time elapsed: 16.316 sec
    [junit] Running org.apache.pig.test.TestUDFWithoutParameter
    [junit] Tests run: 1, Failures: 0, Errors: 0, Skipped: 0, Time elapsed: 6.001 sec
    [junit] Running org.apache.pig.test.TestUTF8
    [junit] Tests run: 4, Failures: 0, Errors: 0, Skipped: 0, Time elapsed: 8.378 sec
    [junit] Running org.apache.pig.test.TestUnion
    [junit] Tests run: 7, Failures: 0, Errors: 0, Skipped: 0, Time elapsed: 19.827 sec
    [junit] Running org.apache.pig.test.TestUnionOnSchema
    [junit] Tests run: 22, Failures: 0, Errors: 0, Skipped: 0, Time elapsed: 53.904 sec
    [junit] Running org.apache.pig.test.pigunit.TestPigTest
    [junit] Tests run: 22, Failures: 0, Errors: 0, Skipped: 1, Time elapsed: 51.678 sec
    [junit] Running org.apache.pig.test.pigunit.pig.TestGruntParser
    [junit] Tests run: 5, Failures: 0, Errors: 0, Skipped: 0, Time elapsed: 1.77 sec
    [junit] Running org.apache.pig.tez.TestGroupConstParallelTez
    [junit] Tests run: 3, Failures: 0, Errors: 0, Skipped: 0, Time elapsed: 54.12 sec
    [junit] Running org.apache.pig.tez.TestJobSubmissionTez
    [junit] Tests run: 7, Failures: 0, Errors: 0, Skipped: 2, Time elapsed: 24.69 sec
    [junit] Running org.apache.pig.tez.TestLoaderStorerShipCacheFilesTez
    [junit] Tests run: 4, Failures: 0, Errors: 0, Skipped: 0, Time elapsed: 2.821 sec
    [junit] Running org.apache.pig.tez.TestPOPartialAggPlanTez
    [junit] Tests run: 5, Failures: 0, Errors: 0, Skipped: 0, Time elapsed: 2.983 sec
    [junit] Running org.apache.pig.tez.TestPigStatsTez
    [junit] Tests run: 5, Failures: 0, Errors: 0, Skipped: 0, Time elapsed: 8.43 sec
    [junit] Running org.apache.pig.tez.TestSecondarySortTez
    [junit] Tests run: 18, Failures: 0, Errors: 0, Skipped: 0, Time elapsed: 129.994 sec
    [junit] Running org.apache.pig.tez.TestTezAutoParallelism
    [junit] Tests run: 10, Failures: 0, Errors: 0, Skipped: 0, Time elapsed: 272.572 sec
    [junit] Running org.apache.pig.tez.TestTezCompiler
    [junit] Tests run: 46, Failures: 0, Errors: 0, Skipped: 0, Time elapsed: 13.97 sec
    [junit] Running org.apache.pig.tez.TestTezGraceParallelism
    [junit] Tests run: 4, Failures: 1, Errors: 0, Skipped: 0, Time elapsed: 33.378 sec
    [junit] Test org.apache.pig.tez.TestTezGraceParallelism FAILED
    [junit] Running org.apache.pig.tez.TestTezJobControlCompiler
    [junit] Tests run: 8, Failures: 0, Errors: 0, Skipped: 0, Time elapsed: 5.506 sec
    [junit] Running org.apache.pig.tez.TestTezLauncher
    [junit] Tests run: 2, Failures: 0, Errors: 0, Skipped: 0, Time elapsed: 57.926 sec
    [junit] Running org.apache.pig.tools.grunt.TestGruntParser
    [junit] Tests run: 1, Failures: 0, Errors: 0, Skipped: 0, Time elapsed: 1.33 sec
   [delete] Deleting directory /tmp/pig_junit_tmp43463876

BUILD FAILED
<https://builds.apache.org/job/Pig-trunk-commit/ws/trunk/build.xml>:987: Tests failed!

Total time: 653 minutes 13 seconds
Build step 'Execute shell' marked build as failure
Recording test results
Publishing Javadoc
Recording fingerprints