You are viewing a plain text version of this content. The canonical link for it is here.
Posted to builds@lucene.apache.org by Apache Jenkins Server <je...@builds.apache.org> on 2024/10/02 14:34:08 UTC

[JENKINS] Lucene » Lucene-MMAPv2-Linux (s390x big endian) - Build # 662 - Still Unstable!

Build: https://ci-builds.apache.org/job/Lucene/job/Lucene-MMAPv2-Linux%20(s390x%20big%20endian)/662/

1 tests failed.
FAILED:  org.apache.lucene.index.TestIndexWriterWithThreads.testCloseWithThreads

Error Message:
java.lang.IllegalStateException: this writer hit an unrecoverable error; cannot commit

Stack Trace:
java.lang.IllegalStateException: this writer hit an unrecoverable error; cannot commit
	at __randomizedtesting.SeedInfo.seed([9ACB17DD6F6F7E10:870F3EAA0C9A64B6]:0)
	at org.apache.lucene.index.IndexWriter.startCommit(IndexWriter.java:5582)
	at org.apache.lucene.index.IndexWriter.prepareCommitInternal(IndexWriter.java:3784)
	at org.apache.lucene.index.IndexWriter.commitInternal(IndexWriter.java:4125)
	at org.apache.lucene.index.IndexWriter.commit(IndexWriter.java:4087)
	at org.apache.lucene.index.TestIndexWriterWithThreads.testCloseWithThreads(TestIndexWriterWithThreads.java:240)
	at java.base/jdk.internal.reflect.DirectMethodHandleAccessor.invoke(DirectMethodHandleAccessor.java:103)
	at java.base/java.lang.reflect.Method.invoke(Method.java:580)
	at com.carrotsearch.randomizedtesting.RandomizedRunner.invoke(RandomizedRunner.java:1758)
	at com.carrotsearch.randomizedtesting.RandomizedRunner$8.evaluate(RandomizedRunner.java:946)
	at com.carrotsearch.randomizedtesting.RandomizedRunner$9.evaluate(RandomizedRunner.java:982)
	at com.carrotsearch.randomizedtesting.RandomizedRunner$10.evaluate(RandomizedRunner.java:996)
	at org.apache.lucene.tests.util.TestRuleSetupTeardownChained$1.evaluate(TestRuleSetupTeardownChained.java:48)
	at org.apache.lucene.tests.util.AbstractBeforeAfterRule$1.evaluate(AbstractBeforeAfterRule.java:43)
	at org.apache.lucene.tests.util.TestRuleThreadAndTestName$1.evaluate(TestRuleThreadAndTestName.java:45)
	at org.apache.lucene.tests.util.TestRuleIgnoreAfterMaxFailures$1.evaluate(TestRuleIgnoreAfterMaxFailures.java:60)
	at org.apache.lucene.tests.util.TestRuleMarkFailure$1.evaluate(TestRuleMarkFailure.java:44)
	at org.junit.rules.RunRules.evaluate(RunRules.java:20)
	at com.carrotsearch.randomizedtesting.rules.StatementAdapter.evaluate(StatementAdapter.java:36)
	at com.carrotsearch.randomizedtesting.ThreadLeakControl$StatementRunner.run(ThreadLeakControl.java:390)
	at com.carrotsearch.randomizedtesting.ThreadLeakControl.forkTimeoutingTask(ThreadLeakControl.java:843)
	at com.carrotsearch.randomizedtesting.ThreadLeakControl$3.evaluate(ThreadLeakControl.java:490)
	at com.carrotsearch.randomizedtesting.RandomizedRunner.runSingleTest(RandomizedRunner.java:955)
	at com.carrotsearch.randomizedtesting.RandomizedRunner$5.evaluate(RandomizedRunner.java:840)
	at com.carrotsearch.randomizedtesting.RandomizedRunner$6.evaluate(RandomizedRunner.java:891)
	at com.carrotsearch.randomizedtesting.RandomizedRunner$7.evaluate(RandomizedRunner.java:902)
	at org.apache.lucene.tests.util.AbstractBeforeAfterRule$1.evaluate(AbstractBeforeAfterRule.java:43)
	at com.carrotsearch.randomizedtesting.rules.StatementAdapter.evaluate(StatementAdapter.java:36)
	at org.apache.lucene.tests.util.TestRuleStoreClassName$1.evaluate(TestRuleStoreClassName.java:38)
	at com.carrotsearch.randomizedtesting.rules.NoShadowingOrOverridesOnMethodsRule$1.evaluate(NoShadowingOrOverridesOnMethodsRule.java:40)
	at com.carrotsearch.randomizedtesting.rules.NoShadowingOrOverridesOnMethodsRule$1.evaluate(NoShadowingOrOverridesOnMethodsRule.java:40)
	at com.carrotsearch.randomizedtesting.rules.StatementAdapter.evaluate(StatementAdapter.java:36)
	at com.carrotsearch.randomizedtesting.rules.StatementAdapter.evaluate(StatementAdapter.java:36)
	at org.apache.lucene.tests.util.TestRuleAssertionsRequired$1.evaluate(TestRuleAssertionsRequired.java:53)
	at org.apache.lucene.tests.util.AbstractBeforeAfterRule$1.evaluate(AbstractBeforeAfterRule.java:43)
	at org.apache.lucene.tests.util.TestRuleMarkFailure$1.evaluate(TestRuleMarkFailure.java:44)
	at org.apache.lucene.tests.util.TestRuleIgnoreAfterMaxFailures$1.evaluate(TestRuleIgnoreAfterMaxFailures.java:60)
	at org.apache.lucene.tests.util.TestRuleIgnoreTestSuites$1.evaluate(TestRuleIgnoreTestSuites.java:47)
	at org.junit.rules.RunRules.evaluate(RunRules.java:20)
	at com.carrotsearch.randomizedtesting.rules.StatementAdapter.evaluate(StatementAdapter.java:36)
	at com.carrotsearch.randomizedtesting.ThreadLeakControl$StatementRunner.run(ThreadLeakControl.java:390)
	at com.carrotsearch.randomizedtesting.ThreadLeakControl.lambda$forkTimeoutingTask$0(ThreadLeakControl.java:850)
	at java.base/java.lang.Thread.run(Thread.java:1583)
Caused by: java.nio.file.FileSystemException: /home/jenkins/jenkins-home/712657a4/workspace/Lucene/Lucene-MMAPv2-Linux (s390x big endian)/lucene/core/build/tmp/tests-tmp/lucene.index.TestIndexWriterWithThreads_9ACB17DD6F6F7E10-001/index-MMapDirectory-003/_7q_Lucene90TermVectorsIndex-doc_ids_uu.tmp: Too many open files
	at org.apache.lucene.tests.mockfile.HandleLimitFS.onOpen(HandleLimitFS.java:67)
	at org.apache.lucene.tests.mockfile.HandleTrackingFS.callOpenHook(HandleTrackingFS.java:82)
	at org.apache.lucene.tests.mockfile.HandleTrackingFS.newOutputStream(HandleTrackingFS.java:163)
	at org.apache.lucene.tests.mockfile.FilterFileSystemProvider.newOutputStream(FilterFileSystemProvider.java:200)
	at java.base/java.nio.file.Files.newOutputStream(Files.java:227)
	at org.apache.lucene.store.FSDirectory$FSIndexOutput.<init>(FSDirectory.java:389)
	at org.apache.lucene.store.FSDirectory.createTempOutput(FSDirectory.java:229)
	at org.apache.lucene.tests.store.MockDirectoryWrapper.createTempOutput(MockDirectoryWrapper.java:752)
	at org.apache.lucene.store.FilterDirectory.createTempOutput(FilterDirectory.java:81)
	at org.apache.lucene.store.TrackingDirectoryWrapper.createTempOutput(TrackingDirectoryWrapper.java:49)
	at org.apache.lucene.codecs.lucene90.compressing.FieldsIndexWriter.<init>(FieldsIndexWriter.java:83)
	at org.apache.lucene.codecs.lucene90.compressing.Lucene90CompressingTermVectorsWriter.<init>(Lucene90CompressingTermVectorsWriter.java:286)
	at org.apache.lucene.codecs.lucene90.compressing.Lucene90CompressingTermVectorsFormat.vectorsWriter(Lucene90CompressingTermVectorsFormat.java:103)
	at org.apache.lucene.tests.codecs.asserting.AssertingTermVectorsFormat.vectorsWriter(AssertingTermVectorsFormat.java:51)
	at org.apache.lucene.index.TermVectorsConsumer.initTermVectorsWriter(TermVectorsConsumer.java:106)
	at org.apache.lucene.index.TermVectorsConsumer.finishDocument(TermVectorsConsumer.java:126)
	at org.apache.lucene.index.TermsHash.finishDocument(TermsHash.java:95)
	at org.apache.lucene.index.IndexingChain.processDocument(IndexingChain.java:633)
	at org.apache.lucene.index.DocumentsWriterPerThread.updateDocuments(DocumentsWriterPerThread.java:274)
	at org.apache.lucene.index.DocumentsWriter.updateDocuments(DocumentsWriter.java:425)
	at org.apache.lucene.index.IndexWriter.updateDocuments(IndexWriter.java:1553)
	at org.apache.lucene.index.IndexWriter.updateDocument(IndexWriter.java:1838)
	at org.apache.lucene.index.TestIndexWriterWithThreads$IndexerThread.run(TestIndexWriterWithThreads.java:93)




Build Log:
[...truncated 1052 lines...]
ERROR: The following test(s) have failed:
  - org.apache.lucene.index.TestIndexWriterWithThreads.testCloseWithThreads (:lucene:core)
    Test output: /home/jenkins/jenkins-home/712657a4/workspace/Lucene/Lucene-MMAPv2-Linux (s390x big endian)/lucene/core/build/test-results/test/outputs/OUTPUT-org.apache.lucene.index.TestIndexWriterWithThreads.txt
    Reproduce with: gradlew :lucene:core:test --tests "org.apache.lucene.index.TestIndexWriterWithThreads.testCloseWithThreads" -Ptests.jvms=4 -Ptests.jvmargs= -Ptests.seed=9ACB17DD6F6F7E10 -Ptests.multiplier=2 -Ptests.directory=MMapDirectory -Ptests.gui=true -Ptests.file.encoding=UTF-8 -Ptests.vectorsize=256 -Ptests.forceintegervectors=true


Deprecated Gradle features were used in this build, making it incompatible with Gradle 9.0.

You can use '--warning-mode all' to show the individual deprecation warnings and determine if they come from your own scripts or plugins.

For more on this, please refer to https://docs.gradle.org/8.10/userguide/command_line_interface.html#sec:command_line_warnings in the Gradle documentation.

BUILD SUCCESSFUL in 18m 38s
246 actionable tasks: 246 executed

Publishing build scan...
https://ge.apache.org/s/uoku3xpgi5g56

Build step 'Invoke Gradle script' changed build result to SUCCESS
Archiving artifacts
‘**/*.events’ doesn’t match anything: ‘**’ exists but not ‘**/*.events’
No artifacts found that match the file pattern "**/*.events,heapdumps/**,**/hs_err_pid*". Configuration error?
Recording test results
[Checks API] No suitable checks publisher found.
Build step 'Publish JUnit test result report' changed build result to UNSTABLE
Email was triggered for: Unstable (Test Failures)
Sending email for trigger: Unstable (Test Failures)