You are viewing a plain text version of this content. The canonical link for it is here.
Posted to yarn-dev@hadoop.apache.org by Apache Jenkins Server <je...@builds.apache.org> on 2014/12/08 10:33:41 UTC

Failed: YARN-2917 PreCommit Build #6029

Jira: https://issues.apache.org/jira/browse/YARN-2917
Build: https://builds.apache.org/job/PreCommit-YARN-Build/6029/

###################################################################################
########################## LAST 60 LINES OF THE CONSOLE ###########################
[...truncated 3221 lines...]
  http://issues.apache.org/jira/secure/attachment/12685697/0001-YARN-2917.patch
  against trunk revision 120e1de.

    {color:green}+1 @author{color}.  The patch does not contain any @author tags.

    {color:red}-1 tests included{color}.  The patch doesn't appear to include any new or modified tests.
                        Please justify why no new tests are needed for this patch.
                        Also please list what manual steps were performed to verify this patch.

    {color:green}+1 javac{color}.  The applied patch does not increase the total number of javac compiler warnings.

    {color:green}+1 javadoc{color}.  There were no new javadoc warning messages.

    {color:green}+1 eclipse:eclipse{color}.  The patch built with eclipse:eclipse.

    {color:green}+1 findbugs{color}.  The patch does not introduce any new Findbugs (version 2.0.3) warnings.

    {color:green}+1 release audit{color}.  The applied patch does not increase the total number of release audit warnings.

    {color:green}+1 core tests{color}.  The patch passed unit tests in hadoop-yarn-project/hadoop-yarn/hadoop-yarn-common.

    {color:green}+1 contrib tests{color}.  The patch passed contrib unit tests.

Test results: https://builds.apache.org/job/PreCommit-YARN-Build/6029//testReport/
Console output: https://builds.apache.org/job/PreCommit-YARN-Build/6029//console

This message is automatically generated.


======================================================================
======================================================================
    Adding comment to Jira.
======================================================================
======================================================================


Comment added.
1060b1cbb63a7101785c0db882de6650bc44fb85 logged out


======================================================================
======================================================================
    Finished build.
======================================================================
======================================================================


Build step 'Execute shell' marked build as failure
Archiving artifacts
Sending artifact delta relative to PreCommit-YARN-Build #6026
Archived 15 artifacts
Archive block size is 32768
Received 250 blocks and 869958 bytes
Compression is 90.4%
Took 1.2 sec
[description-setter] Could not determine description.
Recording test results
Email was triggered for: Failure
Sending email for trigger: Failure



###################################################################################
############################## FAILED TESTS (if any) ##############################
All tests passed

Failed: YARN-2902 PreCommit Build #6031

Posted by Apache Jenkins Server <je...@builds.apache.org>.
Jira: https://issues.apache.org/jira/browse/YARN-2902
Build: https://builds.apache.org/job/PreCommit-YARN-Build/6031/

###################################################################################
########################## LAST 60 LINES OF THE CONSOLE ###########################
[...truncated 3335 lines...]
  http://issues.apache.org/jira/secure/attachment/12685607/YARN-2902.002.patch
  against trunk revision 8963515.

    {color:green}+1 @author{color}.  The patch does not contain any @author tags.

    {color:green}+1 tests included{color}.  The patch appears to include 1 new or modified test files.

    {color:green}+1 javac{color}.  The applied patch does not increase the total number of javac compiler warnings.

    {color:green}+1 javadoc{color}.  There were no new javadoc warning messages.

    {color:green}+1 eclipse:eclipse{color}.  The patch built with eclipse:eclipse.

    {color:green}+1 findbugs{color}.  The patch does not introduce any new Findbugs (version 2.0.3) warnings.

    {color:green}+1 release audit{color}.  The applied patch does not increase the total number of release audit warnings.

    {color:green}+1 core tests{color}.  The patch passed unit tests in hadoop-yarn-project/hadoop-yarn/hadoop-yarn-server/hadoop-yarn-server-nodemanager.

    {color:green}+1 contrib tests{color}.  The patch passed contrib unit tests.

Test results: https://builds.apache.org/job/PreCommit-YARN-Build/6031//testReport/
Console output: https://builds.apache.org/job/PreCommit-YARN-Build/6031//console

This message is automatically generated.


======================================================================
======================================================================
    Adding comment to Jira.
======================================================================
======================================================================


Comment added.
6e3d660ad2856ac8d774f7f2d6939711194dded8 logged out


======================================================================
======================================================================
    Finished build.
======================================================================
======================================================================


stat: invalid option -- 'q'
Try 'stat --help' for more information.
Build step 'Execute shell' marked build as failure
Archiving artifacts
Sending artifact delta relative to PreCommit-YARN-Build #6026
Archived 15 artifacts
Archive block size is 32768
Received 45 blocks and 7257521 bytes
Compression is 16.9%
Took 3.1 sec
Description set: MAPREDUCE-6177
Recording test results
Email was triggered for: Failure
Sending email for trigger: Failure



###################################################################################
############################## FAILED TESTS (if any) ##############################
All tests passed

Failed: YARN-2637 PreCommit Build #6030

Posted by Apache Jenkins Server <je...@builds.apache.org>.
Jira: https://issues.apache.org/jira/browse/YARN-2637
Build: https://builds.apache.org/job/PreCommit-YARN-Build/6030/

###################################################################################
########################## LAST 60 LINES OF THE CONSOLE ###########################
[...truncated 3575 lines...]

    {color:green}+1 javadoc{color}.  There were no new javadoc warning messages.

    {color:green}+1 eclipse:eclipse{color}.  The patch built with eclipse:eclipse.

    {color:green}+1 findbugs{color}.  The patch does not introduce any new Findbugs (version 2.0.3) warnings.

    {color:green}+1 release audit{color}.  The applied patch does not increase the total number of release audit warnings.

    {color:red}-1 core tests{color}.  The patch failed these unit tests in hadoop-yarn-project/hadoop-yarn/hadoop-yarn-server/hadoop-yarn-server-resourcemanager:

                  org.apache.hadoop.yarn.server.resourcemanager.scheduler.capacity.TestCapacitySchedulerQueueACLs
                  org.apache.hadoop.yarn.server.resourcemanager.scheduler.capacity.TestQueueParsing
                  org.apache.hadoop.yarn.server.resourcemanager.scheduler.capacity.TestCapacitySchedulerDynamicBehavior
                  org.apache.hadoop.yarn.server.resourcemanager.TestContainerResourceUsage

                                      The following test timeouts occurred in hadoop-yarn-project/hadoop-yarn/hadoop-yarn-server/hadoop-yarn-server-resourcemanager:

org.apache.hadoop.yarn.server.resourcemanager.scheduler.capacity.TestCapacityScheduler
org.apache.hadoop.yarn.server.resourcemanager.scheduler.capacity.TestQueueMappings

    {color:green}+1 contrib tests{color}.  The patch passed contrib unit tests.

Test results: https://builds.apache.org/job/PreCommit-YARN-Build/6030//testReport/
Console output: https://builds.apache.org/job/PreCommit-YARN-Build/6030//console

This message is automatically generated.


======================================================================
======================================================================
    Adding comment to Jira.
======================================================================
======================================================================


Comment added.
23d41d633a65ee40745363d2608cdc57c1c36f49 logged out


======================================================================
======================================================================
    Finished build.
======================================================================
======================================================================


Build step 'Execute shell' marked build as failure
Archiving artifacts
Sending artifact delta relative to PreCommit-YARN-Build #6026
Archived 15 artifacts
Archive block size is 32768
Received 60 blocks and 7110307 bytes
Compression is 21.7%
Took 3.7 sec
[description-setter] Could not determine description.
Recording test results
Email was triggered for: Failure
Sending email for trigger: Failure



###################################################################################
############################## FAILED TESTS (if any) ##############################
17 tests failed.
FAILED:  org.apache.hadoop.yarn.server.resourcemanager.TestContainerResourceUsage.testUsageAfterAMRestartWithMultipleContainers

Error Message:
AppAttempt state is not correct (timedout) expected:<ALLOCATED> but was:<SCHEDULED>

Stack Trace:
java.lang.AssertionError: AppAttempt state is not correct (timedout) expected:<ALLOCATED> but was:<SCHEDULED>
	at org.junit.Assert.fail(Assert.java:88)
	at org.junit.Assert.failNotEquals(Assert.java:743)
	at org.junit.Assert.assertEquals(Assert.java:118)
	at org.apache.hadoop.yarn.server.resourcemanager.MockAM.waitForState(MockAM.java:86)
	at org.apache.hadoop.yarn.server.resourcemanager.MockRM.sendAMLaunched(MockRM.java:505)
	at org.apache.hadoop.yarn.server.resourcemanager.MockRM.launchAM(MockRM.java:670)
	at org.apache.hadoop.yarn.server.resourcemanager.MockRM.launchAndRegisterAM(MockRM.java:677)
	at org.apache.hadoop.yarn.server.resourcemanager.TestContainerResourceUsage.amRestartTests(TestContainerResourceUsage.java:272)
	at org.apache.hadoop.yarn.server.resourcemanager.TestContainerResourceUsage.testUsageAfterAMRestartWithMultipleContainers(TestContainerResourceUsage.java:251)


FAILED:  org.apache.hadoop.yarn.server.resourcemanager.TestContainerResourceUsage.testUsageWithOneAttemptAndOneContainer

Error Message:
AppAttempt state is not correct (timedout) expected:<ALLOCATED> but was:<SCHEDULED>

Stack Trace:
java.lang.AssertionError: AppAttempt state is not correct (timedout) expected:<ALLOCATED> but was:<SCHEDULED>
	at org.junit.Assert.fail(Assert.java:88)
	at org.junit.Assert.failNotEquals(Assert.java:743)
	at org.junit.Assert.assertEquals(Assert.java:118)
	at org.apache.hadoop.yarn.server.resourcemanager.MockAM.waitForState(MockAM.java:86)
	at org.apache.hadoop.yarn.server.resourcemanager.MockRM.sendAMLaunched(MockRM.java:505)
	at org.apache.hadoop.yarn.server.resourcemanager.TestContainerResourceUsage.testUsageWithOneAttemptAndOneContainer(TestContainerResourceUsage.java:97)


FAILED:  org.apache.hadoop.yarn.server.resourcemanager.TestContainerResourceUsage.testUsageAfterAMRestartKeepContainers

Error Message:
AppAttempt state is not correct (timedout) expected:<ALLOCATED> but was:<SCHEDULED>

Stack Trace:
java.lang.AssertionError: AppAttempt state is not correct (timedout) expected:<ALLOCATED> but was:<SCHEDULED>
	at org.junit.Assert.fail(Assert.java:88)
	at org.junit.Assert.failNotEquals(Assert.java:743)
	at org.junit.Assert.assertEquals(Assert.java:118)
	at org.apache.hadoop.yarn.server.resourcemanager.MockAM.waitForState(MockAM.java:86)
	at org.apache.hadoop.yarn.server.resourcemanager.MockRM.sendAMLaunched(MockRM.java:505)
	at org.apache.hadoop.yarn.server.resourcemanager.MockRM.launchAM(MockRM.java:670)
	at org.apache.hadoop.yarn.server.resourcemanager.MockRM.launchAndRegisterAM(MockRM.java:677)
	at org.apache.hadoop.yarn.server.resourcemanager.TestContainerResourceUsage.amRestartTests(TestContainerResourceUsage.java:272)
	at org.apache.hadoop.yarn.server.resourcemanager.TestContainerResourceUsage.testUsageAfterAMRestartKeepContainers(TestContainerResourceUsage.java:256)


FAILED:  org.apache.hadoop.yarn.server.resourcemanager.scheduler.capacity.TestCapacitySchedulerDynamicBehavior.testRemoveQueue

Error Message:
App state is not correct (timedout) expected:<ACCEPTED> but was:<SUBMITTED>

Stack Trace:
java.lang.AssertionError: App state is not correct (timedout) expected:<ACCEPTED> but was:<SUBMITTED>
	at org.junit.Assert.fail(Assert.java:88)
	at org.junit.Assert.failNotEquals(Assert.java:743)
	at org.junit.Assert.assertEquals(Assert.java:118)
	at org.apache.hadoop.yarn.server.resourcemanager.MockRM.waitForState(MockRM.java:143)
	at org.apache.hadoop.yarn.server.resourcemanager.MockRM.submitApp(MockRM.java:432)
	at org.apache.hadoop.yarn.server.resourcemanager.MockRM.submitApp(MockRM.java:323)
	at org.apache.hadoop.yarn.server.resourcemanager.MockRM.submitApp(MockRM.java:315)
	at org.apache.hadoop.yarn.server.resourcemanager.MockRM.submitApp(MockRM.java:306)
	at org.apache.hadoop.yarn.server.resourcemanager.MockRM.submitApp(MockRM.java:299)
	at org.apache.hadoop.yarn.server.resourcemanager.MockRM.submitApp(MockRM.java:282)
	at org.apache.hadoop.yarn.server.resourcemanager.scheduler.capacity.TestCapacitySchedulerDynamicBehavior.testRemoveQueue(TestCapacitySchedulerDynamicBehavior.java:159)


FAILED:  org.apache.hadoop.yarn.server.resourcemanager.scheduler.capacity.TestCapacitySchedulerDynamicBehavior.testMoveAppToPlanQueue

Error Message:
App state is not correct (timedout) expected:<ACCEPTED> but was:<SUBMITTED>

Stack Trace:
java.lang.AssertionError: App state is not correct (timedout) expected:<ACCEPTED> but was:<SUBMITTED>
	at org.junit.Assert.fail(Assert.java:88)
	at org.junit.Assert.failNotEquals(Assert.java:743)
	at org.junit.Assert.assertEquals(Assert.java:118)
	at org.apache.hadoop.yarn.server.resourcemanager.MockRM.waitForState(MockRM.java:143)
	at org.apache.hadoop.yarn.server.resourcemanager.MockRM.submitApp(MockRM.java:432)
	at org.apache.hadoop.yarn.server.resourcemanager.MockRM.submitApp(MockRM.java:323)
	at org.apache.hadoop.yarn.server.resourcemanager.MockRM.submitApp(MockRM.java:315)
	at org.apache.hadoop.yarn.server.resourcemanager.MockRM.submitApp(MockRM.java:306)
	at org.apache.hadoop.yarn.server.resourcemanager.MockRM.submitApp(MockRM.java:299)
	at org.apache.hadoop.yarn.server.resourcemanager.MockRM.submitApp(MockRM.java:282)
	at org.apache.hadoop.yarn.server.resourcemanager.scheduler.capacity.TestCapacitySchedulerDynamicBehavior.testMoveAppToPlanQueue(TestCapacitySchedulerDynamicBehavior.java:194)


FAILED:  org.apache.hadoop.yarn.server.resourcemanager.scheduler.capacity.TestCapacitySchedulerQueueACLs.testApplicationACLs

Error Message:
org/apache/hadoop/service/ServiceOperations

Stack Trace:
java.lang.NoClassDefFoundError: org/apache/hadoop/service/ServiceOperations
	at org.apache.hadoop.service.CompositeService.stop(CompositeService.java:157)
	at org.apache.hadoop.service.CompositeService.serviceStop(CompositeService.java:131)
	at org.apache.hadoop.yarn.server.resourcemanager.ResourceManager.serviceStop(ResourceManager.java:1105)
	at org.apache.hadoop.service.AbstractService.stop(AbstractService.java:221)
	at org.apache.hadoop.yarn.server.resourcemanager.QueueACLsTestBase.tearDown(QueueACLsTestBase.java:117)
	at sun.reflect.NativeMethodAccessorImpl.invoke0(Native Method)
	at sun.reflect.NativeMethodAccessorImpl.invoke(NativeMethodAccessorImpl.java:39)
	at sun.reflect.DelegatingMethodAccessorImpl.invoke(DelegatingMethodAccessorImpl.java:25)
	at java.lang.reflect.Method.invoke(Method.java:597)
	at org.junit.runners.model.FrameworkMethod$1.runReflectiveCall(FrameworkMethod.java:47)
	at org.junit.internal.runners.model.ReflectiveCallable.run(ReflectiveCallable.java:12)
	at org.junit.runners.model.FrameworkMethod.invokeExplosively(FrameworkMethod.java:44)
	at org.junit.internal.runners.statements.RunAfters.evaluate(RunAfters.java:33)
	at org.junit.runners.ParentRunner.runLeaf(ParentRunner.java:271)
	at org.junit.runners.BlockJUnit4ClassRunner.runChild(BlockJUnit4ClassRunner.java:70)
	at org.junit.runners.BlockJUnit4ClassRunner.runChild(BlockJUnit4ClassRunner.java:50)
	at org.junit.runners.ParentRunner$3.run(ParentRunner.java:238)
	at org.junit.runners.ParentRunner$1.schedule(ParentRunner.java:63)
	at org.junit.runners.ParentRunner.runChildren(ParentRunner.java:236)
	at org.junit.runners.ParentRunner.access$000(ParentRunner.java:53)
	at org.junit.runners.ParentRunner$2.evaluate(ParentRunner.java:229)
	at org.junit.runners.ParentRunner.run(ParentRunner.java:309)
	at org.apache.maven.surefire.junit4.JUnit4Provider.execute(JUnit4Provider.java:264)
	at org.apache.maven.surefire.junit4.JUnit4Provider.executeTestSet(JUnit4Provider.java:153)
	at org.apache.maven.surefire.junit4.JUnit4Provider.invoke(JUnit4Provider.java:124)
	at org.apache.maven.surefire.booter.ForkedBooter.invokeProviderInSameClassLoader(ForkedBooter.java:200)
	at org.apache.maven.surefire.booter.ForkedBooter.runSuitesInProcess(ForkedBooter.java:153)
	at org.apache.maven.surefire.booter.ForkedBooter.main(ForkedBooter.java:103)
Caused by: java.lang.ClassNotFoundException: org.apache.hadoop.service.ServiceOperations
	at java.net.URLClassLoader$1.run(URLClassLoader.java:202)
	at java.security.AccessController.doPrivileged(Native Method)
	at java.net.URLClassLoader.findClass(URLClassLoader.java:190)
	at java.lang.ClassLoader.loadClass(ClassLoader.java:306)
	at sun.misc.Launcher$AppClassLoader.loadClass(Launcher.java:301)
	at java.lang.ClassLoader.loadClass(ClassLoader.java:247)
	at org.apache.hadoop.service.CompositeService.stop(CompositeService.java:157)
	at org.apache.hadoop.service.CompositeService.serviceStop(CompositeService.java:131)
	at org.apache.hadoop.yarn.server.resourcemanager.ResourceManager.serviceStop(ResourceManager.java:1105)
	at org.apache.hadoop.service.AbstractService.stop(AbstractService.java:221)
	at org.apache.hadoop.yarn.server.resourcemanager.QueueACLsTestBase.tearDown(QueueACLsTestBase.java:117)
	at sun.reflect.NativeMethodAccessorImpl.invoke0(Native Method)
	at sun.reflect.NativeMethodAccessorImpl.invoke(NativeMethodAccessorImpl.java:39)
	at sun.reflect.DelegatingMethodAccessorImpl.invoke(DelegatingMethodAccessorImpl.java:25)
	at java.lang.reflect.Method.invoke(Method.java:597)
	at org.junit.runners.model.FrameworkMethod$1.runReflectiveCall(FrameworkMethod.java:47)
	at org.junit.internal.runners.model.ReflectiveCallable.run(ReflectiveCallable.java:12)
	at org.junit.runners.model.FrameworkMethod.invokeExplosively(FrameworkMethod.java:44)
	at org.junit.internal.runners.statements.RunAfters.evaluate(RunAfters.java:33)
	at org.junit.runners.ParentRunner.runLeaf(ParentRunner.java:271)
	at org.junit.runners.BlockJUnit4ClassRunner.runChild(BlockJUnit4ClassRunner.java:70)
	at org.junit.runners.BlockJUnit4ClassRunner.runChild(BlockJUnit4ClassRunner.java:50)
	at org.junit.runners.ParentRunner$3.run(ParentRunner.java:238)
	at org.junit.runners.ParentRunner$1.schedule(ParentRunner.java:63)
	at org.junit.runners.ParentRunner.runChildren(ParentRunner.java:236)
	at org.junit.runners.ParentRunner.access$000(ParentRunner.java:53)
	at org.junit.runners.ParentRunner$2.evaluate(ParentRunner.java:229)
	at org.junit.runners.ParentRunner.run(ParentRunner.java:309)
	at org.apache.maven.surefire.junit4.JUnit4Provider.execute(JUnit4Provider.java:264)
	at org.apache.maven.surefire.junit4.JUnit4Provider.executeTestSet(JUnit4Provider.java:153)
	at org.apache.maven.surefire.junit4.JUnit4Provider.invoke(JUnit4Provider.java:124)
	at org.apache.maven.surefire.booter.ForkedBooter.invokeProviderInSameClassLoader(ForkedBooter.java:200)
	at org.apache.maven.surefire.booter.ForkedBooter.runSuitesInProcess(ForkedBooter.java:153)
	at org.apache.maven.surefire.booter.ForkedBooter.main(ForkedBooter.java:103)


FAILED:  org.apache.hadoop.yarn.server.resourcemanager.scheduler.capacity.TestQueueParsing.testQueueParsingReinitializeWithLabels

Error Message:
org/apache/hadoop/yarn/server/security/BaseContainerTokenSecretManager

Stack Trace:
java.lang.NoClassDefFoundError: org/apache/hadoop/yarn/server/security/BaseContainerTokenSecretManager
	at java.net.URLClassLoader$1.run(URLClassLoader.java:202)
	at java.security.AccessController.doPrivileged(Native Method)
	at java.net.URLClassLoader.findClass(URLClassLoader.java:190)
	at java.lang.ClassLoader.loadClass(ClassLoader.java:306)
	at sun.misc.Launcher$AppClassLoader.loadClass(Launcher.java:301)
	at java.lang.ClassLoader.loadClass(ClassLoader.java:247)
	at java.lang.ClassLoader.defineClass1(Native Method)
	at java.lang.ClassLoader.defineClassCond(ClassLoader.java:631)
	at java.lang.ClassLoader.defineClass(ClassLoader.java:615)
	at java.security.SecureClassLoader.defineClass(SecureClassLoader.java:141)
	at java.net.URLClassLoader.defineClass(URLClassLoader.java:283)
	at java.net.URLClassLoader.access$000(URLClassLoader.java:58)
	at java.net.URLClassLoader$1.run(URLClassLoader.java:197)
	at java.security.AccessController.doPrivileged(Native Method)
	at java.net.URLClassLoader.findClass(URLClassLoader.java:190)
	at java.lang.ClassLoader.loadClass(ClassLoader.java:306)
	at sun.misc.Launcher$AppClassLoader.loadClass(Launcher.java:301)
	at java.lang.ClassLoader.loadClass(ClassLoader.java:247)
	at org.apache.hadoop.yarn.server.resourcemanager.scheduler.capacity.TestQueueParsing.testQueueParsingReinitializeWithLabels(TestQueueParsing.java:427)


FAILED:  org.apache.hadoop.yarn.server.resourcemanager.scheduler.capacity.TestQueueParsing.testQueueParsingWithLabelsInherit

Error Message:
org/apache/hadoop/yarn/server/resourcemanager/security/RMContainerTokenSecretManager

Stack Trace:
java.lang.NoClassDefFoundError: org/apache/hadoop/yarn/server/resourcemanager/security/RMContainerTokenSecretManager
	at org.apache.hadoop.yarn.server.resourcemanager.scheduler.capacity.TestQueueParsing.testQueueParsingWithLabelsInherit(TestQueueParsing.java:540)


FAILED:  org.apache.hadoop.yarn.server.resourcemanager.scheduler.capacity.TestQueueParsing.testSingleLevelQueueParsingWhenLabelsNotExistedInNodeLabelManager

Error Message:
Unexpected exception, expected<java.lang.Exception> but was<java.lang.NoClassDefFoundError>

Stack Trace:
java.lang.Exception: Unexpected exception, expected<java.lang.Exception> but was<java.lang.NoClassDefFoundError>
	at org.apache.hadoop.yarn.server.resourcemanager.scheduler.capacity.TestQueueParsing.testSingleLevelQueueParsingWhenLabelsNotExistedInNodeLabelManager(TestQueueParsing.java:619)


FAILED:  org.apache.hadoop.yarn.server.resourcemanager.scheduler.capacity.TestQueueParsing.testQueueParsingWithUnusedLabels

Error Message:
org/apache/hadoop/yarn/server/resourcemanager/security/RMContainerTokenSecretManager

Stack Trace:
java.lang.NoClassDefFoundError: org/apache/hadoop/yarn/server/resourcemanager/security/RMContainerTokenSecretManager
	at org.apache.hadoop.yarn.server.resourcemanager.scheduler.capacity.TestQueueParsing.testQueueParsingWithUnusedLabels(TestQueueParsing.java:681)


FAILED:  org.apache.hadoop.yarn.server.resourcemanager.scheduler.capacity.TestQueueParsing.testQueueParsingShouldTrimSpaces

Error Message:
org/apache/hadoop/yarn/server/security/BaseContainerTokenSecretManager

Stack Trace:
java.lang.NoClassDefFoundError: org/apache/hadoop/yarn/server/security/BaseContainerTokenSecretManager
	at java.net.URLClassLoader$1.run(URLClassLoader.java:202)
	at java.security.AccessController.doPrivileged(Native Method)
	at java.net.URLClassLoader.findClass(URLClassLoader.java:190)
	at java.lang.ClassLoader.loadClass(ClassLoader.java:306)
	at sun.misc.Launcher$AppClassLoader.loadClass(Launcher.java:301)
	at java.lang.ClassLoader.loadClass(ClassLoader.java:247)
	at java.lang.ClassLoader.defineClass1(Native Method)
	at java.lang.ClassLoader.defineClassCond(ClassLoader.java:631)
	at java.lang.ClassLoader.defineClass(ClassLoader.java:615)
	at java.security.SecureClassLoader.defineClass(SecureClassLoader.java:141)
	at java.net.URLClassLoader.defineClass(URLClassLoader.java:283)
	at java.net.URLClassLoader.access$000(URLClassLoader.java:58)
	at java.net.URLClassLoader$1.run(URLClassLoader.java:197)
	at java.security.AccessController.doPrivileged(Native Method)
	at java.net.URLClassLoader.findClass(URLClassLoader.java:190)
	at java.lang.ClassLoader.loadClass(ClassLoader.java:306)
	at sun.misc.Launcher$AppClassLoader.loadClass(Launcher.java:301)
	at java.lang.ClassLoader.loadClass(ClassLoader.java:247)
	at org.apache.hadoop.yarn.server.resourcemanager.scheduler.capacity.TestUtils.getMockRMContext(TestUtils.java:96)
	at org.apache.hadoop.yarn.server.resourcemanager.scheduler.capacity.TestQueueParsing.testQueueParsingShouldTrimSpaces(TestQueueParsing.java:722)


FAILED:  org.apache.hadoop.yarn.server.resourcemanager.scheduler.capacity.TestQueueParsing.testNestedQueueParsingShouldTrimSpaces

Error Message:
org/apache/hadoop/yarn/server/resourcemanager/security/RMContainerTokenSecretManager

Stack Trace:
java.lang.NoClassDefFoundError: org/apache/hadoop/yarn/server/resourcemanager/security/RMContainerTokenSecretManager
	at org.apache.hadoop.yarn.server.resourcemanager.scheduler.capacity.TestUtils.getMockRMContext(TestUtils.java:96)
	at org.apache.hadoop.yarn.server.resourcemanager.scheduler.capacity.TestQueueParsing.testNestedQueueParsingShouldTrimSpaces(TestQueueParsing.java:747)


FAILED:  org.apache.hadoop.yarn.server.resourcemanager.scheduler.capacity.TestQueueParsing.testQueueParsing

Error Message:
org/apache/hadoop/yarn/server/resourcemanager/security/RMContainerTokenSecretManager

Stack Trace:
java.lang.NoClassDefFoundError: org/apache/hadoop/yarn/server/resourcemanager/security/RMContainerTokenSecretManager
	at org.apache.hadoop.yarn.server.resourcemanager.scheduler.capacity.TestUtils.getMockRMContext(TestUtils.java:96)
	at org.apache.hadoop.yarn.server.resourcemanager.scheduler.capacity.TestQueueParsing.testQueueParsing(TestQueueParsing.java:64)


FAILED:  org.apache.hadoop.yarn.server.resourcemanager.scheduler.capacity.TestQueueParsing.testQueueParsingWhenLabelsNotExist

Error Message:
Unexpected exception, expected<java.lang.Exception> but was<java.lang.NoClassDefFoundError>

Stack Trace:
java.lang.Exception: Unexpected exception, expected<java.lang.Exception> but was<java.lang.NoClassDefFoundError>
	at org.apache.hadoop.yarn.server.resourcemanager.scheduler.capacity.TestQueueParsing.testQueueParsingWhenLabelsNotExist(TestQueueParsing.java:646)


FAILED:  org.apache.hadoop.yarn.server.resourcemanager.scheduler.capacity.TestQueueParsing.testQueueParsingWhenLabelsInheritedNotExistedInNodeLabelManager

Error Message:
Unexpected exception, expected<java.lang.Exception> but was<java.lang.NoClassDefFoundError>

Stack Trace:
java.lang.Exception: Unexpected exception, expected<java.lang.Exception> but was<java.lang.NoClassDefFoundError>
	at org.apache.hadoop.yarn.server.resourcemanager.scheduler.capacity.TestQueueParsing.testQueueParsingWhenLabelsInheritedNotExistedInNodeLabelManager(TestQueueParsing.java:591)


FAILED:  org.apache.hadoop.yarn.server.resourcemanager.scheduler.capacity.TestQueueParsing.testQueueParsingWithLabels

Error Message:
org/apache/hadoop/yarn/server/resourcemanager/security/RMContainerTokenSecretManager

Stack Trace:
java.lang.NoClassDefFoundError: org/apache/hadoop/yarn/server/resourcemanager/security/RMContainerTokenSecretManager
	at org.apache.hadoop.yarn.server.resourcemanager.scheduler.capacity.TestQueueParsing.testQueueParsingWithLabels(TestQueueParsing.java:516)


FAILED:  org.apache.hadoop.yarn.server.resourcemanager.scheduler.capacity.TestQueueParsing.testQueueParsingWhenLabelsNotExistedInNodeLabelManager

Error Message:
Unexpected exception, expected<java.lang.Exception> but was<java.lang.NoClassDefFoundError>

Stack Trace:
java.lang.Exception: Unexpected exception, expected<java.lang.Exception> but was<java.lang.NoClassDefFoundError>
	at org.apache.hadoop.yarn.server.resourcemanager.scheduler.capacity.TestQueueParsing.testQueueParsingWhenLabelsNotExistedInNodeLabelManager(TestQueueParsing.java:563)