You are viewing a plain text version of this content. The canonical link for it is here.
Posted to dev@lucene.apache.org by Policeman Jenkins Server <je...@thetaphi.de> on 2016/05/24 01:55:18 UTC
[JENKINS] Lucene-Solr-6.x-MacOSX (64bit/jdk1.8.0) - Build # 158 -
Failure!
Build: http://jenkins.thetaphi.de/job/Lucene-Solr-6.x-MacOSX/158/
Java: 64bit/jdk1.8.0 -XX:+UseCompressedOops -XX:+UseParallelGC
1 tests failed.
FAILED: org.apache.solr.handler.TestReqParamsAPI.test
Error Message:
Could not get expected value 'null' for path 'response/params/y/p' full output: { "responseHeader":{ "status":0, "QTime":0}, "response":{ "znodeVersion":4, "params":{ "x":{ "a":"A val", "b":"B val", "_appends_":{"add":"first"}, "_invariants_":{"fixed":"f"}, "":{"v":1}}, "y":{ "p":"P val", "q":"Q val", "":{"v":2}}}}}, from server: http://127.0.0.1:57391/_p/zt/collection1
Stack Trace:
java.lang.AssertionError: Could not get expected value 'null' for path 'response/params/y/p' full output: {
"responseHeader":{
"status":0,
"QTime":0},
"response":{
"znodeVersion":4,
"params":{
"x":{
"a":"A val",
"b":"B val",
"_appends_":{"add":"first"},
"_invariants_":{"fixed":"f"},
"":{"v":1}},
"y":{
"p":"P val",
"q":"Q val",
"":{"v":2}}}}}, from server: http://127.0.0.1:57391/_p/zt/collection1
at __randomizedtesting.SeedInfo.seed([949EE1395DE755E0:1CCADEE3F31B3818]:0)
at org.junit.Assert.fail(Assert.java:93)
at org.junit.Assert.assertTrue(Assert.java:43)
at org.apache.solr.core.TestSolrConfigHandler.testForResponseElement(TestSolrConfigHandler.java:457)
at org.apache.solr.handler.TestReqParamsAPI.testReqParams(TestReqParamsAPI.java:259)
at org.apache.solr.handler.TestReqParamsAPI.test(TestReqParamsAPI.java:62)
at sun.reflect.NativeMethodAccessorImpl.invoke0(Native Method)
at sun.reflect.NativeMethodAccessorImpl.invoke(NativeMethodAccessorImpl.java:62)
at sun.reflect.DelegatingMethodAccessorImpl.invoke(DelegatingMethodAccessorImpl.java:43)
at java.lang.reflect.Method.invoke(Method.java:498)
at com.carrotsearch.randomizedtesting.RandomizedRunner.invoke(RandomizedRunner.java:1764)
at com.carrotsearch.randomizedtesting.RandomizedRunner$8.evaluate(RandomizedRunner.java:871)
at com.carrotsearch.randomizedtesting.RandomizedRunner$9.evaluate(RandomizedRunner.java:907)
at com.carrotsearch.randomizedtesting.RandomizedRunner$10.evaluate(RandomizedRunner.java:921)
at org.apache.solr.BaseDistributedSearchTestCase$ShardsRepeatRule$ShardsFixedStatement.callStatement(BaseDistributedSearchTestCase.java:992)
at org.apache.solr.BaseDistributedSearchTestCase$ShardsRepeatRule$ShardsStatement.evaluate(BaseDistributedSearchTestCase.java:967)
at com.carrotsearch.randomizedtesting.rules.SystemPropertiesRestoreRule$1.evaluate(SystemPropertiesRestoreRule.java:57)
at org.apache.lucene.util.TestRuleSetupTeardownChained$1.evaluate(TestRuleSetupTeardownChained.java:49)
at org.apache.lucene.util.AbstractBeforeAfterRule$1.evaluate(AbstractBeforeAfterRule.java:45)
at org.apache.lucene.util.TestRuleThreadAndTestName$1.evaluate(TestRuleThreadAndTestName.java:48)
at org.apache.lucene.util.TestRuleIgnoreAfterMaxFailures$1.evaluate(TestRuleIgnoreAfterMaxFailures.java:64)
at org.apache.lucene.util.TestRuleMarkFailure$1.evaluate(TestRuleMarkFailure.java:47)
at com.carrotsearch.randomizedtesting.rules.StatementAdapter.evaluate(StatementAdapter.java:36)
at com.carrotsearch.randomizedtesting.ThreadLeakControl$StatementRunner.run(ThreadLeakControl.java:367)
at com.carrotsearch.randomizedtesting.ThreadLeakControl.forkTimeoutingTask(ThreadLeakControl.java:809)
at com.carrotsearch.randomizedtesting.ThreadLeakControl$3.evaluate(ThreadLeakControl.java:460)
at com.carrotsearch.randomizedtesting.RandomizedRunner.runSingleTest(RandomizedRunner.java:880)
at com.carrotsearch.randomizedtesting.RandomizedRunner$5.evaluate(RandomizedRunner.java:781)
at com.carrotsearch.randomizedtesting.RandomizedRunner$6.evaluate(RandomizedRunner.java:816)
at com.carrotsearch.randomizedtesting.RandomizedRunner$7.evaluate(RandomizedRunner.java:827)
at com.carrotsearch.randomizedtesting.rules.StatementAdapter.evaluate(StatementAdapter.java:36)
at com.carrotsearch.randomizedtesting.rules.SystemPropertiesRestoreRule$1.evaluate(SystemPropertiesRestoreRule.java:57)
at org.apache.lucene.util.AbstractBeforeAfterRule$1.evaluate(AbstractBeforeAfterRule.java:45)
at com.carrotsearch.randomizedtesting.rules.StatementAdapter.evaluate(StatementAdapter.java:36)
at org.apache.lucene.util.TestRuleStoreClassName$1.evaluate(TestRuleStoreClassName.java:41)
at com.carrotsearch.randomizedtesting.rules.NoShadowingOrOverridesOnMethodsRule$1.evaluate(NoShadowingOrOverridesOnMethodsRule.java:40)
at com.carrotsearch.randomizedtesting.rules.NoShadowingOrOverridesOnMethodsRule$1.evaluate(NoShadowingOrOverridesOnMethodsRule.java:40)
at com.carrotsearch.randomizedtesting.rules.StatementAdapter.evaluate(StatementAdapter.java:36)
at com.carrotsearch.randomizedtesting.rules.StatementAdapter.evaluate(StatementAdapter.java:36)
at com.carrotsearch.randomizedtesting.rules.StatementAdapter.evaluate(StatementAdapter.java:36)
at org.apache.lucene.util.TestRuleAssertionsRequired$1.evaluate(TestRuleAssertionsRequired.java:53)
at org.apache.lucene.util.TestRuleMarkFailure$1.evaluate(TestRuleMarkFailure.java:47)
at org.apache.lucene.util.TestRuleIgnoreAfterMaxFailures$1.evaluate(TestRuleIgnoreAfterMaxFailures.java:64)
at org.apache.lucene.util.TestRuleIgnoreTestSuites$1.evaluate(TestRuleIgnoreTestSuites.java:54)
at com.carrotsearch.randomizedtesting.rules.StatementAdapter.evaluate(StatementAdapter.java:36)
at com.carrotsearch.randomizedtesting.ThreadLeakControl$StatementRunner.run(ThreadLeakControl.java:367)
at java.lang.Thread.run(Thread.java:745)
Build Log:
[...truncated 12091 lines...]
[junit4] Suite: org.apache.solr.handler.TestReqParamsAPI
[junit4] 2> Creating dataDir: /Users/jenkins/workspace/Lucene-Solr-6.x-MacOSX/solr/build/solr-core/test/J0/temp/solr.handler.TestReqParamsAPI_949EE1395DE755E0-001/init-core-data-001
[junit4] 2> 3338648 INFO (SUITE-TestReqParamsAPI-seed#[949EE1395DE755E0]-worker) [ ] o.a.s.SolrTestCaseJ4 Randomized ssl (false) and clientAuth (false)
[junit4] 2> 3338654 INFO (SUITE-TestReqParamsAPI-seed#[949EE1395DE755E0]-worker) [ ] o.a.s.BaseDistributedSearchTestCase Setting hostContext system property: /_p/zt
[junit4] 2> 3338657 INFO (TEST-TestReqParamsAPI.test-seed#[949EE1395DE755E0]) [ ] o.a.s.c.ZkTestServer STARTING ZK TEST SERVER
[junit4] 2> 3338658 INFO (Thread-6201) [ ] o.a.s.c.ZkTestServer client port:0.0.0.0/0.0.0.0:0
[junit4] 2> 3338658 INFO (Thread-6201) [ ] o.a.s.c.ZkTestServer Starting server
[junit4] 2> 3338768 INFO (TEST-TestReqParamsAPI.test-seed#[949EE1395DE755E0]) [ ] o.a.s.c.ZkTestServer start zk server on port:57365
[junit4] 2> 3338768 INFO (TEST-TestReqParamsAPI.test-seed#[949EE1395DE755E0]) [ ] o.a.s.c.c.SolrZkClient Using default ZkCredentialsProvider
[junit4] 2> 3338769 INFO (TEST-TestReqParamsAPI.test-seed#[949EE1395DE755E0]) [ ] o.a.s.c.c.ConnectionManager Waiting for client to connect to ZooKeeper
[junit4] 2> 3338780 INFO (zkCallback-11186-thread-1) [ ] o.a.s.c.c.ConnectionManager Watcher org.apache.solr.common.cloud.ConnectionManager@3dd5c8ba name:ZooKeeperConnection Watcher:127.0.0.1:57365 got event WatchedEvent state:SyncConnected type:None path:null path:null type:None
[junit4] 2> 3338781 INFO (TEST-TestReqParamsAPI.test-seed#[949EE1395DE755E0]) [ ] o.a.s.c.c.ConnectionManager Client is connected to ZooKeeper
[junit4] 2> 3338781 INFO (TEST-TestReqParamsAPI.test-seed#[949EE1395DE755E0]) [ ] o.a.s.c.c.SolrZkClient Using default ZkACLProvider
[junit4] 2> 3338781 INFO (TEST-TestReqParamsAPI.test-seed#[949EE1395DE755E0]) [ ] o.a.s.c.c.SolrZkClient makePath: /solr
[junit4] 2> 3338786 INFO (TEST-TestReqParamsAPI.test-seed#[949EE1395DE755E0]) [ ] o.a.s.c.c.SolrZkClient Using default ZkCredentialsProvider
[junit4] 2> 3338786 INFO (TEST-TestReqParamsAPI.test-seed#[949EE1395DE755E0]) [ ] o.a.s.c.c.ConnectionManager Waiting for client to connect to ZooKeeper
[junit4] 2> 3338787 INFO (zkCallback-11187-thread-1) [ ] o.a.s.c.c.ConnectionManager Watcher org.apache.solr.common.cloud.ConnectionManager@4da1cb4 name:ZooKeeperConnection Watcher:127.0.0.1:57365/solr got event WatchedEvent state:SyncConnected type:None path:null path:null type:None
[junit4] 2> 3338787 INFO (TEST-TestReqParamsAPI.test-seed#[949EE1395DE755E0]) [ ] o.a.s.c.c.ConnectionManager Client is connected to ZooKeeper
[junit4] 2> 3338788 INFO (TEST-TestReqParamsAPI.test-seed#[949EE1395DE755E0]) [ ] o.a.s.c.c.SolrZkClient Using default ZkACLProvider
[junit4] 2> 3338788 INFO (TEST-TestReqParamsAPI.test-seed#[949EE1395DE755E0]) [ ] o.a.s.c.c.SolrZkClient makePath: /collections/collection1
[junit4] 2> 3338791 INFO (TEST-TestReqParamsAPI.test-seed#[949EE1395DE755E0]) [ ] o.a.s.c.c.SolrZkClient makePath: /collections/collection1/shards
[junit4] 2> 3338794 INFO (TEST-TestReqParamsAPI.test-seed#[949EE1395DE755E0]) [ ] o.a.s.c.c.SolrZkClient makePath: /collections/control_collection
[junit4] 2> 3338797 INFO (TEST-TestReqParamsAPI.test-seed#[949EE1395DE755E0]) [ ] o.a.s.c.c.SolrZkClient makePath: /collections/control_collection/shards
[junit4] 2> 3338801 INFO (TEST-TestReqParamsAPI.test-seed#[949EE1395DE755E0]) [ ] o.a.s.c.AbstractZkTestCase put /Users/jenkins/workspace/Lucene-Solr-6.x-MacOSX/solr/core/src/test-files/solr/collection1/conf/solrconfig-tlog.xml to /configs/conf1/solrconfig.xml
[junit4] 2> 3338802 INFO (TEST-TestReqParamsAPI.test-seed#[949EE1395DE755E0]) [ ] o.a.s.c.c.SolrZkClient makePath: /configs/conf1/solrconfig.xml
[junit4] 2> 3338806 INFO (TEST-TestReqParamsAPI.test-seed#[949EE1395DE755E0]) [ ] o.a.s.c.AbstractZkTestCase put /Users/jenkins/workspace/Lucene-Solr-6.x-MacOSX/solr/core/src/test-files/solr/collection1/conf/schema.xml to /configs/conf1/schema.xml
[junit4] 2> 3338829 INFO (TEST-TestReqParamsAPI.test-seed#[949EE1395DE755E0]) [ ] o.a.s.c.c.SolrZkClient makePath: /configs/conf1/schema.xml
[junit4] 2> 3338833 INFO (TEST-TestReqParamsAPI.test-seed#[949EE1395DE755E0]) [ ] o.a.s.c.AbstractZkTestCase put /Users/jenkins/workspace/Lucene-Solr-6.x-MacOSX/solr/core/src/test-files/solr/collection1/conf/solrconfig.snippet.randomindexconfig.xml to /configs/conf1/solrconfig.snippet.randomindexconfig.xml
[junit4] 2> 3338834 INFO (TEST-TestReqParamsAPI.test-seed#[949EE1395DE755E0]) [ ] o.a.s.c.c.SolrZkClient makePath: /configs/conf1/solrconfig.snippet.randomindexconfig.xml
[junit4] 2> 3338837 INFO (TEST-TestReqParamsAPI.test-seed#[949EE1395DE755E0]) [ ] o.a.s.c.AbstractZkTestCase put /Users/jenkins/workspace/Lucene-Solr-6.x-MacOSX/solr/core/src/test-files/solr/collection1/conf/stopwords.txt to /configs/conf1/stopwords.txt
[junit4] 2> 3338838 INFO (TEST-TestReqParamsAPI.test-seed#[949EE1395DE755E0]) [ ] o.a.s.c.c.SolrZkClient makePath: /configs/conf1/stopwords.txt
[junit4] 2> 3338842 INFO (TEST-TestReqParamsAPI.test-seed#[949EE1395DE755E0]) [ ] o.a.s.c.AbstractZkTestCase put /Users/jenkins/workspace/Lucene-Solr-6.x-MacOSX/solr/core/src/test-files/solr/collection1/conf/protwords.txt to /configs/conf1/protwords.txt
[junit4] 2> 3338843 INFO (TEST-TestReqParamsAPI.test-seed#[949EE1395DE755E0]) [ ] o.a.s.c.c.SolrZkClient makePath: /configs/conf1/protwords.txt
[junit4] 2> 3338847 INFO (TEST-TestReqParamsAPI.test-seed#[949EE1395DE755E0]) [ ] o.a.s.c.AbstractZkTestCase put /Users/jenkins/workspace/Lucene-Solr-6.x-MacOSX/solr/core/src/test-files/solr/collection1/conf/currency.xml to /configs/conf1/currency.xml
[junit4] 2> 3338849 INFO (TEST-TestReqParamsAPI.test-seed#[949EE1395DE755E0]) [ ] o.a.s.c.c.SolrZkClient makePath: /configs/conf1/currency.xml
[junit4] 2> 3338852 INFO (TEST-TestReqParamsAPI.test-seed#[949EE1395DE755E0]) [ ] o.a.s.c.AbstractZkTestCase put /Users/jenkins/workspace/Lucene-Solr-6.x-MacOSX/solr/core/src/test-files/solr/collection1/conf/enumsConfig.xml to /configs/conf1/enumsConfig.xml
[junit4] 2> 3338857 INFO (TEST-TestReqParamsAPI.test-seed#[949EE1395DE755E0]) [ ] o.a.s.c.c.SolrZkClient makePath: /configs/conf1/enumsConfig.xml
[junit4] 2> 3338861 INFO (TEST-TestReqParamsAPI.test-seed#[949EE1395DE755E0]) [ ] o.a.s.c.AbstractZkTestCase put /Users/jenkins/workspace/Lucene-Solr-6.x-MacOSX/solr/core/src/test-files/solr/collection1/conf/open-exchange-rates.json to /configs/conf1/open-exchange-rates.json
[junit4] 2> 3338866 INFO (TEST-TestReqParamsAPI.test-seed#[949EE1395DE755E0]) [ ] o.a.s.c.c.SolrZkClient makePath: /configs/conf1/open-exchange-rates.json
[junit4] 2> 3338869 INFO (TEST-TestReqParamsAPI.test-seed#[949EE1395DE755E0]) [ ] o.a.s.c.AbstractZkTestCase put /Users/jenkins/workspace/Lucene-Solr-6.x-MacOSX/solr/core/src/test-files/solr/collection1/conf/mapping-ISOLatin1Accent.txt to /configs/conf1/mapping-ISOLatin1Accent.txt
[junit4] 2> 3338870 INFO (TEST-TestReqParamsAPI.test-seed#[949EE1395DE755E0]) [ ] o.a.s.c.c.SolrZkClient makePath: /configs/conf1/mapping-ISOLatin1Accent.txt
[junit4] 2> 3338873 INFO (TEST-TestReqParamsAPI.test-seed#[949EE1395DE755E0]) [ ] o.a.s.c.AbstractZkTestCase put /Users/jenkins/workspace/Lucene-Solr-6.x-MacOSX/solr/core/src/test-files/solr/collection1/conf/old_synonyms.txt to /configs/conf1/old_synonyms.txt
[junit4] 2> 3338873 INFO (TEST-TestReqParamsAPI.test-seed#[949EE1395DE755E0]) [ ] o.a.s.c.c.SolrZkClient makePath: /configs/conf1/old_synonyms.txt
[junit4] 2> 3338877 INFO (TEST-TestReqParamsAPI.test-seed#[949EE1395DE755E0]) [ ] o.a.s.c.AbstractZkTestCase put /Users/jenkins/workspace/Lucene-Solr-6.x-MacOSX/solr/core/src/test-files/solr/collection1/conf/synonyms.txt to /configs/conf1/synonyms.txt
[junit4] 2> 3338877 INFO (TEST-TestReqParamsAPI.test-seed#[949EE1395DE755E0]) [ ] o.a.s.c.c.SolrZkClient makePath: /configs/conf1/synonyms.txt
[junit4] 2> 3342866 INFO (TEST-TestReqParamsAPI.test-seed#[949EE1395DE755E0]) [ ] o.a.s.SolrTestCaseJ4 Writing core.properties file to /Users/jenkins/workspace/Lucene-Solr-6.x-MacOSX/solr/build/solr-core/test/J0/temp/solr.handler.TestReqParamsAPI_949EE1395DE755E0-001/control-001/cores/collection1
[junit4] 2> 3342869 INFO (TEST-TestReqParamsAPI.test-seed#[949EE1395DE755E0]) [ ] o.e.j.s.Server jetty-9.3.8.v20160314
[junit4] 2> 3342871 INFO (TEST-TestReqParamsAPI.test-seed#[949EE1395DE755E0]) [ ] o.e.j.s.h.ContextHandler Started o.e.j.s.ServletContextHandler@15615b57{/_p/zt,null,AVAILABLE}
[junit4] 2> 3342872 INFO (TEST-TestReqParamsAPI.test-seed#[949EE1395DE755E0]) [ ] o.e.j.s.ServerConnector Started ServerConnector@672705c3{HTTP/1.1,[http/1.1]}{127.0.0.1:57377}
[junit4] 2> 3342873 INFO (TEST-TestReqParamsAPI.test-seed#[949EE1395DE755E0]) [ ] o.e.j.s.Server Started @3347738ms
[junit4] 2> 3342873 INFO (TEST-TestReqParamsAPI.test-seed#[949EE1395DE755E0]) [ ] o.a.s.c.s.e.JettySolrRunner Jetty properties: {solr.data.dir=/Users/jenkins/workspace/Lucene-Solr-6.x-MacOSX/solr/build/solr-core/test/J0/temp/solr.handler.TestReqParamsAPI_949EE1395DE755E0-001/tempDir-001/control/data, hostContext=/_p/zt, hostPort=57377, coreRootDirectory=/Users/jenkins/workspace/Lucene-Solr-6.x-MacOSX/solr/build/solr-core/test/J0/../../../../../../../../../Users/jenkins/workspace/Lucene-Solr-6.x-MacOSX/solr/build/solr-core/test/J0/temp/solr.handler.TestReqParamsAPI_949EE1395DE755E0-001/control-001/cores}
[junit4] 2> 3342874 INFO (TEST-TestReqParamsAPI.test-seed#[949EE1395DE755E0]) [ ] o.a.s.s.SolrDispatchFilter SolrDispatchFilter.init(): sun.misc.Launcher$AppClassLoader@4554617c
[junit4] 2> 3342874 INFO (TEST-TestReqParamsAPI.test-seed#[949EE1395DE755E0]) [ ] o.a.s.c.SolrResourceLoader new SolrResourceLoader for directory: '/Users/jenkins/workspace/Lucene-Solr-6.x-MacOSX/solr/build/solr-core/test/J0/temp/solr.handler.TestReqParamsAPI_949EE1395DE755E0-001/control-001'
[junit4] 2> 3342874 INFO (TEST-TestReqParamsAPI.test-seed#[949EE1395DE755E0]) [ ] o.a.s.c.SolrResourceLoader JNDI not configured for solr (NoInitialContextEx)
[junit4] 2> 3342874 INFO (TEST-TestReqParamsAPI.test-seed#[949EE1395DE755E0]) [ ] o.a.s.c.SolrResourceLoader solr home defaulted to 'solr/' (could not find system property or JNDI)
[junit4] 2> 3342875 INFO (TEST-TestReqParamsAPI.test-seed#[949EE1395DE755E0]) [ ] o.a.s.c.c.SolrZkClient Using default ZkCredentialsProvider
[junit4] 2> 3342876 INFO (TEST-TestReqParamsAPI.test-seed#[949EE1395DE755E0]) [ ] o.a.s.c.c.ConnectionManager Waiting for client to connect to ZooKeeper
[junit4] 2> 3342878 INFO (zkCallback-11188-thread-1) [ ] o.a.s.c.c.ConnectionManager Watcher org.apache.solr.common.cloud.ConnectionManager@46bf4586 name:ZooKeeperConnection Watcher:127.0.0.1:57365/solr got event WatchedEvent state:SyncConnected type:None path:null path:null type:None
[junit4] 2> 3342878 INFO (TEST-TestReqParamsAPI.test-seed#[949EE1395DE755E0]) [ ] o.a.s.c.c.ConnectionManager Client is connected to ZooKeeper
[junit4] 2> 3342879 INFO (TEST-TestReqParamsAPI.test-seed#[949EE1395DE755E0]) [ ] o.a.s.c.c.SolrZkClient Using default ZkACLProvider
[junit4] 2> 3342881 INFO (TEST-TestReqParamsAPI.test-seed#[949EE1395DE755E0]) [ ] o.a.s.s.SolrDispatchFilter Loading solr.xml from SolrHome (not found in ZooKeeper)
[junit4] 2> 3342882 INFO (TEST-TestReqParamsAPI.test-seed#[949EE1395DE755E0]) [ ] o.a.s.c.SolrXmlConfig Loading container configuration from /Users/jenkins/workspace/Lucene-Solr-6.x-MacOSX/solr/build/solr-core/test/J0/temp/solr.handler.TestReqParamsAPI_949EE1395DE755E0-001/control-001/solr.xml
[junit4] 2> 3342924 INFO (TEST-TestReqParamsAPI.test-seed#[949EE1395DE755E0]) [ ] o.a.s.c.CorePropertiesLocator Config-defined core root directory: /Users/jenkins/workspace/Lucene-Solr-6.x-MacOSX/solr/build/solr-core/test/J0/../../../../../../../../../Users/jenkins/workspace/Lucene-Solr-6.x-MacOSX/solr/build/solr-core/test/J0/temp/solr.handler.TestReqParamsAPI_949EE1395DE755E0-001/control-001/cores
[junit4] 2> 3342927 INFO (TEST-TestReqParamsAPI.test-seed#[949EE1395DE755E0]) [ ] o.a.s.c.CoreContainer New CoreContainer 1607651327
[junit4] 2> 3342928 INFO (TEST-TestReqParamsAPI.test-seed#[949EE1395DE755E0]) [ ] o.a.s.c.CoreContainer Loading cores into CoreContainer [instanceDir=/Users/jenkins/workspace/Lucene-Solr-6.x-MacOSX/solr/build/solr-core/test/J0/temp/solr.handler.TestReqParamsAPI_949EE1395DE755E0-001/control-001]
[junit4] 2> 3342929 WARN (TEST-TestReqParamsAPI.test-seed#[949EE1395DE755E0]) [ ] o.a.s.c.CoreContainer Couldn't add files from /Users/jenkins/workspace/Lucene-Solr-6.x-MacOSX/solr/build/solr-core/test/J0/temp/solr.handler.TestReqParamsAPI_949EE1395DE755E0-001/control-001/lib to classpath: /Users/jenkins/workspace/Lucene-Solr-6.x-MacOSX/solr/build/solr-core/test/J0/temp/solr.handler.TestReqParamsAPI_949EE1395DE755E0-001/control-001/lib
[junit4] 2> 3342929 INFO (TEST-TestReqParamsAPI.test-seed#[949EE1395DE755E0]) [ ] o.a.s.h.c.HttpShardHandlerFactory created with socketTimeout : 90000,urlScheme : ,connTimeout : 15000,maxConnectionsPerHost : 20,maxConnections : 10000,corePoolSize : 0,maximumPoolSize : 2147483647,maxThreadIdleTime : 5,sizeOfQueue : -1,fairnessPolicy : false,useRetries : false,
[junit4] 2> 3342936 INFO (TEST-TestReqParamsAPI.test-seed#[949EE1395DE755E0]) [ ] o.a.s.u.UpdateShardHandler Creating UpdateShardHandler HTTP client with params: socketTimeout=340000&connTimeout=45000&retry=true
[junit4] 2> 3342937 INFO (TEST-TestReqParamsAPI.test-seed#[949EE1395DE755E0]) [ ] o.a.s.l.LogWatcher SLF4J impl is org.slf4j.impl.Log4jLoggerFactory
[junit4] 2> 3342937 INFO (TEST-TestReqParamsAPI.test-seed#[949EE1395DE755E0]) [ ] o.a.s.l.LogWatcher Registering Log Listener [Log4j (org.slf4j.impl.Log4jLoggerFactory)]
[junit4] 2> 3342938 INFO (TEST-TestReqParamsAPI.test-seed#[949EE1395DE755E0]) [ ] o.a.s.c.ZkContainer Zookeeper client=127.0.0.1:57365/solr
[junit4] 2> 3342938 INFO (TEST-TestReqParamsAPI.test-seed#[949EE1395DE755E0]) [ ] o.a.s.c.ZkController zkHost includes chroot
[junit4] 2> 3342938 INFO (TEST-TestReqParamsAPI.test-seed#[949EE1395DE755E0]) [ ] o.a.s.c.c.SolrZkClient Using default ZkCredentialsProvider
[junit4] 2> 3342941 INFO (TEST-TestReqParamsAPI.test-seed#[949EE1395DE755E0]) [ ] o.a.s.c.c.ConnectionManager Waiting for client to connect to ZooKeeper
[junit4] 2> 3342943 INFO (zkCallback-11191-thread-1) [ ] o.a.s.c.c.ConnectionManager Watcher org.apache.solr.common.cloud.ConnectionManager@483e0f99 name:ZooKeeperConnection Watcher:127.0.0.1:57365 got event WatchedEvent state:SyncConnected type:None path:null path:null type:None
[junit4] 2> 3342943 INFO (TEST-TestReqParamsAPI.test-seed#[949EE1395DE755E0]) [ ] o.a.s.c.c.ConnectionManager Client is connected to ZooKeeper
[junit4] 2> 3342944 INFO (TEST-TestReqParamsAPI.test-seed#[949EE1395DE755E0]) [ ] o.a.s.c.c.SolrZkClient Using default ZkACLProvider
[junit4] 2> 3342950 INFO (TEST-TestReqParamsAPI.test-seed#[949EE1395DE755E0]) [n:127.0.0.1:57377__p%2Fzt ] o.a.s.c.ZkController Added new OnReconnect listener org.apache.solr.cloud.ZkController$$Lambda$28/2126255137@67198854
[junit4] 2> 3342952 INFO (TEST-TestReqParamsAPI.test-seed#[949EE1395DE755E0]) [n:127.0.0.1:57377__p%2Fzt ] o.a.s.c.c.ConnectionManager Waiting for client to connect to ZooKeeper
[junit4] 2> 3342952 INFO (zkCallback-11192-thread-1-processing-n:127.0.0.1:57377__p%2Fzt) [n:127.0.0.1:57377__p%2Fzt ] o.a.s.c.c.ConnectionManager Watcher org.apache.solr.common.cloud.ConnectionManager@71b875cc name:ZooKeeperConnection Watcher:127.0.0.1:57365/solr got event WatchedEvent state:SyncConnected type:None path:null path:null type:None
[junit4] 2> 3342953 INFO (TEST-TestReqParamsAPI.test-seed#[949EE1395DE755E0]) [n:127.0.0.1:57377__p%2Fzt ] o.a.s.c.c.ConnectionManager Client is connected to ZooKeeper
[junit4] 2> 3342957 INFO (TEST-TestReqParamsAPI.test-seed#[949EE1395DE755E0]) [n:127.0.0.1:57377__p%2Fzt ] o.a.s.c.c.SolrZkClient makePath: /overseer/queue
[junit4] 2> 3342965 INFO (TEST-TestReqParamsAPI.test-seed#[949EE1395DE755E0]) [n:127.0.0.1:57377__p%2Fzt ] o.a.s.c.c.SolrZkClient makePath: /overseer/collection-queue-work
[junit4] 2> 3342973 INFO (TEST-TestReqParamsAPI.test-seed#[949EE1395DE755E0]) [n:127.0.0.1:57377__p%2Fzt ] o.a.s.c.c.SolrZkClient makePath: /overseer/collection-map-running
[junit4] 2> 3342977 INFO (TEST-TestReqParamsAPI.test-seed#[949EE1395DE755E0]) [n:127.0.0.1:57377__p%2Fzt ] o.a.s.c.c.SolrZkClient makePath: /overseer/collection-map-completed
[junit4] 2> 3342981 INFO (TEST-TestReqParamsAPI.test-seed#[949EE1395DE755E0]) [n:127.0.0.1:57377__p%2Fzt ] o.a.s.c.c.SolrZkClient makePath: /overseer/collection-map-failure
[junit4] 2> 3342985 INFO (TEST-TestReqParamsAPI.test-seed#[949EE1395DE755E0]) [n:127.0.0.1:57377__p%2Fzt ] o.a.s.c.c.SolrZkClient makePath: /live_nodes
[junit4] 2> 3342988 INFO (TEST-TestReqParamsAPI.test-seed#[949EE1395DE755E0]) [n:127.0.0.1:57377__p%2Fzt ] o.a.s.c.c.SolrZkClient makePath: /aliases.json
[junit4] 2> 3342991 INFO (TEST-TestReqParamsAPI.test-seed#[949EE1395DE755E0]) [n:127.0.0.1:57377__p%2Fzt ] o.a.s.c.c.SolrZkClient makePath: /clusterstate.json
[junit4] 2> 3342994 INFO (TEST-TestReqParamsAPI.test-seed#[949EE1395DE755E0]) [n:127.0.0.1:57377__p%2Fzt ] o.a.s.c.c.SolrZkClient makePath: /security.json
[junit4] 2> 3342997 INFO (TEST-TestReqParamsAPI.test-seed#[949EE1395DE755E0]) [n:127.0.0.1:57377__p%2Fzt ] o.a.s.c.c.ZkStateReader Updating cluster state from ZooKeeper...
[junit4] 2> 3342998 INFO (TEST-TestReqParamsAPI.test-seed#[949EE1395DE755E0]) [n:127.0.0.1:57377__p%2Fzt ] o.a.s.c.c.ZkStateReader Loaded empty cluster properties
[junit4] 2> 3342999 INFO (TEST-TestReqParamsAPI.test-seed#[949EE1395DE755E0]) [n:127.0.0.1:57377__p%2Fzt ] o.a.s.c.c.ZkStateReader Updated live nodes from ZooKeeper... (0) -> (0)
[junit4] 2> 3343005 INFO (TEST-TestReqParamsAPI.test-seed#[949EE1395DE755E0]) [n:127.0.0.1:57377__p%2Fzt ] o.a.s.c.c.SolrZkClient makePath: /overseer_elect
[junit4] 2> 3343008 INFO (TEST-TestReqParamsAPI.test-seed#[949EE1395DE755E0]) [n:127.0.0.1:57377__p%2Fzt ] o.a.s.c.c.SolrZkClient makePath: /overseer_elect/election
[junit4] 2> 3343010 INFO (TEST-TestReqParamsAPI.test-seed#[949EE1395DE755E0]) [n:127.0.0.1:57377__p%2Fzt ] o.a.s.c.Overseer Overseer (id=null) closing
[junit4] 2> 3343013 INFO (TEST-TestReqParamsAPI.test-seed#[949EE1395DE755E0]) [n:127.0.0.1:57377__p%2Fzt ] o.a.s.c.LeaderElector Joined leadership election with path: /overseer_elect/election/95948277463187460-127.0.0.1:57377__p%2Fzt-n_0000000000
[junit4] 2> 3343016 INFO (TEST-TestReqParamsAPI.test-seed#[949EE1395DE755E0]) [n:127.0.0.1:57377__p%2Fzt ] o.a.s.c.OverseerElectionContext I am going to be the leader 127.0.0.1:57377__p%2Fzt
[junit4] 2> 3343016 INFO (TEST-TestReqParamsAPI.test-seed#[949EE1395DE755E0]) [n:127.0.0.1:57377__p%2Fzt ] o.a.s.c.c.SolrZkClient makePath: /overseer_elect/leader
[junit4] 2> 3343028 INFO (TEST-TestReqParamsAPI.test-seed#[949EE1395DE755E0]) [n:127.0.0.1:57377__p%2Fzt ] o.a.s.c.Overseer Overseer (id=95948277463187460-127.0.0.1:57377__p%2Fzt-n_0000000000) starting
[junit4] 2> 3343032 INFO (TEST-TestReqParamsAPI.test-seed#[949EE1395DE755E0]) [n:127.0.0.1:57377__p%2Fzt ] o.a.s.c.c.SolrZkClient makePath: /overseer/queue-work
[junit4] 2> 3343044 INFO (TEST-TestReqParamsAPI.test-seed#[949EE1395DE755E0]) [n:127.0.0.1:57377__p%2Fzt ] o.a.s.c.OverseerAutoReplicaFailoverThread Starting OverseerAutoReplicaFailoverThread autoReplicaFailoverWorkLoopDelay=10000 autoReplicaFailoverWaitAfterExpiration=30000 autoReplicaFailoverBadNodeExpiration=60000
[junit4] 2> 3343044 INFO (OverseerCollectionConfigSetProcessor-95948277463187460-127.0.0.1:57377__p%2Fzt-n_0000000000) [n:127.0.0.1:57377__p%2Fzt ] o.a.s.c.OverseerTaskProcessor Process current queue of overseer operations
[junit4] 2> 3343045 INFO (OverseerStateUpdate-95948277463187460-127.0.0.1:57377__p%2Fzt-n_0000000000) [n:127.0.0.1:57377__p%2Fzt ] o.a.s.c.Overseer Starting to work on the main queue
[junit4] 2> 3343046 INFO (TEST-TestReqParamsAPI.test-seed#[949EE1395DE755E0]) [n:127.0.0.1:57377__p%2Fzt ] o.a.s.c.ZkController Register node as live in ZooKeeper:/live_nodes/127.0.0.1:57377__p%2Fzt
[junit4] 2> 3343047 INFO (TEST-TestReqParamsAPI.test-seed#[949EE1395DE755E0]) [n:127.0.0.1:57377__p%2Fzt ] o.a.s.c.c.SolrZkClient makePath: /live_nodes/127.0.0.1:57377__p%2Fzt
[junit4] 2> 3343050 INFO (OverseerStateUpdate-95948277463187460-127.0.0.1:57377__p%2Fzt-n_0000000000) [n:127.0.0.1:57377__p%2Fzt ] o.a.s.c.c.ZkStateReader Updated live nodes from ZooKeeper... (0) -> (0)
[junit4] 2> 3343051 INFO (zkCallback-11192-thread-1-processing-n:127.0.0.1:57377__p%2Fzt) [n:127.0.0.1:57377__p%2Fzt ] o.a.s.c.c.ZkStateReader A live node change: [WatchedEvent state:SyncConnected type:NodeChildrenChanged path:/live_nodes], has occurred - updating... (live nodes size: [0])
[junit4] 2> 3343052 INFO (zkCallback-11192-thread-1-processing-n:127.0.0.1:57377__p%2Fzt) [n:127.0.0.1:57377__p%2Fzt ] o.a.s.c.c.ZkStateReader Updated live nodes from ZooKeeper... (0) -> (1)
[junit4] 2> 3343091 INFO (TEST-TestReqParamsAPI.test-seed#[949EE1395DE755E0]) [n:127.0.0.1:57377__p%2Fzt ] o.a.s.c.CoreContainer Security conf doesn't exist. Skipping setup for authorization module.
[junit4] 2> 3343092 INFO (TEST-TestReqParamsAPI.test-seed#[949EE1395DE755E0]) [n:127.0.0.1:57377__p%2Fzt ] o.a.s.c.CoreContainer No authentication plugin used.
[junit4] 2> 3343096 INFO (TEST-TestReqParamsAPI.test-seed#[949EE1395DE755E0]) [n:127.0.0.1:57377__p%2Fzt ] o.a.s.c.CorePropertiesLocator Looking for core definitions underneath /Users/jenkins/workspace/Lucene-Solr-6.x-MacOSX/solr/build/solr-core/test/J0/../../../../../../../../../Users/jenkins/workspace/Lucene-Solr-6.x-MacOSX/solr/build/solr-core/test/J0/temp/solr.handler.TestReqParamsAPI_949EE1395DE755E0-001/control-001/cores
[junit4] 2> 3343098 INFO (TEST-TestReqParamsAPI.test-seed#[949EE1395DE755E0]) [n:127.0.0.1:57377__p%2Fzt ] o.a.s.c.CoreDescriptor Created CoreDescriptor: {name=collection1, config=solrconfig.xml, transient=false, schema=schema.xml, loadOnStartup=true, configSetProperties=configsetprops.json, collection=control_collection, coreNodeName=, dataDir=data/, shard=}
[junit4] 2> 3343099 INFO (TEST-TestReqParamsAPI.test-seed#[949EE1395DE755E0]) [n:127.0.0.1:57377__p%2Fzt ] o.a.s.c.CorePropertiesLocator Found core collection1 in /Users/jenkins/workspace/Lucene-Solr-6.x-MacOSX/solr/build/solr-core/test/J0/../../../../../../../../../Users/jenkins/workspace/Lucene-Solr-6.x-MacOSX/solr/build/solr-core/test/J0/temp/solr.handler.TestReqParamsAPI_949EE1395DE755E0-001/control-001/cores/collection1
[junit4] 2> 3343099 INFO (TEST-TestReqParamsAPI.test-seed#[949EE1395DE755E0]) [n:127.0.0.1:57377__p%2Fzt ] o.a.s.c.CorePropertiesLocator Found 1 core definitions
[junit4] 2> 3343100 INFO (coreLoadExecutor-10733-thread-1-processing-n:127.0.0.1:57377__p%2Fzt) [n:127.0.0.1:57377__p%2Fzt c:control_collection x:collection1] o.a.s.c.ZkController publishing state=down
[junit4] 2> 3343100 INFO (coreLoadExecutor-10733-thread-1-processing-n:127.0.0.1:57377__p%2Fzt) [n:127.0.0.1:57377__p%2Fzt c:control_collection x:collection1] o.a.s.c.ZkController numShards not found on descriptor - reading it from system property
[junit4] 2> 3343102 INFO (TEST-TestReqParamsAPI.test-seed#[949EE1395DE755E0]) [n:127.0.0.1:57377__p%2Fzt ] o.a.s.s.SolrDispatchFilter user.dir=/Users/jenkins/workspace/Lucene-Solr-6.x-MacOSX/solr/build/solr-core/test/J0
[junit4] 2> 3343102 INFO (TEST-TestReqParamsAPI.test-seed#[949EE1395DE755E0]) [n:127.0.0.1:57377__p%2Fzt ] o.a.s.s.SolrDispatchFilter SolrDispatchFilter.init() done
[junit4] 2> 3343103 INFO (coreLoadExecutor-10733-thread-1-processing-n:127.0.0.1:57377__p%2Fzt) [n:127.0.0.1:57377__p%2Fzt c:control_collection x:collection1] o.a.s.c.ZkController Collection control_collection not visible yet, but flagging it so a watch is registered when it becomes visible
[junit4] 2> 3343104 INFO (OverseerStateUpdate-95948277463187460-127.0.0.1:57377__p%2Fzt-n_0000000000) [n:127.0.0.1:57377__p%2Fzt ] o.a.s.c.Overseer processMessage: queueSize: 1, message = {
[junit4] 2> "core":"collection1",
[junit4] 2> "roles":null,
[junit4] 2> "base_url":"http://127.0.0.1:57377/_p/zt",
[junit4] 2> "node_name":"127.0.0.1:57377__p%2Fzt",
[junit4] 2> "numShards":"1",
[junit4] 2> "state":"down",
[junit4] 2> "shard":null,
[junit4] 2> "collection":"control_collection",
[junit4] 2> "operation":"state"} current state version: 0
[junit4] 2> 3343104 INFO (OverseerStateUpdate-95948277463187460-127.0.0.1:57377__p%2Fzt-n_0000000000) [n:127.0.0.1:57377__p%2Fzt ] o.a.s.c.o.ReplicaMutator Update state numShards=1 message={
[junit4] 2> "core":"collection1",
[junit4] 2> "roles":null,
[junit4] 2> "base_url":"http://127.0.0.1:57377/_p/zt",
[junit4] 2> "node_name":"127.0.0.1:57377__p%2Fzt",
[junit4] 2> "numShards":"1",
[junit4] 2> "state":"down",
[junit4] 2> "shard":null,
[junit4] 2> "collection":"control_collection",
[junit4] 2> "operation":"state"}
[junit4] 2> 3343104 INFO (coreLoadExecutor-10733-thread-1-processing-n:127.0.0.1:57377__p%2Fzt) [n:127.0.0.1:57377__p%2Fzt c:control_collection x:collection1] o.a.s.c.c.ZkStateReader Deleting data for [control_collection]
[junit4] 2> 3343105 INFO (OverseerStateUpdate-95948277463187460-127.0.0.1:57377__p%2Fzt-n_0000000000) [n:127.0.0.1:57377__p%2Fzt ] o.a.s.c.o.ClusterStateMutator building a new cName: control_collection
[junit4] 2> 3343106 INFO (OverseerStateUpdate-95948277463187460-127.0.0.1:57377__p%2Fzt-n_0000000000) [n:127.0.0.1:57377__p%2Fzt ] o.a.s.c.o.ReplicaMutator Assigning new node to shard shard=shard1
[junit4] 2> 3343106 INFO (coreLoadExecutor-10733-thread-1-processing-n:127.0.0.1:57377__p%2Fzt) [n:127.0.0.1:57377__p%2Fzt c:control_collection x:collection1] o.a.s.c.ZkController look for our core node name
[junit4] 2> 3343109 INFO (zkCallback-11192-thread-1-processing-n:127.0.0.1:57377__p%2Fzt) [n:127.0.0.1:57377__p%2Fzt ] o.a.s.c.c.ZkStateReader A cluster state change: [WatchedEvent state:SyncConnected type:NodeDataChanged path:/clusterstate.json], has occurred - updating... (live nodes size: [1])
[junit4] 2> 3344117 INFO (coreLoadExecutor-10733-thread-1-processing-n:127.0.0.1:57377__p%2Fzt) [n:127.0.0.1:57377__p%2Fzt c:control_collection x:collection1] o.a.s.c.ZkController waiting to find shard id in clusterstate for collection1
[junit4] 2> 3344118 INFO (coreLoadExecutor-10733-thread-1-processing-n:127.0.0.1:57377__p%2Fzt) [n:127.0.0.1:57377__p%2Fzt c:control_collection x:collection1] o.a.s.c.ZkController Check for collection zkNode:control_collection
[junit4] 2> 3344118 INFO (coreLoadExecutor-10733-thread-1-processing-n:127.0.0.1:57377__p%2Fzt) [n:127.0.0.1:57377__p%2Fzt c:control_collection x:collection1] o.a.s.c.ZkController Collection zkNode exists
[junit4] 2> 3344119 INFO (coreLoadExecutor-10733-thread-1-processing-n:127.0.0.1:57377__p%2Fzt) [n:127.0.0.1:57377__p%2Fzt c:control_collection x:collection1] o.a.s.c.c.ZkStateReader Load collection config from: [/collections/control_collection]
[junit4] 2> 3344120 INFO (coreLoadExecutor-10733-thread-1-processing-n:127.0.0.1:57377__p%2Fzt) [n:127.0.0.1:57377__p%2Fzt c:control_collection x:collection1] o.a.s.c.c.ZkStateReader path=[/collections/control_collection] [configName]=[conf1] specified config exists in ZooKeeper
[junit4] 2> 3344120 INFO (coreLoadExecutor-10733-thread-1-processing-n:127.0.0.1:57377__p%2Fzt) [n:127.0.0.1:57377__p%2Fzt c:control_collection x:collection1] o.a.s.c.SolrResourceLoader new SolrResourceLoader for directory: '/Users/jenkins/workspace/Lucene-Solr-6.x-MacOSX/solr/build/solr-core/test/J0/temp/solr.handler.TestReqParamsAPI_949EE1395DE755E0-001/control-001/cores/collection1'
[junit4] 2> 3344120 INFO (coreLoadExecutor-10733-thread-1-processing-n:127.0.0.1:57377__p%2Fzt) [n:127.0.0.1:57377__p%2Fzt c:control_collection x:collection1] o.a.s.c.SolrResourceLoader JNDI not configured for solr (NoInitialContextEx)
[junit4] 2> 3344120 INFO (coreLoadExecutor-10733-thread-1-processing-n:127.0.0.1:57377__p%2Fzt) [n:127.0.0.1:57377__p%2Fzt c:control_collection x:collection1] o.a.s.c.SolrResourceLoader solr home defaulted to 'solr/' (could not find system property or JNDI)
[junit4] 2> 3344123 INFO (coreLoadExecutor-10733-thread-1-processing-n:127.0.0.1:57377__p%2Fzt) [n:127.0.0.1:57377__p%2Fzt c:control_collection x:collection1] o.a.s.c.Config loaded config solrconfig.xml with version 0
[junit4] 2> 3344142 INFO (coreLoadExecutor-10733-thread-1-processing-n:127.0.0.1:57377__p%2Fzt) [n:127.0.0.1:57377__p%2Fzt c:control_collection x:collection1] o.a.s.c.SolrConfig current version of requestparams : -1
[junit4] 2> 3344145 WARN (coreLoadExecutor-10733-thread-1-processing-n:127.0.0.1:57377__p%2Fzt) [n:127.0.0.1:57377__p%2Fzt c:control_collection x:collection1] o.a.s.c.Config Beginning with Solr 5.5, <mergePolicy> is deprecated, use <mergePolicyFactory> instead.
[junit4] 2> 3344146 INFO (coreLoadExecutor-10733-thread-1-processing-n:127.0.0.1:57377__p%2Fzt) [n:127.0.0.1:57377__p%2Fzt c:control_collection x:collection1] o.a.s.c.SolrConfig Using Lucene MatchVersion: 6.1.0
[junit4] 2> 3344155 INFO (coreLoadExecutor-10733-thread-1-processing-n:127.0.0.1:57377__p%2Fzt) [n:127.0.0.1:57377__p%2Fzt c:control_collection x:collection1] o.a.s.c.SolrConfig Loaded SolrConfig: solrconfig.xml
[junit4] 2> 3344164 INFO (coreLoadExecutor-10733-thread-1-processing-n:127.0.0.1:57377__p%2Fzt) [n:127.0.0.1:57377__p%2Fzt c:control_collection x:collection1] o.a.s.s.IndexSchema [collection1] Schema name=test
[junit4] 2> 3344268 INFO (coreLoadExecutor-10733-thread-1-processing-n:127.0.0.1:57377__p%2Fzt) [n:127.0.0.1:57377__p%2Fzt c:control_collection x:collection1] o.a.s.s.OpenExchangeRatesOrgProvider Initialized with rates=open-exchange-rates.json, refreshInterval=1440.
[junit4] 2> 3344276 INFO (coreLoadExecutor-10733-thread-1-processing-n:127.0.0.1:57377__p%2Fzt) [n:127.0.0.1:57377__p%2Fzt c:control_collection x:collection1] o.a.s.s.IndexSchema default search field in schema is text
[junit4] 2> 3344278 INFO (coreLoadExecutor-10733-thread-1-processing-n:127.0.0.1:57377__p%2Fzt) [n:127.0.0.1:57377__p%2Fzt c:control_collection x:collection1] o.a.s.s.IndexSchema unique key field: id
[junit4] 2> 3344299 INFO (coreLoadExecutor-10733-thread-1-processing-n:127.0.0.1:57377__p%2Fzt) [n:127.0.0.1:57377__p%2Fzt c:control_collection x:collection1] o.a.s.s.FileExchangeRateProvider Reloading exchange rates from file currency.xml
[junit4] 2> 3344302 INFO (coreLoadExecutor-10733-thread-1-processing-n:127.0.0.1:57377__p%2Fzt) [n:127.0.0.1:57377__p%2Fzt c:control_collection x:collection1] o.a.s.s.FileExchangeRateProvider Reloading exchange rates from file currency.xml
[junit4] 2> 3344307 INFO (coreLoadExecutor-10733-thread-1-processing-n:127.0.0.1:57377__p%2Fzt) [n:127.0.0.1:57377__p%2Fzt c:control_collection x:collection1] o.a.s.s.OpenExchangeRatesOrgProvider Reloading exchange rates from open-exchange-rates.json
[junit4] 2> 3344308 INFO (coreLoadExecutor-10733-thread-1-processing-n:127.0.0.1:57377__p%2Fzt) [n:127.0.0.1:57377__p%2Fzt c:control_collection x:collection1] o.a.s.s.OpenExchangeRatesOrgProvider Reloading exchange rates from open-exchange-rates.json
[junit4] 2> 3344314 INFO (coreLoadExecutor-10733-thread-1-processing-n:127.0.0.1:57377__p%2Fzt) [n:127.0.0.1:57377__p%2Fzt c:control_collection x:collection1] o.a.s.c.ConfigSetProperties Did not find ConfigSet properties, assuming default properties: Can't find resource 'configsetprops.json' in classpath or '/configs/conf1', cwd=/Users/jenkins/workspace/Lucene-Solr-6.x-MacOSX/solr/build/solr-core/test/J0
[junit4] 2> 3344314 INFO (coreLoadExecutor-10733-thread-1-processing-n:127.0.0.1:57377__p%2Fzt) [n:127.0.0.1:57377__p%2Fzt c:control_collection x:collection1] o.a.s.c.CoreContainer Creating SolrCore 'collection1' using configuration from collection control_collection
[junit4] 2> 3344314 INFO (coreLoadExecutor-10733-thread-1-processing-n:127.0.0.1:57377__p%2Fzt) [n:127.0.0.1:57377__p%2Fzt c:control_collection s:shard1 r:core_node1 x:collection1] o.a.s.c.SolrCore org.apache.solr.core.MockDirectoryFactory
[junit4] 2> 3344314 INFO (coreLoadExecutor-10733-thread-1-processing-n:127.0.0.1:57377__p%2Fzt) [n:127.0.0.1:57377__p%2Fzt c:control_collection s:shard1 r:core_node1 x:collection1] o.a.s.c.SolrCore [[collection1] ] Opening new SolrCore at [/Users/jenkins/workspace/Lucene-Solr-6.x-MacOSX/solr/build/solr-core/test/J0/temp/solr.handler.TestReqParamsAPI_949EE1395DE755E0-001/control-001/cores/collection1], dataDir=[/Users/jenkins/workspace/Lucene-Solr-6.x-MacOSX/solr/build/solr-core/test/J0/../../../../../../../../../Users/jenkins/workspace/Lucene-Solr-6.x-MacOSX/solr/build/solr-core/test/J0/temp/solr.handler.TestReqParamsAPI_949EE1395DE755E0-001/control-001/cores/collection1/data/]
[junit4] 2> 3344315 INFO (coreLoadExecutor-10733-thread-1-processing-n:127.0.0.1:57377__p%2Fzt) [n:127.0.0.1:57377__p%2Fzt c:control_collection s:shard1 r:core_node1 x:collection1] o.a.s.c.JmxMonitoredMap JMX monitoring is enabled. Adding Solr mbeans to JMX Server: com.sun.jmx.mbeanserver.JmxMBeanServer@4019376a
[junit4] 2> 3344315 INFO (coreLoadExecutor-10733-thread-1-processing-n:127.0.0.1:57377__p%2Fzt) [n:127.0.0.1:57377__p%2Fzt c:control_collection s:shard1 r:core_node1 x:collection1] o.a.s.c.CachingDirectoryFactory return new directory for /Users/jenkins/workspace/Lucene-Solr-6.x-MacOSX/solr/build/solr-core/test/J0/../../../../../../../../../Users/jenkins/workspace/Lucene-Solr-6.x-MacOSX/solr/build/solr-core/test/J0/temp/solr.handler.TestReqParamsAPI_949EE1395DE755E0-001/control-001/cores/collection1/data
[junit4] 2> 3344316 INFO (coreLoadExecutor-10733-thread-1-processing-n:127.0.0.1:57377__p%2Fzt) [n:127.0.0.1:57377__p%2Fzt c:control_collection s:shard1 r:core_node1 x:collection1] o.a.s.c.SolrCore New index directory detected: old=null new=/Users/jenkins/workspace/Lucene-Solr-6.x-MacOSX/solr/build/solr-core/test/J0/../../../../../../../../../Users/jenkins/workspace/Lucene-Solr-6.x-MacOSX/solr/build/solr-core/test/J0/temp/solr.handler.TestReqParamsAPI_949EE1395DE755E0-001/control-001/cores/collection1/data/index/
[junit4] 2> 3344316 WARN (coreLoadExecutor-10733-thread-1-processing-n:127.0.0.1:57377__p%2Fzt) [n:127.0.0.1:57377__p%2Fzt c:control_collection s:shard1 r:core_node1 x:collection1] o.a.s.c.SolrCore [collection1] Solr index directory '/Users/jenkins/workspace/Lucene-Solr-6.x-MacOSX/solr/build/solr-core/test/J0/../../../../../../../../../Users/jenkins/workspace/Lucene-Solr-6.x-MacOSX/solr/build/solr-core/test/J0/temp/solr.handler.TestReqParamsAPI_949EE1395DE755E0-001/control-001/cores/collection1/data/index' doesn't exist. Creating new index...
[junit4] 2> 3344316 INFO (coreLoadExecutor-10733-thread-1-processing-n:127.0.0.1:57377__p%2Fzt) [n:127.0.0.1:57377__p%2Fzt c:control_collection s:shard1 r:core_node1 x:collection1] o.a.s.c.CachingDirectoryFactory return new directory for /Users/jenkins/workspace/Lucene-Solr-6.x-MacOSX/solr/build/solr-core/test/J0/../../../../../../../../../Users/jenkins/workspace/Lucene-Solr-6.x-MacOSX/solr/build/solr-core/test/J0/temp/solr.handler.TestReqParamsAPI_949EE1395DE755E0-001/control-001/cores/collection1/data/index
[junit4] 2> 3344316 INFO (coreLoadExecutor-10733-thread-1-processing-n:127.0.0.1:57377__p%2Fzt) [n:127.0.0.1:57377__p%2Fzt c:control_collection s:shard1 r:core_node1 x:collection1] o.a.s.u.RandomMergePolicy RandomMergePolicy wrapping class org.apache.lucene.index.LogDocMergePolicy: [LogDocMergePolicy: minMergeSize=1000, mergeFactor=24, maxMergeSize=9223372036854775807, maxMergeSizeForForcedMerge=9223372036854775807, calibrateSizeByDeletes=true, maxMergeDocs=2147483647, maxCFSSegmentSizeMB=8.796093022207999E12, noCFSRatio=0.0]
[junit4] 2> 3344317 INFO (coreLoadExecutor-10733-thread-1-processing-n:127.0.0.1:57377__p%2Fzt) [n:127.0.0.1:57377__p%2Fzt c:control_collection s:shard1 r:core_node1 x:collection1] o.a.s.c.SolrDeletionPolicy SolrDeletionPolicy.onCommit: commits: num=1
[junit4] 2> commit{dir=MockDirectoryWrapper(RAMDirectory@10d86688 lockFactory=org.apache.lucene.store.SingleInstanceLockFactory@59216972),segFN=segments_1,generation=1}
[junit4] 2> 3344317 INFO (coreLoadExecutor-10733-thread-1-processing-n:127.0.0.1:57377__p%2Fzt) [n:127.0.0.1:57377__p%2Fzt c:control_collection s:shard1 r:core_node1 x:collection1] o.a.s.c.SolrDeletionPolicy newest commit generation = 1
[junit4] 2> 3344323 INFO (OldIndexDirectoryCleanupThreadForCore-collection1) [n:127.0.0.1:57377__p%2Fzt c:control_collection s:shard1 r:core_node1 x:collection1] o.a.s.c.SolrCore Looking for old index directories to cleanup for core collection1 in /Users/jenkins/workspace/Lucene-Solr-6.x-MacOSX/solr/build/solr-core/test/J0/../../../../../../../../../Users/jenkins/workspace/Lucene-Solr-6.x-MacOSX/solr/build/solr-core/test/J0/temp/solr.handler.TestReqParamsAPI_949EE1395DE755E0-001/control-001/cores/collection1/data/
[junit4] 2> 3344324 WARN (OldIndexDirectoryCleanupThreadForCore-collection1) [n:127.0.0.1:57377__p%2Fzt c:control_collection s:shard1 r:core_node1 x:collection1] o.a.s.c.DirectoryFactory /Users/jenkins/workspace/Lucene-Solr-6.x-MacOSX/solr/build/solr-core/test/J0/../../../../../../../../../Users/jenkins/workspace/Lucene-Solr-6.x-MacOSX/solr/build/solr-core/test/J0/temp/solr.handler.TestReqParamsAPI_949EE1395DE755E0-001/control-001/cores/collection1/data/ does not point to a valid data directory; skipping clean-up of old index directories.
[junit4] 2> 3344328 INFO (coreLoadExecutor-10733-thread-1-processing-n:127.0.0.1:57377__p%2Fzt) [n:127.0.0.1:57377__p%2Fzt c:control_collection s:shard1 r:core_node1 x:collection1] o.a.s.u.p.UpdateRequestProcessorChain creating updateRequestProcessorChain "nodistrib"
[junit4] 2> 3344328 INFO (coreLoadExecutor-10733-thread-1-processing-n:127.0.0.1:57377__p%2Fzt) [n:127.0.0.1:57377__p%2Fzt c:control_collection s:shard1 r:core_node1 x:collection1] o.a.s.u.p.UpdateRequestProcessorChain creating updateRequestProcessorChain "dedupe"
[junit4] 2> 3344329 INFO (coreLoadExecutor-10733-thread-1-processing-n:127.0.0.1:57377__p%2Fzt) [n:127.0.0.1:57377__p%2Fzt c:control_collection s:shard1 r:core_node1 x:collection1] o.a.s.u.p.UpdateRequestProcessorChain inserting DistributedUpdateProcessorFactory into updateRequestProcessorChain "dedupe"
[junit4] 2> 3344329 INFO (coreLoadExecutor-10733-thread-1-processing-n:127.0.0.1:57377__p%2Fzt) [n:127.0.0.1:57377__p%2Fzt c:control_collection s:shard1 r:core_node1 x:collection1] o.a.s.u.p.UpdateRequestProcessorChain creating updateRequestProcessorChain "stored_sig"
[junit4] 2> 3344329 INFO (coreLoadExecutor-10733-thread-1-processing-n:127.0.0.1:57377__p%2Fzt) [n:127.0.0.1:57377__p%2Fzt c:control_collection s:shard1 r:core_node1 x:collection1] o.a.s.u.p.UpdateRequestProcessorChain inserting DistributedUpdateProcessorFactory into updateRequestProcessorChain "stored_sig"
[junit4] 2> 3344329 INFO (coreLoadExecutor-10733-thread-1-processing-n:127.0.0.1:57377__p%2Fzt) [n:127.0.0.1:57377__p%2Fzt c:control_collection s:shard1 r:core_node1 x:collection1] o.a.s.u.p.UpdateRequestProcessorChain creating updateRequestProcessorChain "distrib-dup-test-chain-explicit"
[junit4] 2> 3344329 INFO (coreLoadExecutor-10733-thread-1-processing-n:127.0.0.1:57377__p%2Fzt) [n:127.0.0.1:57377__p%2Fzt c:control_collection s:shard1 r:core_node1 x:collection1] o.a.s.u.p.UpdateRequestProcessorChain creating updateRequestProcessorChain "distrib-dup-test-chain-implicit"
[junit4] 2> 3344329 INFO (coreLoadExecutor-10733-thread-1-processing-n:127.0.0.1:57377__p%2Fzt) [n:127.0.0.1:57377__p%2Fzt c:control_collection s:shard1 r:core_node1 x:collection1] o.a.s.u.p.UpdateRequestProcessorChain inserting DistributedUpdateProcessorFactory into updateRequestProcessorChain "distrib-dup-test-chain-implicit"
[junit4] 2> 3344329 INFO (coreLoadExecutor-10733-thread-1-processing-n:127.0.0.1:57377__p%2Fzt) [n:127.0.0.1:57377__p%2Fzt c:control_collection s:shard1 r:core_node1 x:collection1] o.a.s.c.SolrCore no updateRequestProcessorChain defined as default, creating implicit default
[junit4] 2> 3344330 WARN (coreLoadExecutor-10733-thread-1-processing-n:127.0.0.1:57377__p%2Fzt) [n:127.0.0.1:57377__p%2Fzt c:control_collection s:shard1 r:core_node1 x:collection1] o.a.s.c.RequestHandlers INVALID paramSet a in requestHandler {type = requestHandler,name = /dump,class = DumpRequestHandler,args = {defaults={a=A,b=B}}}
[junit4] 2> 3344336 INFO (coreLoadExecutor-10733-thread-1-processing-n:127.0.0.1:57377__p%2Fzt) [n:127.0.0.1:57377__p%2Fzt c:control_collection s:shard1 r:core_node1 x:collection1] o.a.s.h.l.XMLLoader xsltCacheLifetimeSeconds=60
[junit4] 2> 3344337 INFO (coreLoadExecutor-10733-thread-1-processing-n:127.0.0.1:57377__p%2Fzt) [n:127.0.0.1:57377__p%2Fzt c:control_collection s:shard1 r:core_node1 x:collection1] o.a.s.h.l.XMLLoader xsltCacheLifetimeSeconds=60
[junit4] 2> 3344338 INFO (coreLoadExecutor-10733-thread-1-processing-n:127.0.0.1:57377__p%2Fzt) [n:127.0.0.1:57377__p%2Fzt c:control_collection s:shard1 r:core_node1 x:collection1] o.a.s.h.l.XMLLoader xsltCacheLifetimeSeconds=60
[junit4] 2> 3344340 INFO (coreLoadExecutor-10733-thread-1-processing-n:127.0.0.1:57377__p%2Fzt) [n:127.0.0.1:57377__p%2Fzt c:control_collection s:shard1 r:core_node1 x:collection1] o.a.s.h.l.XMLLoader xsltCacheLifetimeSeconds=60
[junit4] 2> 3344345 INFO (coreLoadExecutor-10733-thread-1-processing-n:127.0.0.1:57377__p%2Fzt) [n:127.0.0.1:57377__p%2Fzt c:control_collection s:shard1 r:core_node1 x:collection1] o.a.s.c.RequestHandlers Registered paths: /admin/mbeans,standard,/update/json/docs,/admin/luke,/export,/get,/admin/properties,/update/json,/admin/threads,/dump,/update/csv,/sql,/graph,/admin/segments,/admin/system,/replication,/config,/stream,/schema,/admin/plugins,/admin/logging,/admin/ping,/update,/admin/file
[junit4] 2> 3344345 INFO (coreLoadExecutor-10733-thread-1-processing-n:127.0.0.1:57377__p%2Fzt) [n:127.0.0.1:57377__p%2Fzt c:control_collection s:shard1 r:core_node1 x:collection1] o.a.s.c.SolrCore Using default statsCache cache: org.apache.solr.search.stats.LocalStatsCache
[junit4] 2> 3344347 INFO (coreLoadExecutor-10733-thread-1-processing-n:127.0.0.1:57377__p%2Fzt) [n:127.0.0.1:57377__p%2Fzt c:control_collection s:shard1 r:core_node1 x:collection1] o.a.s.u.UpdateHandler Using UpdateLog implementation: org.apache.solr.update.UpdateLog
[junit4] 2> 3344347 INFO (coreLoadExecutor-10733-thread-1-processing-n:127.0.0.1:57377__p%2Fzt) [n:127.0.0.1:57377__p%2Fzt c:control_collection s:shard1 r:core_node1 x:collection1] o.a.s.u.UpdateLog Initializing UpdateLog: dataDir= defaultSyncLevel=FLUSH numRecordsToKeep=100 maxNumLogsToKeep=10 numVersionBuckets=65536
[junit4] 2> 3344349 INFO (coreLoadExecutor-10733-thread-1-processing-n:127.0.0.1:57377__p%2Fzt) [n:127.0.0.1:57377__p%2Fzt c:control_collection s:shard1 r:core_node1 x:collection1] o.a.s.u.CommitTracker Hard AutoCommit: disabled
[junit4] 2> 3344349 INFO (coreLoadExecutor-10733-thread-1-processing-n:127.0.0.1:57377__p%2Fzt) [n:127.0.0.1:57377__p%2Fzt c:control_collection s:shard1 r:core_node1 x:collection1] o.a.s.u.CommitTracker Soft AutoCommit: disabled
[junit4] 2> 3344349 INFO (coreLoadExecutor-10733-thread-1-processing-n:127.0.0.1:57377__p%2Fzt) [n:127.0.0.1:57377__p%2Fzt c:control_collection s:shard1 r:core_node1 x:collection1] o.a.s.u.RandomMergePolicy RandomMergePolicy wrapping class org.apache.lucene.index.LogByteSizeMergePolicy: [LogByteSizeMergePolicy: minMergeSize=1677721, mergeFactor=47, maxMergeSize=2147483648, maxMergeSizeForForcedMerge=9223372036854775807, calibrateSizeByDeletes=true, maxMergeDocs=2147483647, maxCFSSegmentSizeMB=8.796093022207999E12, noCFSRatio=1.0]
[junit4] 2> 3344349 INFO (coreLoadExecutor-10733-thread-1-processing-n:127.0.0.1:57377__p%2Fzt) [n:127.0.0.1:57377__p%2Fzt c:control_collection s:shard1 r:core_node1 x:collection1] o.a.s.c.SolrDeletionPolicy SolrDeletionPolicy.onInit: commits: num=1
[junit4] 2> commit{dir=MockDirectoryWrapper(RAMDirectory@10d86688 lockFactory=org.apache.lucene.store.SingleInstanceLockFactory@59216972),segFN=segments_1,generation=1}
[junit4] 2> 3344350 INFO (coreLoadExecutor-10733-thread-1-processing-n:127.0.0.1:57377__p%2Fzt) [n:127.0.0.1:57377__p%2Fzt c:control_collection s:shard1 r:core_node1 x:collection1] o.a.s.c.SolrDeletionPolicy newest commit generation = 1
[junit4] 2> 3344350 INFO (coreLoadExecutor-10733-thread-1-processing-n:127.0.0.1:57377__p%2Fzt) [n:127.0.0.1:57377__p%2Fzt c:control_collection s:shard1 r:core_node1 x:collection1] o.a.s.s.SolrIndexSearcher Opening [Searcher@6211dc1a[collection1] main]
[junit4] 2> 3344350 INFO (coreLoadExecutor-10733-thread-1-processing-n:127.0.0.1:57377__p%2Fzt) [n:127.0.0.1:57377__p%2Fzt c:control_collection s:shard1 r:core_node1 x:collection1] o.a.s.c.c.ZkStateReader Load collection config from: [/collections/control_collection]
[junit4] 2> 3344352 INFO (coreLoadExecutor-10733-thread-1-processing-n:127.0.0.1:57377__p%2Fzt) [n:127.0.0.1:57377__p%2Fzt c:control_collection s:shard1 r:core_node1 x:collection1] o.a.s.c.c.ZkStateReader path=[/collections/control_collection] [configName]=[conf1] specified config exists in ZooKeeper
[junit4] 2> 3344352 INFO (coreLoadExecutor-10733-thread-1-processing-n:127.0.0.1:57377__p%2Fzt) [n:127.0.0.1:57377__p%2Fzt c:control_collection s:shard1 r:core_node1 x:collection1] o.a.s.r.ManagedResourceStorage Setting up ZooKeeper-based storage for the RestManager with znodeBase: /configs/conf1
[junit4] 2> 3344353 INFO (coreLoadExecutor-10733-thread-1-processing-n:127.0.0.1:57377__p%2Fzt) [n:127.0.0.1:57377__p%2Fzt c:control_collection s:shard1 r:core_node1 x:collection1] o.a.s.r.ManagedResourceStorage Configured ZooKeeperStorageIO with znodeBase: /configs/conf1
[junit4] 2> 3344353 INFO (coreLoadExecutor-10733-thread-1-processing-n:127.0.0.1:57377__p%2Fzt) [n:127.0.0.1:57377__p%2Fzt c:control_collection s:shard1 r:core_node1 x:collection1] o.a.s.r.RestManager Initializing RestManager with initArgs: {}
[junit4] 2> 3344353 INFO (coreLoadExecutor-10733-thread-1-processing-n:127.0.0.1:57377__p%2Fzt) [n:127.0.0.1:57377__p%2Fzt c:control_collection s:shard1 r:core_node1 x:collection1] o.a.s.r.ManagedResourceStorage Reading _rest_managed.json using ZooKeeperStorageIO:path=/configs/conf1
[junit4] 2> 3344354 INFO (coreLoadExecutor-10733-thread-1-processing-n:127.0.0.1:57377__p%2Fzt) [n:127.0.0.1:57377__p%2Fzt c:control_collection s:shard1 r:core_node1 x:collection1] o.a.s.r.ManagedResourceStorage No data found for znode /configs/conf1/_rest_managed.json
[junit4] 2> 3344354 INFO (coreLoadExecutor-10733-thread-1-processing-n:127.0.0.1:57377__p%2Fzt) [n:127.0.0.1:57377__p%2Fzt c:control_collection s:shard1 r:core_node1 x:collection1] o.a.s.r.ManagedResourceStorage Loaded null at path _rest_managed.json using ZooKeeperStorageIO:path=/configs/conf1
[junit4] 2> 3344354 INFO (coreLoadExecutor-10733-thread-1-processing-n:127.0.0.1:57377__p%2Fzt) [n:127.0.0.1:57377__p%2Fzt c:control_collection s:shard1 r:core_node1 x:collection1] o.a.s.r.RestManager Initializing 0 registered ManagedResources
[junit4] 2> 3344355 INFO (coreLoadExecutor-10733-thread-1-processing-n:127.0.0.1:57377__p%2Fzt) [n:127.0.0.1:57377__p%2Fzt c:control_collection s:shard1 r:core_node1 x:collection1] o.a.s.h.ReplicationHandler Commits will be reserved for 10000
[junit4] 2> 3344356 INFO (searcherExecutor-10734-thread-1-processing-n:127.0.0.1:57377__p%2Fzt x:collection1 s:shard1 c:control_collection r:core_node1) [n:127.0.0.1:57377__p%2Fzt c:control_collection s:shard1 r:core_node1 x:collection1] o.a.s.c.SolrCore [collection1] Registered new searcher Searcher@6211dc1a[collection1] main{ExitableDirectoryReader(UninvertingDirectoryReader())}
[junit4] 2> 3344356 INFO (coreLoadExecutor-10733-thread-1-processing-n:127.0.0.1:57377__p%2Fzt) [n:127.0.0.1:57377__p%2Fzt c:control_collection s:shard1 r:core_node1 x:collection1] o.a.s.u.UpdateLog Looking up max value of version field to seed version buckets
[junit4] 2> 3344356 INFO (coreLoadExecutor-10733-thread-1-processing-n:127.0.0.1:57377__p%2Fzt) [n:127.0.0.1:57377__p%2Fzt c:control_collection s:shard1 r:core_node1 x:collection1] o.a.s.u.VersionInfo Refreshing highest value of _version_ for 65536 version buckets from index
[junit4] 2> 3344356 INFO (coreLoadExecutor-10733-thread-1-processing-n:127.0.0.1:57377__p%2Fzt) [n:127.0.0.1:57377__p%2Fzt c:control_collection s:shard1 r:core_node1 x:collection1] o.a.s.u.VersionInfo No terms found for _version_, cannot seed version bucket highest value from index
[junit4] 2> 3344356 INFO (coreLoadExecutor-10733-thread-1-processing-n:127.0.0.1:57377__p%2Fzt) [n:127.0.0.1:57377__p%2Fzt c:control_collection s:shard1 r:core_node1 x:collection1] o.a.s.u.UpdateLog Could not find max version in index or recent updates, using new clock 1535172445382639616
[junit4] 2> 3344358 INFO (coreLoadExecutor-10733-thread-1-processing-n:127.0.0.1:57377__p%2Fzt) [n:127.0.0.1:57377__p%2Fzt c:control_collection s:shard1 r:core_node1 x:collection1] o.a.s.u.UpdateLog Took 2.0ms to seed version buckets with highest version 1535172445382639616
[junit4] 2> 3344358 INFO (coreLoadExecutor-10733-thread-1-processing-n:127.0.0.1:57377__p%2Fzt) [n:127.0.0.1:57377__p%2Fzt c:control_collection s:shard1 r:core_node1 x:collection1] o.a.s.c.ZkController watch zkdir /configs/conf1
[junit4] 2> 3344360 INFO (coreLoadExecutor-10733-thread-1-processing-n:127.0.0.1:57377__p%2Fzt) [n:127.0.0.1:57377__p%2Fzt c:control_collection s:shard1 r:core_node1 x:collection1] o.a.s.c.CoreContainer registering core: collection1
[junit4] 2> 3344361 INFO (coreZkRegister-10727-thread-1-processing-n:127.0.0.1:57377__p%2Fzt x:collection1 s:shard1 c:control_collection r:core_node1) [n:127.0.0.1:57377__p%2Fzt c:control_collection s:shard1 r:core_node1 x:collection1] o.a.s.c.ZkController Register replica - core:collection1 address:http://127.0.0.1:57377/_p/zt collection:control_collection shard:shard1
[junit4] 2> 3344362 INFO (coreZkRegister-10727-thread-1-processing-n:127.0.0.1:57377__p%2Fzt x:collection1 s:shard1 c:control_collection r:core_node1) [n:127.0.0.1:57377__p%2Fzt c:control_collection s:shard1 r:core_node1 x:collection1] o.a.s.c.c.SolrZkClient makePath: /collections/control_collection/leader_elect/shard1/election
[junit4] 2> 3344370 INFO (coreZkRegister-10727-thread-1-processing-n:127.0.0.1:57377__p%2Fzt x:collection1 s:shard1 c:control_collection r:core_node1) [n:127.0.0.1:57377__p%2Fzt c:control_collection s:shard1 r:core_node1 x:collection1] o.a.s.c.LeaderElector Joined leadership election with path: /collections/control_collection/leader_elect/shard1/election/95948277463187460-core_node1-n_0000000000
[junit4] 2> 3344371 INFO (coreZkRegister-10727-thread-1-processing-n:127.0.0.1:57377__p%2Fzt x:collection1 s:shard1 c:control_collection r:core_node1) [n:127.0.0.1:57377__p%2Fzt c:control_collection s:shard1 r:core_node1 x:collection1] o.a.s.c.ShardLeaderElectionContext Running the leader process for shard=shard1 and weAreReplacement=false and leaderVoteWait=10000
[junit4] 2> 3344375 INFO (coreZkRegister-10727-thread-1-processing-n:127.0.0.1:57377__p%2Fzt x:collection1 s:shard1 c:control_collection r:core_node1) [n:127.0.0.1:57377__p%2Fzt c:control_collection s:shard1 r:core_node1 x:collection1] o.a.s.c.ShardLeaderElectionContext Enough replicas found to continue.
[junit4] 2> 3344375 INFO (coreZkRegister-10727-thread-1-processing-n:127.0.0.1:57377__p%2Fzt x:collection1 s:shard1 c:control_collection r:core_node1) [n:127.0.0.1:57377__p%2Fzt c:control_collection s:shard1 r:core_node1 x:collection1] o.a.s.c.ShardLeaderElectionContext I may be the new leader - try and sync
[junit4] 2> 3344375 INFO (coreZkRegister-10727-thread-1-processing-n:127.0.0.1:57377__p%2Fzt x:collection1 s:shard1 c:control_collection r:core_node1) [n:127.0.0.1:57377__p%2Fzt c:control_collection s:shard1 r:core_node1 x:collection1] o.a.s.c.SyncStrategy Sync replicas to http://127.0.0.1:57377/_p/zt/collection1/
[junit4] 2> 3344376 INFO (coreZkRegister-10727-thread-1-processing-n:127.0.0.1:57377__p%2Fzt x:collection1 s:shard1 c:control_collection r:core_node1) [n:127.0.0.1:57377__p%2Fzt c:control_collection s:shard1 r:core_node1 x:collection1] o.a.s.c.SyncStrategy Sync Success - now sync replicas to me
[junit4] 2> 3344376 INFO (coreZkRegister-10727-thread-1-processing-n:127.0.0.1:57377__p%2Fzt x:collection1 s:shard1 c:control_collection r:core_node1) [n:127.0.0.1:57377__p%2Fzt c:control_collection s:shard1 r:core_node1 x:collection1] o.a.s.c.SyncStrategy http://127.0.0.1:57377/_p/zt/collection1/ has no replicas
[junit4] 2> 3344376 INFO (OverseerStateUpdate-95948277463187460-127.0.0.1:57377__p%2Fzt-n_0000000000) [n:127.0.0.1:57377__p%2Fzt ] o.a.s.c.Overseer processMessage: queueSize: 1, message = {
[junit4] 2> "operation":"leader",
[junit4] 2> "shard":"shard1",
[junit4] 2> "collection":"control_collection"} current state version: 1
[junit4] 2> 3344377 INFO (coreZkRegister-10727-thread-1-processing-n:127.0.0.1:57377__p%2Fzt x:collection1 s:shard1 c:control_collection r:core_node1) [n:127.0.0.1:57377__p%2Fzt c:control_collection s:shard1 r:core_node1 x:collection1] o.a.s.c.c.SolrZkClient makePath: /collections/control_collection/leaders/shard1
[junit4] 2> 3344382 INFO (coreZkRegister-10727-thread-1-processing-n:127.0.0.1:57377__p%2Fzt x:collection1 s:shard1 c:control_collection r:core_node1) [n:127.0.0.1:57377__p%2Fzt c:control_collection s:shard1 r:core_node1 x:collection1] o.a.s.c.ShardLeaderElectionContextBase Creating leader registration node /collections/control_collection/leaders/shard1/leader after winning as /collections/control_collection/leader_elect/shard1/election/95948277463187460-core_node1-n_0000000000
[junit4] 2> 3344386 INFO (coreZkRegister-10727-thread-1-processing-n:127.0.0.1:57377__p%2Fzt x:collection1 s:shard1 c:control_collection r:core_node1) [n:127.0.0.1:57377__p%2Fzt c:control_collection s:shard1 r:core_node1 x:collection1] o.a.s.c.ShardLeaderElectionContext I am the new leader: http://127.0.0.1:57377/_p/zt/collection1/ shard1
[junit4] 2> 3344389 INFO (OverseerStateUpdate-95948277463187460-127.0.0.1:57377__p%2Fzt-n_0000000000) [n:127.0.0.1:57377__p%2Fzt ] o.a.s.c.Overseer processMessage: queueSize: 1, message = {
[junit4] 2> "operation":"leader",
[junit4] 2> "shard":"shard1",
[junit4] 2> "collection":"control_collection",
[junit4] 2> "base_url":"http://127.0.0.1:57377/_p/zt",
[junit4] 2> "core":"collection1",
[junit4] 2> "state":"active"} current state version: 1
[junit4] 2> 3344497 INFO (zkCallback-11192-thread-1-processing-n:127.0.0.1:57377__p%2Fzt) [n:127.0.0.1:57377__p%2Fzt ] o.a.s.c.c.ZkStateReader A cluster state change: [WatchedEvent state:SyncConnected type:NodeDataChanged path:/clusterstate.json], has occurred - updating... (live nodes size: [1])
[junit4] 2> 3344547 INFO (coreZkRegister-10727-thread-1-processing-n:127.0.0.1:57377__p%2Fzt x:collection1 s:shard1 c:control_collection r:core_node1) [n:127.0.0.1:57377__p%2Fzt c:control_collection s:shard1 r:core_node1 x:collection1] o.a.s.c.ZkController We are http://127.0.0.1:57377/_p/zt/collection1/ and leader is http://127.0.0.1:57377/_p/zt/collection1/
[junit4] 2> 3344547 INFO (coreZkRegister-10727-thread-1-processing-n:127.0.0.1:57377__p%2Fzt x:collection1 s:shard1 c:control_collection r:core_node1) [n:127.0.0.1:57377__p%2Fzt c:control_collection s:shard1 r:core_node1 x:collection1] o.a.s.c.ZkController No LogReplay needed for core=collection1 baseURL=http://127.0.0.1:57377/_p/zt
[junit4] 2> 3344547 INFO (coreZkRegister-10727-thread-1-processing-n:127.0.0.1:57377__p%2Fzt x:collection1 s:shard1 c:control_collection r:core_node1) [n:127.0.0.1:57377__p%2Fzt c:control_collection s:shard1 r:core_node1 x:collection1] o.a.s.c.ZkController I am the leader, no recovery necessary
[junit4] 2> 3344547 INFO (coreZkRegister-10727-thread-1-processing-n:127.0.0.1:57377__p%2Fzt x:collection1 s:shard1 c:control_collection r:core_node1) [n:127.0.0.1:57377__p%2Fzt c:control_collection s:shard1 r:core_node1 x:collection1] o.a.s.c.ZkController publishing state=active
[junit4] 2> 3344547 INFO (coreZkRegister-10727-thread-1-processing-n:127.0.0.1:57377__p%2Fzt x:collection1 s:shard1 c:control_collection r:core_node1) [n:127.0.0.1:57377__p%2Fzt c:control_collection s:shard1 r:core_node1 x:collection1] o.a.s.c.ZkController numShards not found on descriptor - reading it from system property
[junit4] 2> 3344553 INFO (OverseerStateUpdate-95948277463187460-127.0.0.1:57377__p%2Fzt-n_0000000000) [n:127.0.0.1:57377__p%2Fzt ] o.a.s.c.Overseer processMessage: queueSize: 1, message = {
[junit4] 2> "core":"collection1",
[junit4] 2> "core_node_name":"core_node1",
[junit4] 2> "roles":null,
[junit4] 2> "base_url":"http://127.0.0.1:57377/_p/zt",
[junit4] 2> "node_name":"127.0.0.1:57377__p%2Fzt",
[junit4] 2> "numShards":"1",
[junit4] 2> "state":"active",
[junit4] 2> "shard":"shard1",
[junit4] 2> "collection":"control_collection",
[junit4] 2> "operation":"state"} current state version: 2
[junit4] 2> 3344553 INFO (OverseerStateUpdate-95948277463187460-127.0.0.1:57377__p%2Fzt-n_0000000000) [n:127.0.0.1:57377__p%2Fzt ] o.a.s.c.o.ReplicaMutator Update state numShards=1 message={
[junit4] 2> "core":"collection1",
[junit4] 2> "core_node_name":"core_node1",
[junit4] 2> "roles":null,
[junit4] 2> "base_url":"http://127.0.0.1:57377/_p/zt",
[junit4] 2> "node_name":"127.0.0.1:57377__p%2Fzt",
[junit4] 2> "numShards":"1",
[junit4] 2> "state":"active",
[junit4] 2> "shard":"shard1",
[junit4] 2> "collection":"control_collection",
[junit4] 2> "operation":"state"}
[junit4] 2> 3344625 INFO (TEST-TestReqParamsAPI.test-seed#[949EE1395DE755E0]) [ ] o.a.s.c.c.SolrZkClient Using default ZkCredentialsProvider
[junit4] 2> 3344632 INFO (TEST-TestReqParamsAPI.test-seed#[949EE1395DE755E0]) [ ] o.a.s.c.c.ConnectionManager Waiting for client to connect to ZooKeeper
[junit4] 2> 3344633 INFO (zkCallback-11196-thread-1) [ ] o.a.s.c.c.ConnectionManager Watcher org.apache.solr.common.cloud.ConnectionManager@5abc2e58 name:ZooKeeperConnection Watcher:127.0.0.1:57365/solr got event WatchedEvent state:SyncConnected type:None path:null path:null type:None
[junit4] 2> 3344633 INFO (TEST-TestReqParamsAPI.test-seed#[949EE1395DE755E0]) [ ] o.a.s.c.c.ConnectionManager Client is connected to ZooKeeper
[junit4] 2> 3344634 INFO (TEST-TestReqParamsAPI.test-seed#[949EE1395DE755E0]) [ ] o.a.s.c.c.SolrZkClient Using default ZkACLProvider
[junit4] 2> 3344634 INFO (TEST-TestReqParamsAPI.test-seed#[949EE1395DE755E0]) [ ] o.a.s.c.c.ZkStateReader Updating cluster state from ZooKeeper...
[junit4] 2> 3344636 INFO (TEST-TestReqParamsAPI.test-seed#[949EE1395DE755E0]) [ ] o.a.s.c.c.ZkStateReader Loaded empty cluster properties
[junit4] 2> 3344639 INFO (TEST-TestReqParamsAPI.test-seed#[949EE1395DE755E0]) [ ] o.a.s.c.c.ZkStateReader Updated live nodes from ZooKeeper... (0) -> (1)
[junit4] 2> 3344642 INFO (TEST-TestReqParamsAPI.test-seed#[949EE1395DE755E0]) [ ] o.a.s.c.ChaosMonkey monkey: init - expire sessions:false cause connection loss:false
[junit4] 2> 3344659 INFO (zkCallback-11196-thread-1) [ ] o.a.s.c.c.ZkStateReader A cluster state change: [WatchedEvent state:SyncConnected type:NodeDataChanged path:/clusterstate.json], has occurred - updating... (live nodes size: [1])
[junit4] 2> 3344660 INFO (zkCallback-11192-thread-1-processing-n:127.0.0.1:57377__p%2Fzt) [n:127.0.0.1:57377__p%2Fzt ] o.a.s.c.c.ZkStateReader A cluster state change: [WatchedEvent state:SyncConnected type:NodeDataChanged path:/clusterstate.json], has occurred - updating... (live nodes size: [1])
[junit4] 2> 3344995 INFO (TEST-TestReqParamsAPI.test-seed#[949EE1395DE755E0]) [ ] o.a.s.SolrTestCaseJ4 Writing core.properties file to /Users/jenkins/workspace/Lucene-Solr-6.x-MacOSX/solr/build/solr-core/test/J0/temp/solr.handler.TestReqParamsAPI_949EE1395DE755E0-001/shard-1-001/cores/collection1
[junit4] 2> 3344996 INFO (TEST-TestReqParamsAPI.test-seed#[949EE1395DE755E0]) [ ] o.a.s.c.AbstractFullDistribZkTestBase create jetty 1 in directory /Users/jenkins/workspace/Lucene-Solr-6.x-MacOSX/solr/build/solr-core/test/J0/temp/solr.handler.TestReqParamsAPI_949EE1395DE755E0-001/shard-1-001
[junit4] 2> 3344997 INFO (TEST-TestReqParamsAPI.test-seed#[949EE1395DE755E0]) [ ] o.e.j.s.Server jetty-9.3.8.v20160314
[junit4] 2> 3345000 INFO (TEST-TestReqParamsAPI.test-seed#[949EE1395DE755E0]) [ ] o.e.j.s.h.ContextHandler Started o.e.j.s.ServletContextHandler@41c285e6{/_p/zt,null,AVAILABLE}
[junit4] 2> 3345000 INFO (TEST-TestReqParamsAPI.test-seed#[949EE1395DE755E0]) [ ] o.e.j.s.ServerConnector Started ServerConnector@a74b20d{HTTP/1.1,[http/1.1]}{127.0.0.1:57383}
[junit4] 2> 3345000 INFO (TEST-TestReqParamsAPI.test-seed#[949EE1395DE755E0]) [ ] o.e.j.s.Server Started @3349865ms
[junit4] 2> 3345000 INFO (TEST-TestReqParamsAPI.test-seed#[949EE1395DE755E0]) [ ] o.a.s.c.s.e.JettySolrRunner Jetty properties: {solr.data.dir=/Users/jenkins/workspace/Lucene-Solr-6.x-MacOSX/solr/build/solr-core/test/J0/temp/solr.handler.TestReqParamsAPI_949EE1395DE755E0-001/tempDir-001/jetty1, solrconfig=solrconfig.xml, hostContext=/_p/zt, hostPort=57383, coreRootDirectory=/Users/jenkins/workspace/Lucene-Solr-6.x-MacOSX/solr/build/solr-core/test/J0/temp/solr.handler.TestReqParamsAPI_949EE1395DE755E0-001/shard-1-001/cores}
[junit4] 2> 3345001 INFO (TEST-TestReqParamsAPI.test-seed#[949EE1395DE755E0]) [ ] o.a.s.s.SolrDispatchFilter SolrDispatchFilter.init(): sun.misc.Launcher$AppClassLoader@4554617c
[junit4] 2> 3345001 INFO (TEST-TestReqParamsAPI.test-seed#[949EE1395DE755E0]) [ ] o.a.s.c.SolrResourceLoader new SolrResourceLoader for directory: '/Users/jenkins/workspace/Lucene-Solr-6.x-MacOSX/solr/build/solr-core/test/J0/temp/solr.handler.TestReqParamsAPI_949EE1395DE755E0-001/shard-1-001'
[junit4] 2> 3345001 INFO (TEST-TestReqParamsAPI.test-seed#[949EE1395DE755E0]) [ ] o.a.s.c.SolrResourceLoader JNDI not configured for solr (NoInitialContextEx)
[junit4] 2> 3345001 INFO (TEST-TestReqParamsAPI.test-seed#[949EE1395DE755E0]) [ ] o.a.s.c.SolrResourceLoader solr home defaulted to 'solr/' (could not find system property or JNDI)
[junit4] 2> 3345002 INFO (TEST-TestReqParamsAPI.test-seed#[949EE1395DE755E0]) [ ] o.a.s.c.c.SolrZkClient Using default ZkCredentialsProvider
[junit4] 2> 3345003 INFO (TEST-TestReqParamsAPI.test-seed#[949EE1395DE755E0]) [ ] o.a.s.c.c.ConnectionManager Waiting for client to connect to ZooKeeper
[junit4] 2> 3345004 INFO (zkCallback-11197-thread-1) [ ] o.a.s.c.c.ConnectionManager Watcher org.apache.solr.common.cloud.ConnectionManager@7512a6e name:ZooKeeperConnection Watcher:127.0.0.1:57365/solr got event WatchedEvent state:SyncConnected type:None path:null path:null type:None
[junit4] 2> 3345005 INFO (TEST-TestReqParamsAPI.test-seed#[949EE1395DE755E0]) [ ] o.a.s.c.c.ConnectionManager Client is connected to ZooKeeper
[junit4] 2> 3345005 INFO (TEST-TestReqParamsAPI.test-seed#[949EE1395DE755E0]) [ ] o.a.s.c.c.SolrZkClient Using default ZkACLProvider
[junit4] 2> 3345007 INFO (TEST-TestReqParamsAPI.test-seed#[949EE1395DE755E0]) [ ] o.a.s.s.SolrDispatchFilter Loading solr.xml from SolrHome (not found in ZooKeeper)
[junit4] 2> 3345007 INFO (TEST-TestReqParamsAPI.test-seed#[949EE1395DE755E0]) [ ] o.a.s.c.SolrXmlConfig Loading container configuration from /Users/jenkins/workspace/Lucene-Solr-6.x-MacOSX/solr/build/solr-core/test/J0/temp/solr.handler.TestReqParamsAPI_949EE1395DE755E0-001/shard-1-001/solr.xml
[junit4] 2> 3345017 INFO (TEST-TestReqParamsAPI.test-seed#[949EE1395DE755E0]) [ ] o.a.s.c.CorePropertiesLocator Config-defined core root directory: /Users/jenkins/workspace/Lucene-Solr-6.x-MacOSX/solr/build/solr-core/test/J0/temp/solr.handler.TestReqParamsAPI_949EE1395DE755E0-001/shard-1-001/cores
[junit4] 2> 3345017 INFO (TEST-TestReqParamsAPI.test-seed#[949EE1395DE755E0]) [ ] o.a.s.c.CoreContainer New CoreContainer 2099995058
[junit4] 2> 3345017 INFO (TEST-TestReqParamsAPI.test-seed#[949EE1395DE755E0]) [ ] o.a.s.c.CoreContainer Loading cores into CoreContainer [instanceDir=/Users/jenkins/workspace/Lucene-Solr-6.x-MacOSX/solr/build/solr-core/test/J0/temp/solr.handler.TestReqParamsAPI_949EE1395DE755E0-001/shard-1-001]
[junit4] 2> 3345018 WARN (TEST-TestReqParamsAPI.test-seed#[949EE1395DE755E0]) [ ] o.a.s.c.CoreContainer Couldn't add files from /Users/jenkins/workspace/Lucene-Solr-6.x-MacOSX/solr/build/solr-core/test/J0/temp/solr.handler.TestReqParamsAPI_949EE1395DE755E0-001/shard-1-001/lib to classpath: /Users/jenkins/workspace/Lucene-Solr-6.x-MacOSX/solr/build/solr-core/test/J0/temp/solr.handler.TestReqParamsAPI_949EE1395DE755E0-001/shard-1-001/lib
[junit4] 2> 3345018 INFO (TEST-TestReqParamsAPI.test-seed#[949EE1395DE755E0]) [ ] o.a.s.h.c.HttpShardHandlerFactory created with socketTimeout : 90000,urlScheme : ,connTimeout : 15000,maxConnectionsPerHost : 20,maxConnections : 10000,corePoolSize : 0,maximumPoolSize : 2147483647,maxThreadIdleTime : 5,sizeOfQueue : -1,fairnessPolicy : false,useRetries : false,
[junit4] 2> 3345021 INFO (TEST-TestReqParamsAPI.test-seed#[949EE1395DE755E0]) [ ] o.a.s.u.UpdateShardHandler Creating UpdateShardHandler HTTP client with params: socketTimeout=340000&connTimeout=45000&retry=true
[junit4] 2> 3345022 INFO (TEST-TestReqParamsAPI.test-seed#[949EE1395DE755E0]) [ ] o.a.s.l.LogWatcher SLF4J impl is org.slf4j.impl.Log4jLoggerFactory
[junit4] 2> 3345022 INFO (TEST-TestReqParamsAPI.test-seed#[949EE1395DE755E0]) [ ] o.a.s.l.LogWatcher Registering Log Listener [Log4j (org.slf4j.impl.Log4jLoggerFactory)]
[junit4] 2> 3345022 INFO (TEST-TestReqParamsAPI.test-seed#[949EE1395DE755E0]) [ ] o.a.s.c.ZkContainer Zookeeper client=127.0.0.1:57365/solr
[junit4] 2> 3345022 INFO (TEST-TestReqParamsAPI.test-seed#[949EE1395DE755E0]) [ ] o.a.s.c.ZkController zkHost includes chroot
[junit4] 2> 3345022 INFO (TEST-TestReqParamsAPI.test-seed#[949EE1395DE755E0]) [ ] o.a.s.c.c.SolrZkClient Using default ZkCredentialsProvider
[junit4] 2> 3345023 INFO (TEST-TestReqParamsAPI.test-seed#[949EE1395DE755E0]) [ ] o.a.s.c.c.ConnectionManager Waiting for client to connect to ZooKeeper
[junit4] 2> 3345025 INFO (zkCallback-11200-thread-1) [ ] o.a.s.c.c.ConnectionManager Watcher org.apache.solr.common.cloud.ConnectionManager@68e5448a name:ZooKeeperConnection Watcher:127.0.0.1:57365 got event WatchedEvent state:SyncConnected type:None path:null path:null type:None
[junit4] 2> 3345025 INFO (TEST-TestReqParamsAPI.test-seed#[949EE1395DE755E0]) [ ] o.a.s.c.c.ConnectionManager Client is connected to ZooKeeper
[junit4] 2> 3345026 INFO (TEST-TestReqParamsAPI.test-seed#[949EE1395DE755E0]) [ ] o.a.s.c.c.SolrZkClient Using default ZkACLProvider
[junit4] 2> 3345034 INFO (TEST-TestReqParamsAPI.test-seed#[949EE1395DE755E0]) [n:127.0.0.1:57383__p%2Fzt ] o.a.s.c.ZkController Added new OnReconnect listener org.apache.solr.cloud.ZkController$$Lambda$28/2126255137@7e942b98
[junit4] 2> 3345035 INFO (TEST-TestReqParamsAPI.test-seed#[949EE1395DE755E0]) [n:127.0.0.1:57383__p%2Fzt ] o.a.s.c.c.ConnectionManager Waiting for client to connect to ZooKeeper
[junit4] 2> 3345037 INFO (zkCallback-11201-thread-1-processing-n:127.0.0.1:57383__p%2Fzt) [n:127.0.0.1:57383__p%2Fzt ] o.a.s.c.c.ConnectionManager Watcher org.apache.solr.common.cloud.ConnectionManager@580acd70 name:ZooKeeperConnection Watcher:127.0.0.1:57365/solr got event WatchedEvent state:SyncConnected type:None path:null path:null type:None
[junit4] 2> 3345037 INFO (TEST-TestReqParamsAPI.test-seed#[949EE1395DE755E0]) [n:127.0.0.1:57383__p%2Fzt ] o.a.s.c.c.ConnectionManager Client is connected to ZooKeeper
[junit4] 2> 3345052 INFO (TEST-TestReqParamsAPI.test-seed#[949EE1395DE755E0]) [n:127.0.0.1:57383__p%2Fzt ] o.a.s.c.c.ZkStateReader Updating cluster state from ZooKeeper...
[junit4] 2> 3345054 INFO (TEST-TestReqParamsAPI.test-seed#[949EE1395DE755E0]) [n:127.0.0.1:57383__p%2Fzt ] o.a.s.c.c.ZkStateReader Loaded empty cluster properties
[junit4] 2> 3345055 INFO (TEST-TestReqParamsAPI.test-seed#[949EE1395DE755E0]) [n:127.0.0.1:57383__p%2Fzt ] o.a.s.c.c.ZkStateReader Updated live nodes from ZooKeeper... (0) -> (1)
[junit4] 2> 3345062 INFO (TEST-TestReqParamsAPI.test-seed#[949EE1395DE755E0]) [n:127.0.0.1:57383__p%2Fzt ] o.a.s.c.Overseer Overseer (id=null) closing
[junit4] 2> 3345063 INFO (TEST-TestReqParamsAPI.test-seed#[949EE1395DE755E0]) [n:127.0.0.1:57383__p%2Fzt ] o.a.s.c.LeaderElector Joined leadership election with path: /overseer_elect/election/95948277463187464-127.0.0.1:57383__p%2Fzt-n_0000000001
[junit4] 2> 3345065 INFO (TEST-TestReqParamsAPI.test-seed#[949EE1395DE755E0]) [n:127.0.0.1:57383__p%2Fzt ] o.a.s.c.LeaderElector Watching path /overseer_elect/election/95948277463187460-127.0.0.1:57377__p%2Fzt-n_0000000000 to know if I could be the leader
[junit4] 2> 3345065 INFO (TEST-TestReqParamsAPI.test-seed#[949EE1395DE755E0]) [n:127.0.0.1:57383__p%2Fzt ] o.a.s.c.ZkController Publish node=127.0.0.1:57383__p%2Fzt as DOWN
[junit4] 2> 3345069 INFO (OverseerStateUpdate-95948277463187460-127.0.0.1:57377__p%2Fzt-n_0000000000) [n:127.0.0.1:57377__p%2Fzt ] o.a.s.c.Overseer processMessage: queueSize: 1, message = {
[junit4] 2> "operation":"downnode",
[junit4] 2> "node_name":"127.0.0.1:57383__p%2Fzt"} current state version: 3
[junit4] 2> 3345069 INFO (OverseerStateUpdate-95948277463187460-127.0.0.1:57377__p%2Fzt-n_0000000000) [n:127.0.0.1:57377__p%2Fzt ] o.a.s.c.o.NodeMutator DownNode state invoked for node: 127.0.0.1:57383__p%2Fzt
[junit4] 2> 3345175 INFO (zkCallback-11201-thread-1-processing-n:127.0.0.1:57383__p%2Fzt) [n:127.0.0.1:57383__p%2Fzt ] o.a.s.c.c.ZkStateReader A cluster state change: [WatchedEvent state:SyncConnected type:NodeDataChanged path:/clusterstate.json], has occurred - updating... (live nodes size: [1])
[junit4] 2> 3345175 INFO (zkCallback-11192-thread-1-processing-n:127.0.0.1:57377__p%2Fzt) [n:127.0.0.1:57377__p%2Fzt ] o.a.s.c.c.ZkStateReader A cluster state change: [WatchedEvent state:SyncConnected type:NodeDataChanged path:/clusterstate.json], has occurred - updating... (live nodes size: [1])
[junit4] 2> 3345176 INFO (zkCallback-11196-thread-1) [ ] o.a.s.c.c.ZkStateReader A cluster state change: [WatchedEvent state:SyncConnected type:NodeDataChanged path:/clusterstate.json], has occurred - updating... (live nodes size: [1])
[junit4] 2> 3346089 INFO (TEST-TestReqParamsAPI.test-seed#[949EE1395DE755E0]) [n:127.0.0.1:57383__p%2Fzt ] o.a.s.c.ZkController Register node as live in ZooKeeper:/live_nodes/127.0.0.1:57383__p%2Fzt
[junit4] 2> 3346090 INFO (TEST-TestReqParamsAPI.test-seed#[949EE1395DE755E0]) [n:127.0.0.1:57383__p%2Fzt ] o.a.s.c.c.SolrZkClient makePath: /live_nodes/127.0.0.1:57383__p%2Fzt
[junit4] 2> 3346093 INFO (zkCallback-11201-thread-1-processing-n:127.0.0.1:57383__p%2Fzt) [n:127.0.0.1:57383__p%2Fzt ] o.a.s.c.c.ZkStateReader A live node change: [WatchedEvent state:SyncConnected type:NodeChildrenChanged path:/live_nodes], has occurred - updating... (live nodes size: [1])
[junit4] 2> 3346093 INFO (zkCallback-11192-thread-1-processing-n:127.0.0.1:57377__p%2Fzt) [n:127.0.0.1:57377__p%2Fzt ] o.a.s.c.c.ZkStateReader A live node change: [WatchedEvent state:SyncConnected type:NodeChildrenChanged path:/live_nodes], has occurred - updating... (live nodes size: [1])
[junit4] 2> 3346093 INFO (zkCallback-11196-thread-1) [ ] o.a.s.c.c.ZkStateReader A live node change: [WatchedEvent state:SyncConnected type:NodeChildrenChanged path:/live_nodes], has occurred - updating... (live nodes size: [1])
[junit4] 2> 3346095 INFO (zkCallback-11201-thread-1-processing-n:127.0.0.1:57383__p%2Fzt) [n:127.0.0.1:57383__p%2Fzt ] o.a.s.c.c.ZkStateReader Updated live nodes from ZooKeeper... (1) -> (2)
[junit4] 2> 3346096 INFO (zkCallback-11196-thread-1) [ ] o.a.s.c.c.ZkStateReader Updated live nodes from ZooKeeper... (1) -> (2)
[junit4] 2> 3346096 INFO (zkCallback-11192-thread-1-processing-n:127.0.0.1:57377__p%2Fzt) [n:127.0.0.1:57377__p%2Fzt ] o.a.s.c.c.ZkStateReader Updated live nodes from ZooKeeper... (1) -> (2)
[junit4] 2> 3346111 INFO (TEST-TestReqParamsAPI.test-seed#[949EE1395DE755E0]) [n:127.0.0.1:57383__p%2Fzt ] o.a.s.c.CoreContainer Security conf doesn't exist. Skipping setup for authorization module.
[junit4] 2> 3346111 INFO (TEST-TestReqParamsAPI.test-seed#[949EE1395DE755E0]) [n:127.0.0.1:57383__p%2Fzt ] o.a.s.c.CoreContainer No authentication plugin used.
[junit4] 2> 3346112 INFO (TEST-TestReqParamsAPI.test-seed#[949EE1395DE755E0]) [n:127.0.0.1:57383__p%2Fzt ] o.a.s.c.CorePropertiesLocator Looking for core definitions underneath /Users/jenkins/workspace/Lucene-Solr-6.x-MacOSX/solr/build/solr-core/test/J0/temp/solr.handler.TestReqParamsAPI_949EE1395DE755E0-001/shard-1-001/cores
[junit4] 2> 3346115 INFO (TEST-TestReqParamsAPI.test-seed#[949EE1395DE755E0]) [n:127.0.0.1:57383__p%2Fzt ] o.a.s.c.CoreDescriptor Created CoreDescriptor: {name=collection1, config=solrconfig.xml, transient=false, schema=schema.xml, loadOnStartup=true, configSetProperties=configsetprops.json, collection=collection1, coreNodeName=, dataDir=data/, shard=}
[junit4] 2> 3346115 INFO (TEST-TestReqParamsAPI.test-seed#[949EE1395DE755E0]) [n:127.0.0.1:57383__p%2Fzt ] o.a.s.c.CorePropertiesLocator Found core collection1 in /Users/jenkins/workspace/Lucene-Solr-6.x-MacOSX/solr/build/solr-core/test/J0/temp/solr.handler.TestReqParamsAPI_949EE1395DE755E0-001/shard-1-001/cores/collection1
[junit4] 2> 3346116 INFO (TEST-TestReqParamsAPI.test-seed#[949EE1395DE755E0]) [n:127.0.0.1:57383__p%2Fzt ] o.a.s.c.CorePropertiesLocator Found 1 core definitions
[junit4] 2> 3346118 INFO (coreLoadExecutor-10744-thread-1-processing-n:127.0.0.1:57383__p%2Fzt) [n:127.0.0.1:57383__p%2Fzt c:collection1 x:collection1] o.a.s.c.ZkController publishing state=down
[junit4] 2> 3346118 INFO (coreLoadExecutor-10744-thread-1-processing-n:127.0.0.1:57383__p%2Fzt) [n:127.0.0.1:57383__p%2Fzt c:collection1 x:collection1] o.a.s.c.ZkController numShards not found on descriptor - reading it from system property
[junit4] 2> 3346118 INFO (TEST-TestReqParamsAPI.test-seed#[949EE1395DE755E0]) [n:127.0.0.1:57383__p%2Fzt ] o.a.s.s.SolrDispatchFilter user.dir=/Users/jenkins/workspace/Lucene-Solr-6.x-MacOSX/solr/build/solr-core/test/J0
[junit4] 2> 3346118 INFO (TEST-TestReqParamsAPI.test-seed#[949EE1395DE755E0]) [n:127.0.0.1:57383__p%2Fzt ] o.a.s.s.SolrDispatchFilter SolrDispatchFilter.init() done
[junit4] 2> 3346120 INFO (coreLoadExecutor-10744-thread-1-processing-n:127.0.0.1:57383__p%2Fzt) [n:127.0.0.1:57383__p%2Fzt c:collection1 x:collection1] o.a.s.c.ZkController Collection collection1 not visible yet, but flagging it so a watch is registered when it becomes visible
[junit4] 2> 3346121 INFO (OverseerStateUpdate-95948277463187460-127.0.0.1:57377__p%2Fzt-n_0000000000) [n:127.0.0.1:57377__p%2Fzt ] o.a.s.c.Overseer processMessage: queueSize: 1, message = {
[junit4] 2> "core":"collection1",
[junit4] 2> "roles":null,
[junit4] 2> "base_url":"http://127.0.0.1:57383/_p/zt",
[junit4] 2> "node_name":"127.0.0.1:57383__p%2Fzt",
[junit4] 2> "numShards":"2",
[junit4] 2> "state":"down",
[junit4] 2> "shard":null,
[junit4] 2> "collection":"collection1",
[junit4] 2> "operation":"state"} current state version: 4
[junit4] 2> 3346121 INFO (OverseerStateUpdate-95948277463187460-127.0.0.1:57377__p%2Fzt-n_0000000000) [n:127.0.0.1:57377__p%2Fzt ] o.a.s.c.o.ReplicaMutator Update state numShards=2 message={
[junit4] 2> "core":"collection1",
[junit4] 2> "roles":null,
[junit4] 2> "base_url":"http://127.0.0.1:57383/_p/zt",
[junit4] 2> "node_name":"127.0.0.1:57383__p%2Fzt",
[junit4] 2> "numShards":"2",
[junit4] 2> "state":"down",
[junit4] 2> "shard":null,
[junit4] 2> "collection":"collection1",
[junit4] 2> "operation":"state"}
[junit4] 2> 3346121 INFO (OverseerStateUpdate-95948277463187460-127.0.0.1:57377__p%2Fzt-n_0000000000) [n:127.0.0.1:57377__p%2Fzt ] o.a.s.c.o.ClusterStateMutator building a new cName: collection1
[junit4] 2> 3346122 INFO (OverseerStateUpdate-95948277463187460-127.0.0.1:57377__p%2Fzt-n_0000000000) [n:127.0.0.1:57377__p%2Fzt ] o.a.s.c.o.ReplicaMutator Assigning new node to shard shard=shard2
[junit4] 2> 3346122 INFO (coreLoadExecutor-10744-thread-1-processing-n:127.0.0.1:57383__p%2Fzt) [n:127.0.0.1:57383__p%2Fzt c:collection1 x:collection1] o.a.s.c.c.ZkStateReader Deleting data for [collection1]
[junit4] 2> 3346123 INFO (coreLoadExecutor-10744-thread-1-processing-n:127.0.0.1:57383__p%2Fzt) [n:127.0.0.1:57383__p%2Fzt c:collection1 x:collection1] o.a.s.c.ZkController look for our core node name
[junit4] 2> 3346231 INFO (zkCallback-11201-thread-1-processing-n:127.0.0.1:57383__p%2Fzt) [n:127.0.0.1:57383__p%2Fzt ] o.a.s.c.c.ZkStateReader A cluster state change: [WatchedEvent state:SyncConnected type:NodeDataChanged path:/clusterstate.json], has occurred - updating... (live nodes size: [2])
[junit4] 2> 3346231 INFO (zkCallback-11192-thread-1-processing-n:127.0.0.1:57377__p%2Fzt) [n:127.0.0.1:57377__p%2Fzt ] o.a.s.c.c.ZkStateReader A cluster state change: [WatchedEvent state:SyncConnected type:NodeDataChanged path:/clusterstate.json], has occurred - updating... (live nodes size: [2])
[junit4] 2> 3346231 INFO (zkCallback-11196-thread-1) [ ] o.a.s.c.c.ZkStateReader A cluster state change: [WatchedEvent state:SyncConnected type:NodeDataChanged path:/clusterstate.json], has occurred - updating... (live nodes size: [2])
[junit4] 2> 3347126 INFO (coreLoadExecutor-10744-thread-1-processing-n:127.0.0.1:57383__p%2Fzt) [n:127.0.0.1:57383__p%2Fzt c:collection1 x:collection1] o.a.s.c.ZkController waiting to find shard id in clusterstate for collection1
[junit4] 2> 3347126 INFO (coreLoadExecutor-10744-thread-1-processing-n:127.0.0.1:57383__p%2Fzt) [n:127.0.0.1:57383__p%2Fzt c:collection1 x:collection1] o.a.s.c.ZkController Check for collection zkNode:collection1
[junit4] 2> 3347127 INFO (coreLoadExecutor-10744-thread-1-processing-n:127.0.0.1:57383__p%2Fzt) [n:127.0.0.1:57383__p%2Fzt c:collection1 x:collection1] o.a.s.c.ZkController Collection zkNode exists
[junit4] 2> 3347127 INFO (coreLoadExecutor-10744-thread-1-processing-n:127.0.0.1:57383__p%2Fzt) [n:127.0.0.1:57383__p%2Fzt c:collection1 x:collection1] o.a.s.c.c.ZkStateReader Load collection config from: [/collections/collection1]
[junit4] 2> 3347128 INFO (coreLoadExecutor-10744-thread-1-processing-n:127.0.0.1:57383__p%2Fzt) [n:127.0.0.1:57383__p%2Fzt c:collection1 x:collection1] o.a.s.c.c.ZkStateReader path=[/collections/collection1] [configName]=[conf1] specified config exists in ZooKeeper
[junit4] 2> 3347128 INFO (coreLoadExecutor-10744-thread-1-processing-n:127.0.0.1:57383__p%2Fzt) [n:127.0.0.1:57383__p%2Fzt c:collection1 x:collection1] o.a.s.c.SolrResourceLoader new SolrResourceLoader for directory: '/Users/jenkins/workspace/Lucene-Solr-6.x-MacOSX/solr/build/solr-core/test/J0/temp/solr.handler.TestReqParamsAPI_949EE1395DE755E0-001/shard-1-001/cores/collection1'
[junit4] 2> 3347129 INFO (coreLoadExecutor-10744-thread-1-processing-n:127.0.0.1:57383__p%2Fzt) [n:127.0.0.1:57383__p%2Fzt c:collection1 x:collection1] o.a.s.c.SolrResourceLoader JNDI not configured for solr (NoInitialContextEx)
[junit4] 2> 3347129 INFO (coreLoadExecutor-10744-thread-1-processing-n:127.0.0.1:57383__p%2Fzt) [n:127.0.0.1:57383__p%2Fzt c:collection1 x:collection1] o.a.s.c.SolrResourceLoader solr home defaulted to 'solr/' (could not find system property or JNDI)
[junit4] 2> 3347131 INFO (coreLoadExecutor-10744-thread-1-processing-n:127.0.0.1:57383__p%2Fzt) [n:127.0.0.1:57383__p%2Fzt c:collection1 x:collection1] o.a.s.c.Config loaded config solrconfig.xml with version 0
[junit4] 2> 3347146 INFO (coreLoadExecutor-10744-thread-1-processing-n:127.0.0.1:57383__p%2Fzt) [n:127.0.0.1:57383__p%2Fzt c:collection1 x:collection1] o.a.s.c.SolrConfig current version of requestparams : -1
[junit4] 2> 3347169 WARN (coreLoadExecutor-10744-thread-1-processing-n:127.0.0.1:57383__p%2Fzt) [n:127.0.0.1:57383__p%2Fzt c:collection1 x:collection1] o.a.s.c.Config Beginning with Solr 5.5, <mergePolicy> is deprecated, use <mergePolicyFactory> instead.
[junit4] 2> 3347170 INFO (coreLoadExecutor-10744-thread-1-processing-n:127.0.0.1:57383__p%2Fzt) [n:127.0.0.1:57383__p%2Fzt c:collection1 x:collection1] o.a.s.c.SolrConfig Using Lucene MatchVersion: 6.1.0
[junit4] 2> 3347237 INFO (coreLoadExecutor-10744-thread-1-processing-n:127.0.0.1:57383__p%2Fzt) [n:127.0.0.1:57383__p%2Fzt c:collection1 x:collection1] o.a.s.c.SolrConfig Loaded SolrConfig: solrconfig.xml
[junit4] 2> 3347256 INFO (coreLoadExecutor-10744-thread-1-processing-n:127.0.0.1:57383__p%2Fzt) [n:127.0.0.1:57383__p%2Fzt c:collection1 x:collection1] o.a.s.s.IndexSchema [collection1] Schema name=test
[junit4] 2> 3347401 INFO (coreLoadExecutor-10744-thread-1-processing-n:127.0.0.1:57383__p%2Fzt) [n:127.0.0.1:57383__p%2Fzt c:collection1 x:collection1] o.a.s.s.OpenExchangeRatesOrgProvider Initialized with rates=open-exchange-rates.json, refreshInterval=1440.
[junit4] 2> 3347410 INFO (coreLoadExecutor-10744-thread-1-processing-n:127.0.0.1:57383__p%2Fzt) [n:127.0.0.1:57383__p%2Fzt c:collection1 x:collection1] o.a.s.s.IndexSchema default search field in schema is text
[junit4] 2> 3347411 INFO (coreLoadExecutor-10744-thread-1-processing-n:127.0.0.1:57383__p%2Fzt) [n:127.0.0.1:57383__p%2Fzt c:collection1 x:collection1] o.a.s.s.IndexSchema unique key field: id
[junit4] 2> 3347428 INFO (coreLoadExecutor-10744-thread-1-processing-n:127.0.0.1:5
[...truncated too long message...]
ant test -Dtestcase=TestReqParamsAPI -Dtests.method=test -Dtests.seed=949EE1395DE755E0 -Dtests.slow=true -Dtests.locale=ar-JO -Dtests.timezone=US/Arizona -Dtests.asserts=true -Dtests.file.encoding=UTF-8
[junit4] FAILURE 35.7s J0 | TestReqParamsAPI.test <<<
[junit4] > Throwable #1: java.lang.AssertionError: Could not get expected value 'null' for path 'response/params/y/p' full output: {
[junit4] > "responseHeader":{
[junit4] > "status":0,
[junit4] > "QTime":0},
[junit4] > "response":{
[junit4] > "znodeVersion":4,
[junit4] > "params":{
[junit4] > "x":{
[junit4] > "a":"A val",
[junit4] > "b":"B val",
[junit4] > "_appends_":{"add":"first"},
[junit4] > "_invariants_":{"fixed":"f"},
[junit4] > "":{"v":1}},
[junit4] > "y":{
[junit4] > "p":"P val",
[junit4] > "q":"Q val",
[junit4] > "":{"v":2}}}}}, from server: http://127.0.0.1:57391/_p/zt/collection1
[junit4] > at __randomizedtesting.SeedInfo.seed([949EE1395DE755E0:1CCADEE3F31B3818]:0)
[junit4] > at org.apache.solr.core.TestSolrConfigHandler.testForResponseElement(TestSolrConfigHandler.java:457)
[junit4] > at org.apache.solr.handler.TestReqParamsAPI.testReqParams(TestReqParamsAPI.java:259)
[junit4] > at org.apache.solr.handler.TestReqParamsAPI.test(TestReqParamsAPI.java:62)
[junit4] > at org.apache.solr.BaseDistributedSearchTestCase$ShardsRepeatRule$ShardsFixedStatement.callStatement(BaseDistributedSearchTestCase.java:992)
[junit4] > at org.apache.solr.BaseDistributedSearchTestCase$ShardsRepeatRule$ShardsStatement.evaluate(BaseDistributedSearchTestCase.java:967)
[junit4] > at java.lang.Thread.run(Thread.java:745)
[junit4] 2> 3374377 INFO (SUITE-TestReqParamsAPI-seed#[949EE1395DE755E0]-worker) [ ] o.a.s.SolrTestCaseJ4 ###deleteCore
[junit4] 2> NOTE: leaving temporary files on disk at: /Users/jenkins/workspace/Lucene-Solr-6.x-MacOSX/solr/build/solr-core/test/J0/temp/solr.handler.TestReqParamsAPI_949EE1395DE755E0-001
[junit4] 2> NOTE: test params are: codec=Asserting(Lucene60): {}, docValues:{}, maxPointsInLeafNode=594, maxMBSortInHeap=7.3491506310401284, sim=ClassicSimilarity, locale=ar-JO, timezone=US/Arizona
[junit4] 2> NOTE: Mac OS X 10.11.4 x86_64/Oracle Corporation 1.8.0_72 (64-bit)/cpus=3,threads=1,free=153906400,total=461373440
[junit4] 2> NOTE: All tests run in this JVM: [PreAnalyzedFieldTest, PreAnalyzedUpdateProcessorTest, TestCryptoKeys, HdfsBasicDistributedZk2Test, DeleteLastCustomShardedReplicaTest, ClusterStateTest, TestConfigReload, TestRestManager, TestRandomDVFaceting, HardAutoCommitTest, TestCSVLoader, CoreAdminRequestStatusTest, TestSimpleQParserPlugin, SystemInfoHandlerTest, DistributedFacetPivotLongTailTest, TestJsonFacets, ZkCLITest, LeaderElectionTest, TestStressLucene, DistributedFacetPivotSmallTest, OverseerTest, QueryElevationComponentTest, TestJmxIntegration, SimpleFacetsTest, SharedFSAutoReplicaFailoverTest, HdfsDirectoryFactoryTest, TestStressLiveNodes, AlternateDirectoryTest, DirectUpdateHandlerTest, TestCoreContainer, SolrCoreTest, SampleTest, RegexBoostProcessorTest, TestSizeLimitedDistributedMap, PathHierarchyTokenizerFactoryTest, TestElisionMultitermQuery, CheckHdfsIndexTest, BadComponentTest, TestSearchPerf, DistanceUnitsTest, TestReplicationHandler, TestClassicSimilarityFactory, TestRebalanceLeaders, DOMUtilTest, TestNRTOpen, TolerantUpdateProcessorTest, SaslZkACLProviderTest, SmileWriterTest, TestCloudInspectUtil, XmlUpdateRequestHandlerTest, AnalysisErrorHandlingTest, TestManagedSynonymFilterFactory, DocValuesTest, CursorPagingTest, InfoHandlerTest, TestDFRSimilarityFactory, SOLR749Test, TestBlendedInfixSuggestions, MergeStrategyTest, TestCollectionAPI, TestManagedSchema, HighlighterTest, LeaderInitiatedRecoveryOnCommitTest, SchemaVersionSpecificBehaviorTest, TestSchemaResource, HdfsUnloadDistributedZkTest, TestLRUStatsCache, TestLeaderElectionZkExpiry, SyncSliceTest, ConnectionManagerTest, TestOrdValues, TestSurroundQueryParser, SoftAutoCommitTest, OverseerCollectionConfigSetProcessorTest, IndexBasedSpellCheckerTest, DistributedSpellCheckComponentTest, TestChildDocTransformer, TestFreeTextSuggestions, TestRawResponseWriter, DistributedExpandComponentTest, DisMaxRequestHandlerTest, UpdateParamsTest, DistribJoinFromCollectionTest, StandardRequestHandlerTest, VersionInfoTest, TestHashPartitioner, HdfsLockFactoryTest, SolrRequestParserTest, HdfsRestartWhileUpdatingTest, TestGroupingSearch, TimeZoneUtilsTest, TestSchemaManager, TriLevelCompositeIdRoutingTest, TestFieldResource, AnalysisAfterCoreReloadTest, MoreLikeThisHandlerTest, IndexSchemaTest, BlockCacheTest, SuggesterFSTTest, TestLuceneMatchVersion, DocumentBuilderTest, TestFaceting, DocumentAnalysisRequestHandlerTest, TestExactSharedStatsCache, ZkControllerTest, DirectSolrSpellCheckerTest, TestFastLRUCache, TestCursorMarkWithoutUniqueKey, TestSubQueryTransformerCrossCore, JSONWriterTest, PrimUtilsTest, TestGeoJSONResponseWriter, TestSolrDeletionPolicy1, TestSQLHandler, MigrateRouteKeyTest, PolyFieldTest, TestMacros, BasicDistributedZkTest, BigEndianAscendingWordSerializerTest, TestWordDelimiterFilterFactory, TestManagedResource, TestExtendedDismaxParser, ActionThrottleTest, TestComponentsName, StressHdfsTest, TestReRankQParserPlugin, TestConfigSetsAPIExclusivity, DistributedVersionInfoTest, TestSha256AuthenticationProvider, IgnoreCommitOptimizeUpdateProcessorFactoryTest, AssignTest, HttpPartitionTest, AtomicUpdatesTest, ConcurrentDeleteAndCreateCollectionTest, ExplicitHLLTest, TestTestInjection, DistributedSuggestComponentTest, TermsComponentTest, TestDynamicLoading, ExternalFileFieldSortTest, CircularListTest, TestOverriddenPrefixQueryForCustomFieldType, ScriptEngineTest, DistribCursorPagingTest, HdfsChaosMonkeyNothingIsSafeTest, TestPKIAuthenticationPlugin, ChaosMonkeySafeLeaderTest, BasicDistributedZk2Test, UnloadDistributedZkTest, OpenCloseCoreStressTest, LeaderElectionIntegrationTest, ShardRoutingTest, RecoveryZkTest, ClusterStateUpdateTest, TestRandomFaceting, TestDistributedSearch, TestRealTimeGet, TestStressReorder, TestStressVersions, TestSolr4Spatial, PeerSyncTest, TestFiltering, TestLazyCores, TestIndexSearcher, DistributedQueryElevationComponentTest, SpatialFilterTest, SolrCoreCheckLockOnStartupTest, TestUpdate, StatelessScriptUpdateProcessorFactoryTest, DocValuesMultiTest, DistanceFunctionTest, XsltUpdateRequestHandlerTest, CacheHeaderTest, PrimitiveFieldTypeTest, FileBasedSpellCheckerTest, TestIndexingPerformance, FieldAnalysisRequestHandlerTest, TestArbitraryIndexDir, ReturnFieldsTest, TestCSVResponseWriter, TestAnalyzedSuggestions, JsonLoaderTest, PingRequestHandlerTest, HighlighterConfigTest, TestQuerySenderNoQuery, SolrIndexConfigTest, TestMergePolicyConfig, TestDocSet, MinimalSchemaTest, TestFuzzyAnalyzedSuggestions, DirectSolrConnectionTest, TestPhraseSuggestions, TestXIncludeConfig, TestSweetSpotSimilarityFactory, TestPerFieldSimilarity, TestLMJelinekMercerSimilarityFactory, TestBM25SimilarityFactory, ResourceLoaderTest, OpenExchangeRatesOrgProviderTest, PluginInfoTest, ChaosMonkeyNothingIsSafeTest, BaseCdcrDistributedZkTest, CdcrReplicationDistributedZkTest, CdcrReplicationHandlerTest, CdcrRequestHandlerTest, CleanupOldIndexTest, CloudExitableDirectoryReaderTest, CollectionReloadTest, CollectionsAPIAsyncDistributedZkTest, CreateCollectionCleanupTest, CustomCollectionTest, OverseerStatusTest, OverseerTaskQueueTest, RecoveryAfterSoftCommitTest, ReplicationFactorTest, RollingRestartTest, SharedFSAutoReplicaFailoverUtilsTest, SimpleCollectionCreateDeleteTest, SolrCloudExampleTest, SolrXmlInZkTest, TestCloudBackupRestore, TestCloudDeleteByQuery, TestExclusionRuleCollectionAccess, TestMiniSolrCloudClusterSSL, TestOnReconnectListenerSupport, TestRandomRequestDistribution, TestReplicaProperties, TestRequestForwarding, TestSSLRandomization, TestShortCircuitedRequests, TestTolerantUpdateProcessorRandomCloud, TlogReplayBufferedWhileIndexingTest, HdfsCollectionsAPIDistributedZkTest, HdfsRecoverLeaseTest, HdfsRecoveryZkTest, HdfsSyncSliceTest, HdfsThreadLeakTest, HdfsWriteToMultipleCollectionsTest, ZkStateReaderTest, BlobRepositoryCloudTest, CachingDirectoryFactoryTest, DirectoryFactoryTest, TestConfigOverlay, TestConfigSetImmutable, TestConfigSetProperties, TestConfigSets, TestInfoStreamLogging, TestInitParams, TestReloadAndDeleteDocs, TestShardHandlerFactory, TestSolrConfigHandler, TestSolrDynamicMBean, TestSolrXml, RequestLoggingTest, TestBlobHandler, TestReqParamsAPI]
[junit4] Completed [497/598 (1!)] on J0 in 35.75s, 1 test, 1 failure <<< FAILURES!
[...truncated 318 lines...]
BUILD FAILED
/Users/jenkins/workspace/Lucene-Solr-6.x-MacOSX/build.xml:740: The following error occurred while executing this line:
/Users/jenkins/workspace/Lucene-Solr-6.x-MacOSX/build.xml:684: The following error occurred while executing this line:
/Users/jenkins/workspace/Lucene-Solr-6.x-MacOSX/build.xml:59: The following error occurred while executing this line:
/Users/jenkins/workspace/Lucene-Solr-6.x-MacOSX/solr/build.xml:233: The following error occurred while executing this line:
/Users/jenkins/workspace/Lucene-Solr-6.x-MacOSX/solr/common-build.xml:531: The following error occurred while executing this line:
/Users/jenkins/workspace/Lucene-Solr-6.x-MacOSX/lucene/common-build.xml:1427: The following error occurred while executing this line:
/Users/jenkins/workspace/Lucene-Solr-6.x-MacOSX/lucene/common-build.xml:984: There were test failures: 598 suites (10 ignored), 2435 tests, 1 failure, 121 ignored (71 assumptions) [seed: 949EE1395DE755E0]
Total time: 85 minutes 45 seconds
Build step 'Invoke Ant' marked build as failure
Archiving artifacts
[WARNINGS] Skipping publisher since build result is FAILURE
Recording test results
Email was triggered for: Failure - Any
Sending email for trigger: Failure - Any