You are viewing a plain text version of this content. The canonical link for it is here.
Posted to builds@beam.apache.org by Apache Jenkins Server <je...@builds.apache.org> on 2023/04/07 18:38:59 UTC

Build failed in Jenkins: beam_PostCommit_Python_Examples_Direct #1695

See <https://ci-beam.apache.org/job/beam_PostCommit_Python_Examples_Direct/1695/display/redirect?page=changes>

Changes:

[noreply] Move automatic model refresh notebook to correct dir (#26176)


------------------------------------------
[...truncated 1.05 MB...]
    signaled = self._cond.wait(timeout)
  File "/usr/lib/python3.7/threading.py", line 300, in wait
    gotit = waiter.acquire(True, timeout)

+++++++++++++++++++++++++++++++++++ Timeout ++++++++++++++++++++++++++++++++++++
------------------------------ Captured log call -------------------------------
INFO     root:pipeline.py:191 Missing pipeline option (runner). Executing pipeline using the default runner: DirectRunner.
INFO     root:environments.py:376 Default Python SDK image for environment is apache/beam_python3.7_sdk:2.48.0.dev
INFO     apache_beam.runners.portability.fn_api_runner.translations:translations.py:710 ==================== <function annotate_downstream_side_inputs at 0x7f09b558bb00> ====================
INFO     apache_beam.runners.portability.fn_api_runner.translations:translations.py:710 ==================== <function fix_side_input_pcoll_coders at 0x7f09b558bc20> ====================
INFO     apache_beam.runners.portability.fn_api_runner.translations:translations.py:710 ==================== <function pack_combiners at 0x7f09b5591170> ====================
INFO     apache_beam.runners.portability.fn_api_runner.translations:translations.py:710 ==================== <function lift_combiners at 0x7f09b5591200> ====================
INFO     apache_beam.runners.portability.fn_api_runner.translations:translations.py:710 ==================== <function expand_sdf at 0x7f09b55913b0> ====================
INFO     apache_beam.runners.portability.fn_api_runner.translations:translations.py:710 ==================== <function expand_gbk at 0x7f09b5591440> ====================
INFO     apache_beam.runners.portability.fn_api_runner.translations:translations.py:710 ==================== <function sink_flattens at 0x7f09b5591560> ====================
INFO     apache_beam.runners.portability.fn_api_runner.translations:translations.py:710 ==================== <function greedily_fuse at 0x7f09b55915f0> ====================
INFO     apache_beam.runners.portability.fn_api_runner.translations:translations.py:710 ==================== <function read_to_impulse at 0x7f09b5591680> ====================
INFO     apache_beam.runners.portability.fn_api_runner.translations:translations.py:710 ==================== <function impulse_to_input at 0x7f09b5591710> ====================
INFO     apache_beam.runners.portability.fn_api_runner.translations:translations.py:710 ==================== <function sort_stages at 0x7f09b5591950> ====================
INFO     apache_beam.runners.portability.fn_api_runner.translations:translations.py:710 ==================== <function add_impulse_to_dangling_transforms at 0x7f09b5591a70> ====================
INFO     apache_beam.runners.portability.fn_api_runner.translations:translations.py:710 ==================== <function setup_timer_mapping at 0x7f09b55918c0> ====================
INFO     apache_beam.runners.portability.fn_api_runner.translations:translations.py:710 ==================== <function populate_data_channel_coders at 0x7f09b55919e0> ====================
INFO     apache_beam.runners.worker.statecache:statecache.py:234 Creating state cache with size 104857600
INFO     apache_beam.runners.portability.fn_api_runner.worker_handlers:worker_handlers.py:908 Created Worker handler <apache_beam.runners.portability.fn_api_runner.worker_handlers.EmbeddedWorkerHandler object at 0x7f09a41f4c50> for environment ref_Environment_default_environment_1 (beam:env:embedded_python:v1, b'')
INFO     root:environments.py:376 Default Python SDK image for environment is apache/beam_python3.7_sdk:2.48.0.dev
INFO     root:environments.py:376 Default Python SDK image for environment is apache/beam_python3.7_sdk:2.48.0.dev
INFO     root:environments.py:376 Default Python SDK image for environment is apache/beam_python3.7_sdk:2.48.0.dev
INFO     root:environments.py:376 Default Python SDK image for environment is apache/beam_python3.7_sdk:2.48.0.dev
INFO     root:environments.py:376 Default Python SDK image for environment is apache/beam_python3.7_sdk:2.48.0.dev
INFO     root:environments.py:376 Default Python SDK image for environment is apache/beam_python3.7_sdk:2.48.0.dev
=============================== warnings summary ===============================
../../build/gradleenv/1398941891/lib/python3.7/site-packages/hdfs/config.py:15
  <https://ci-beam.apache.org/job/beam_PostCommit_Python_Examples_Direct/ws/src/build/gradleenv/1398941891/lib/python3.7/site-packages/hdfs/config.py>:15: DeprecationWarning: the imp module is deprecated in favour of importlib; see the module's documentation for alternative uses
    from imp import load_source

../../build/gradleenv/1398941891/lib/python3.7/site-packages/pkg_resources/__init__.py:121
  <https://ci-beam.apache.org/job/beam_PostCommit_Python_Examples_Direct/ws/src/build/gradleenv/1398941891/lib/python3.7/site-packages/pkg_resources/__init__.py>:121: DeprecationWarning: pkg_resources is deprecated as an API
    warnings.warn("pkg_resources is deprecated as an API", DeprecationWarning)

../../build/gradleenv/1398941891/lib/python3.7/site-packages/pkg_resources/__init__.py:2870: 18 warnings
  <https://ci-beam.apache.org/job/beam_PostCommit_Python_Examples_Direct/ws/src/build/gradleenv/1398941891/lib/python3.7/site-packages/pkg_resources/__init__.py>:2870: DeprecationWarning: Deprecated call to `pkg_resources.declare_namespace('google')`.
  Implementing implicit namespace packages (as specified in PEP 420) is preferred to `pkg_resources.declare_namespace`. See https://setuptools.pypa.io/en/latest/references/keywords.html#keyword-namespace-packages
    declare_namespace(pkg)

../../build/gradleenv/1398941891/lib/python3.7/site-packages/pkg_resources/__init__.py:2870: 13 warnings
  <https://ci-beam.apache.org/job/beam_PostCommit_Python_Examples_Direct/ws/src/build/gradleenv/1398941891/lib/python3.7/site-packages/pkg_resources/__init__.py>:2870: DeprecationWarning: Deprecated call to `pkg_resources.declare_namespace('google.cloud')`.
  Implementing implicit namespace packages (as specified in PEP 420) is preferred to `pkg_resources.declare_namespace`. See https://setuptools.pypa.io/en/latest/references/keywords.html#keyword-namespace-packages
    declare_namespace(pkg)

../../build/gradleenv/1398941891/lib/python3.7/site-packages/pkg_resources/__init__.py:2349
../../build/gradleenv/1398941891/lib/python3.7/site-packages/pkg_resources/__init__.py:2349
../../build/gradleenv/1398941891/lib/python3.7/site-packages/pkg_resources/__init__.py:2349
../../build/gradleenv/1398941891/lib/python3.7/site-packages/pkg_resources/__init__.py:2349
  <https://ci-beam.apache.org/job/beam_PostCommit_Python_Examples_Direct/ws/src/build/gradleenv/1398941891/lib/python3.7/site-packages/pkg_resources/__init__.py>:2349: DeprecationWarning: Deprecated call to `pkg_resources.declare_namespace('google')`.
  Implementing implicit namespace packages (as specified in PEP 420) is preferred to `pkg_resources.declare_namespace`. See https://setuptools.pypa.io/en/latest/references/keywords.html#keyword-namespace-packages
    declare_namespace(parent)

../../build/gradleenv/1398941891/lib/python3.7/site-packages/pkg_resources/__init__.py:2870
  <https://ci-beam.apache.org/job/beam_PostCommit_Python_Examples_Direct/ws/src/build/gradleenv/1398941891/lib/python3.7/site-packages/pkg_resources/__init__.py>:2870: DeprecationWarning: Deprecated call to `pkg_resources.declare_namespace('google.logging')`.
  Implementing implicit namespace packages (as specified in PEP 420) is preferred to `pkg_resources.declare_namespace`. See https://setuptools.pypa.io/en/latest/references/keywords.html#keyword-namespace-packages
    declare_namespace(pkg)

../../build/gradleenv/1398941891/lib/python3.7/site-packages/pkg_resources/__init__.py:2870
  <https://ci-beam.apache.org/job/beam_PostCommit_Python_Examples_Direct/ws/src/build/gradleenv/1398941891/lib/python3.7/site-packages/pkg_resources/__init__.py>:2870: DeprecationWarning: Deprecated call to `pkg_resources.declare_namespace('google.iam')`.
  Implementing implicit namespace packages (as specified in PEP 420) is preferred to `pkg_resources.declare_namespace`. See https://setuptools.pypa.io/en/latest/references/keywords.html#keyword-namespace-packages
    declare_namespace(pkg)

../../build/gradleenv/1398941891/lib/python3.7/site-packages/google/rpc/__init__.py:20
  <https://ci-beam.apache.org/job/beam_PostCommit_Python_Examples_Direct/ws/src/build/gradleenv/1398941891/lib/python3.7/site-packages/google/rpc/__init__.py>:20: DeprecationWarning: Deprecated call to `pkg_resources.declare_namespace('google.rpc')`.
  Implementing implicit namespace packages (as specified in PEP 420) is preferred to `pkg_resources.declare_namespace`. See https://setuptools.pypa.io/en/latest/references/keywords.html#keyword-namespace-packages
    pkg_resources.declare_namespace(__name__)

apache_beam/examples/complete/game/hourly_team_score_it_test.py::HourlyTeamScoreIT::test_hourly_team_score_output_checksum_on_small_input
  <https://ci-beam.apache.org/job/beam_PostCommit_Python_Examples_Direct/ws/src/sdks/python/apache_beam/io/gcp/tests/utils.py>:63: PendingDeprecationWarning: Client.dataset is deprecated and will be removed in a future version. Use a string like 'my_project.my_dataset' or a cloud.google.bigquery.DatasetReference object, instead.
    dataset_ref = client.dataset(unique_dataset_name, project=project)

apache_beam/examples/complete/game/hourly_team_score_it_test.py::HourlyTeamScoreIT::test_hourly_team_score_output_checksum_on_small_input
apache_beam/examples/cookbook/bigquery_tornadoes_it_test.py::BigqueryTornadoesIT::test_bigquery_tornadoes_it
apache_beam/examples/cookbook/filters_test.py::FiltersTest::test_filters_output_bigquery_matcher
  <https://ci-beam.apache.org/job/beam_PostCommit_Python_Examples_Direct/ws/src/sdks/python/apache_beam/io/gcp/bigquery.py>:2030: BeamDeprecationWarning: options is deprecated since First stable release. References to <pipeline>.options will not be supported
    is_streaming_pipeline = p.options.view_as(StandardOptions).streaming

apache_beam/examples/complete/game/hourly_team_score_it_test.py::HourlyTeamScoreIT::test_hourly_team_score_output_checksum_on_small_input
apache_beam/examples/cookbook/bigquery_tornadoes_it_test.py::BigqueryTornadoesIT::test_bigquery_tornadoes_it
apache_beam/examples/cookbook/filters_test.py::FiltersTest::test_filters_output_bigquery_matcher
  <https://ci-beam.apache.org/job/beam_PostCommit_Python_Examples_Direct/ws/src/sdks/python/apache_beam/io/gcp/bigquery.py>:2036: BeamDeprecationWarning: options is deprecated since First stable release. References to <pipeline>.options will not be supported
    experiments = p.options.view_as(DebugOptions).experiments or []

apache_beam/examples/complete/game/hourly_team_score_it_test.py::HourlyTeamScoreIT::test_hourly_team_score_output_checksum_on_small_input
apache_beam/examples/cookbook/bigquery_tornadoes_it_test.py::BigqueryTornadoesIT::test_bigquery_tornadoes_it
apache_beam/examples/cookbook/filters_test.py::FiltersTest::test_filters_output_bigquery_matcher
  <https://ci-beam.apache.org/job/beam_PostCommit_Python_Examples_Direct/ws/src/sdks/python/apache_beam/io/gcp/bigquery_file_loads.py>:1173: BeamDeprecationWarning: options is deprecated since First stable release. References to <pipeline>.options will not be supported
    temp_location = p.options.view_as(GoogleCloudOptions).temp_location

apache_beam/examples/complete/game/hourly_team_score_it_test.py::HourlyTeamScoreIT::test_hourly_team_score_output_checksum_on_small_input
apache_beam/examples/cookbook/bigquery_tornadoes_it_test.py::BigqueryTornadoesIT::test_bigquery_tornadoes_it
apache_beam/examples/cookbook/filters_test.py::FiltersTest::test_filters_output_bigquery_matcher
  <https://ci-beam.apache.org/job/beam_PostCommit_Python_Examples_Direct/ws/src/sdks/python/apache_beam/io/gcp/bigquery_file_loads.py>:1175: BeamDeprecationWarning: options is deprecated since First stable release. References to <pipeline>.options will not be supported
    p.options.view_as(GoogleCloudOptions).job_name or 'AUTOMATIC_JOB_NAME')

apache_beam/examples/cookbook/bigquery_side_input_it_test.py::BigQuerySideInputIT::test_bigquery_side_input_it
apache_beam/examples/cookbook/bigquery_side_input_it_test.py::BigQuerySideInputIT::test_bigquery_side_input_it
apache_beam/examples/cookbook/bigquery_tornadoes_it_test.py::BigqueryTornadoesIT::test_bigquery_tornadoes_it
apache_beam/examples/cookbook/filters_test.py::FiltersTest::test_filters_output_bigquery_matcher
apache_beam/examples/dataframe/flight_delays_it_test.py::FlightDelaysTest::test_flight_delays
  <https://ci-beam.apache.org/job/beam_PostCommit_Python_Examples_Direct/ws/src/sdks/python/apache_beam/io/gcp/bigquery.py>:2665: BeamDeprecationWarning: options is deprecated since First stable release. References to <pipeline>.options will not be supported
    temp_location = pcoll.pipeline.options.view_as(

apache_beam/examples/cookbook/bigquery_side_input_it_test.py::BigQuerySideInputIT::test_bigquery_side_input_it
apache_beam/examples/cookbook/bigquery_side_input_it_test.py::BigQuerySideInputIT::test_bigquery_side_input_it
apache_beam/examples/cookbook/bigquery_tornadoes_it_test.py::BigqueryTornadoesIT::test_bigquery_tornadoes_it
apache_beam/examples/cookbook/filters_test.py::FiltersTest::test_filters_output_bigquery_matcher
apache_beam/examples/dataframe/flight_delays_it_test.py::FlightDelaysTest::test_flight_delays
  <https://ci-beam.apache.org/job/beam_PostCommit_Python_Examples_Direct/ws/src/sdks/python/apache_beam/io/gcp/bigquery.py>:2667: BeamDeprecationWarning: options is deprecated since First stable release. References to <pipeline>.options will not be supported
    job_name = pcoll.pipeline.options.view_as(GoogleCloudOptions).job_name

apache_beam/examples/cookbook/bigquery_side_input_it_test.py::BigQuerySideInputIT::test_bigquery_side_input_it
apache_beam/examples/cookbook/bigquery_side_input_it_test.py::BigQuerySideInputIT::test_bigquery_side_input_it
apache_beam/examples/cookbook/bigquery_tornadoes_it_test.py::BigqueryTornadoesIT::test_bigquery_tornadoes_it
apache_beam/examples/cookbook/filters_test.py::FiltersTest::test_filters_output_bigquery_matcher
apache_beam/examples/dataframe/flight_delays_it_test.py::FlightDelaysTest::test_flight_delays
  <https://ci-beam.apache.org/job/beam_PostCommit_Python_Examples_Direct/ws/src/sdks/python/apache_beam/io/gcp/bigquery.py>:2698: BeamDeprecationWarning: options is deprecated since First stable release. References to <pipeline>.options will not be supported
    | _PassThroughThenCleanup(files_to_remove_pcoll))

apache_beam/examples/cookbook/bigquery_tornadoes_it_test.py::BigqueryTornadoesIT::test_bigquery_tornadoes_it
apache_beam/examples/cookbook/filters_test.py::FiltersTest::test_filters_output_bigquery_matcher
  <https://ci-beam.apache.org/job/beam_PostCommit_Python_Examples_Direct/ws/src/sdks/python/apache_beam/io/gcp/bigquery.py>:2026: BeamDeprecationWarning: options is deprecated since First stable release. References to <pipeline>.options will not be supported
    self.table_reference.projectId = pcoll.pipeline.options.view_as(

apache_beam/examples/cookbook/bigquery_tornadoes_it_test.py::BigqueryTornadoesIT::test_bigquery_tornadoes_it
apache_beam/examples/cookbook/filters_test.py::FiltersTest::test_filters_output_bigquery_matcher
  <https://ci-beam.apache.org/job/beam_PostCommit_Python_Examples_Direct/ws/src/sdks/python/apache_beam/io/gcp/bigquery_file_loads.py>:1166: BeamDeprecationWarning: options is deprecated since First stable release. References to <pipeline>.options will not be supported
    self.project = self.project or p.options.view_as(GoogleCloudOptions).project

apache_beam/examples/cookbook/bigquery_tornadoes_it_test.py::BigqueryTornadoesIT::test_bigquery_tornadoes_it
apache_beam/examples/cookbook/filters_test.py::FiltersTest::test_filters_output_bigquery_matcher
  <https://ci-beam.apache.org/job/beam_PostCommit_Python_Examples_Direct/ws/src/sdks/python/apache_beam/io/gcp/tests/utils.py>:100: PendingDeprecationWarning: Client.dataset is deprecated and will be removed in a future version. Use a string like 'my_project.my_dataset' or a cloud.google.bigquery.DatasetReference object, instead.
    table_ref = client.dataset(dataset_id).table(table_id)

apache_beam/examples/dataframe/flight_delays_it_test.py::FlightDelaysTest::test_flight_delays
  <https://ci-beam.apache.org/job/beam_PostCommit_Python_Examples_Direct/ws/src/sdks/python/apache_beam/examples/dataframe/flight_delays.py>:47: FutureWarning: Dropping of nuisance columns in DataFrame reductions (with 'numeric_only=None') is deprecated; in a future version this will raise TypeError.  Select only valid columns before calling the reduction.
    return airline_df[at_top_airports].mean()

apache_beam/examples/dataframe/flight_delays_it_test.py::FlightDelaysTest::test_flight_delays
apache_beam/examples/dataframe/wordcount_test.py::WordCountTest::test_basics
  <https://ci-beam.apache.org/job/beam_PostCommit_Python_Examples_Direct/ws/src/sdks/python/apache_beam/dataframe/io.py>:664: FutureWarning: WriteToFiles is experimental.
    sink=lambda _: _WriteToPandasFileSink(

apache_beam/examples/dataframe/flight_delays_it_test.py::FlightDelaysTest::test_flight_delays
apache_beam/examples/dataframe/wordcount_test.py::WordCountTest::test_basics
  <https://ci-beam.apache.org/job/beam_PostCommit_Python_Examples_Direct/ws/src/sdks/python/apache_beam/io/fileio.py>:596: BeamDeprecationWarning: options is deprecated since First stable release. References to <pipeline>.options will not be supported
    p.options.view_as(GoogleCloudOptions).temp_location or

-- Docs: https://docs.pytest.org/en/stable/how-to/capture-warnings.html
- generated xml file: <https://ci-beam.apache.org/job/beam_PostCommit_Python_Examples_Direct/ws/src/sdks/python/pytest_postCommitExamples-direct-py37.xml> -
=========================== short test summary info ============================
FAILED apache_beam/examples/complete/juliaset/juliaset/juliaset_test.py::JuliaSetTest::test_output_file_format - Failed: Timeout >600.0s [while running 'WriteToText/Write/WriteImpl/PreFinalize']
= 1 failed, 21 passed, 10 skipped, 6853 deselected, 79 warnings in 833.02s (0:13:53) =

> Task :sdks:python:test-suites:direct:py37:examples FAILED

FAILURE: Build completed with 5 failures.

1: Task failed with an exception.
-----------
* Where:
Script '<https://ci-beam.apache.org/job/beam_PostCommit_Python_Examples_Direct/ws/src/sdks/python/test-suites/direct/common.gradle'> line: 93

* What went wrong:
Execution failed for task ':sdks:python:test-suites:direct:py311:examples'.
> Process 'command 'sh'' finished with non-zero exit value 1

* Try:
> Run with --stacktrace option to get the stack trace.
> Run with --info or --debug option to get more log output.
==============================================================================

2: Task failed with an exception.
-----------
* Where:
Script '<https://ci-beam.apache.org/job/beam_PostCommit_Python_Examples_Direct/ws/src/sdks/python/test-suites/direct/common.gradle'> line: 93

* What went wrong:
Execution failed for task ':sdks:python:test-suites:direct:py38:examples'.
> Process 'command 'sh'' finished with non-zero exit value 1

* Try:
> Run with --stacktrace option to get the stack trace.
> Run with --info or --debug option to get more log output.
==============================================================================

3: Task failed with an exception.
-----------
* Where:
Script '<https://ci-beam.apache.org/job/beam_PostCommit_Python_Examples_Direct/ws/src/sdks/python/test-suites/direct/common.gradle'> line: 93

* What went wrong:
Execution failed for task ':sdks:python:test-suites:direct:py39:examples'.
> Process 'command 'sh'' finished with non-zero exit value 1

* Try:
> Run with --stacktrace option to get the stack trace.
> Run with --info or --debug option to get more log output.
==============================================================================

4: Task failed with an exception.
-----------
* Where:
Script '<https://ci-beam.apache.org/job/beam_PostCommit_Python_Examples_Direct/ws/src/sdks/python/test-suites/direct/common.gradle'> line: 93

* What went wrong:
Execution failed for task ':sdks:python:test-suites:direct:py310:examples'.
> Process 'command 'sh'' finished with non-zero exit value 1

* Try:
> Run with --stacktrace option to get the stack trace.
> Run with --info or --debug option to get more log output.
==============================================================================

5: Task failed with an exception.
-----------
* Where:
Script '<https://ci-beam.apache.org/job/beam_PostCommit_Python_Examples_Direct/ws/src/sdks/python/test-suites/direct/common.gradle'> line: 93

* What went wrong:
Execution failed for task ':sdks:python:test-suites:direct:py37:examples'.
> Process 'command 'sh'' finished with non-zero exit value 1

* Try:
> Run with --stacktrace option to get the stack trace.
> Run with --info or --debug option to get more log output.
==============================================================================

* Get more help at https://help.gradle.org

Deprecated Gradle features were used in this build, making it incompatible with Gradle 8.0.

You can use '--warning-mode all' to show the individual deprecation warnings and determine if they come from your own scripts or plugins.

See https://docs.gradle.org/7.5.1/userguide/command_line_interface.html#sec:command_line_warnings

BUILD FAILED in 16m 26s
27 actionable tasks: 21 executed, 4 from cache, 2 up-to-date

Publishing build scan...
https://gradle.com/s/dlyvmkevnapji

Build step 'Invoke Gradle script' changed build result to FAILURE
Build step 'Invoke Gradle script' marked build as failure

---------------------------------------------------------------------
To unsubscribe, e-mail: builds-unsubscribe@beam.apache.org
For additional commands, e-mail: builds-help@beam.apache.org


Jenkins build is back to normal : beam_PostCommit_Python_Examples_Direct #1699

Posted by Apache Jenkins Server <je...@builds.apache.org>.
See <https://ci-beam.apache.org/job/beam_PostCommit_Python_Examples_Direct/1699/display/redirect>


---------------------------------------------------------------------
To unsubscribe, e-mail: builds-unsubscribe@beam.apache.org
For additional commands, e-mail: builds-help@beam.apache.org