You are viewing a plain text version of this content. The canonical link for it is here.
Posted to builds@solr.apache.org by Apache Jenkins Server <je...@builds.apache.org> on 2023/07/13 13:04:37 UTC
[JENKINS] Solr » Solr-check-9.3 - Build # 49 - Failure!
Build: https://ci-builds.apache.org/job/Solr/job/Solr-check-9.3/49/
2 tests failed.
FAILED: org.apache.solr.opentelemetry.OtelTracerConfiguratorTest.testInjected
Error Message:
java.lang.Exception: Test abandoned because suite timeout was reached.
Stack Trace:
java.lang.Exception: Test abandoned because suite timeout was reached.
at __randomizedtesting.SeedInfo.seed([16EE88F04B20130E]:0)
FAILED: org.apache.solr.opentelemetry.OtelTracerConfiguratorTest.classMethod
Error Message:
java.lang.Exception: Suite timeout exceeded (>= 7200000 msec).
Stack Trace:
java.lang.Exception: Suite timeout exceeded (>= 7200000 msec).
at __randomizedtesting.SeedInfo.seed([16EE88F04B20130E]:0)
Build Log:
[...truncated 3587 lines...]
# ERROR: Error from server at http://localhost:8983/solr/admin/collections?action=CREATE&name=COLL_NAME&collection.configName=COLL_NAME&numShards=1&nrtReplicas=1&wt=javabin&version=2: org.apache.solr.cluster.placement.PlacementException: Not enough eligible nodes to place 1 replica(s) of type NRT for shard shard1 of collection COLL_NAME. Only able to place 0 replicas.
ok 42 Random placement plugin using ENV in 16252ms
ok 43 post solr log into solr in 10141ms
ok 44 start solr with ssl in 14317ms
ok 45 start solr with ssl and auth in 17531ms
ok 46 SOLR-11740 check 'solr stop' connection in 15462ms
ok 47 status detects locally running solr in 8197ms
ok 48 status does not expose cli parameters to end user in 253ms
ok 49 listing out files in 2766ms
ok 50 copying files around in 6582ms
ok 51 upconfig in 2712ms
> Task :solr:packaging:integrationTests FAILED
ERROR: The following test(s) have failed:
- org.apache.solr.opentelemetry.OtelTracerConfiguratorTest.testInjected (:solr:modules:opentelemetry)
Test output: /home/jenkins/jenkins-slave/workspace/Solr/Solr-check-9.3/solr/modules/opentelemetry/build/test-results/test/outputs/OUTPUT-org.apache.solr.opentelemetry.OtelTracerConfiguratorTest.txt
Reproduce with: gradlew :solr:modules:opentelemetry:test --tests "org.apache.solr.opentelemetry.OtelTracerConfiguratorTest.testInjected" -Ptests.jvms=4 -Ptests.haltonfailure=false "-Ptests.jvmargs=-XX:TieredStopAtLevel=1 -XX:+UseParallelGC -XX:ActiveProcessorCount=1 -XX:ReservedCodeCacheSize=120m" -Ptests.seed=16EE88F04B20130E -Ptests.multiplier=2 -Ptests.badapples=false -Ptests.file.encoding=US-ASCII
- org.apache.solr.opentelemetry.OtelTracerConfiguratorTest.classMethod (:solr:modules:opentelemetry)
Test output: /home/jenkins/jenkins-slave/workspace/Solr/Solr-check-9.3/solr/modules/opentelemetry/build/test-results/test/outputs/OUTPUT-org.apache.solr.opentelemetry.OtelTracerConfiguratorTest.txt
Reproduce with: gradlew :solr:modules:opentelemetry:test --tests "org.apache.solr.opentelemetry.OtelTracerConfiguratorTest.classMethod" -Ptests.jvms=4 -Ptests.haltonfailure=false "-Ptests.jvmargs=-XX:TieredStopAtLevel=1 -XX:+UseParallelGC -XX:ActiveProcessorCount=1 -XX:ReservedCodeCacheSize=120m" -Ptests.seed=16EE88F04B20130E -Ptests.multiplier=2 -Ptests.badapples=false -Ptests.file.encoding=US-ASCII
FAILURE: Build failed with an exception.
* Where:
Build file '/home/jenkins/jenkins-slave/workspace/Solr/Solr-check-9.3/solr/packaging/build.gradle' line: 285
* What went wrong:
Execution failed for task ':solr:packaging:integrationTests'.
> Process 'command '/home/jenkins/jenkins-slave/workspace/Solr/Solr-check-9.3/.gradle/node/packaging/node_modules/bats/bin/bats'' finished with non-zero exit value 1
* Try:
> Run with --stacktrace option to get the stack trace.
> Run with --info or --debug option to get more log output.
* Get more help at https://help.gradle.org
Deprecated Gradle features were used in this build, making it incompatible with Gradle 8.0.
You can use '--warning-mode all' to show the individual deprecation warnings and determine if they come from your own scripts or plugins.
See https://docs.gradle.org/7.6/userguide/command_line_interface.html#sec:command_line_warnings
BUILD FAILED in 2h 53m 40s
643 actionable tasks: 643 executed
Publishing build scan...
https://ge.apache.org/s/c5lvoameexgti
Build step 'Invoke Gradle script' changed build result to FAILURE
Build step 'Invoke Gradle script' marked build as failure
Archiving artifacts
Recording test results
[Checks API] No suitable checks publisher found.
Email was triggered for: Failure - Any
Sending email for trigger: Failure - Any
[JENKINS] Solr » Solr-check-9.3 - Build # 50 - Still Failing!
Posted by Apache Jenkins Server <je...@builds.apache.org>.
Build: https://ci-builds.apache.org/job/Solr/job/Solr-check-9.3/50/
All tests passed
Build Log:
[...truncated 1160 lines...]
# ERROR: Error from server at http://localhost:8983/solr/admin/collections?action=CREATE&name=COLL_NAME&collection.configName=COLL_NAME&numShards=1&nrtReplicas=1&wt=javabin&version=2: org.apache.solr.cluster.placement.PlacementException: Not enough eligible nodes to place 1 replica(s) of type NRT for shard shard1 of collection COLL_NAME. Only able to place 0 replicas.
ok 42 Random placement plugin using ENV in 16601ms
ok 43 post solr log into solr in 13169ms
ok 44 start solr with ssl in 14153ms
ok 45 start solr with ssl and auth in 20154ms
ok 46 SOLR-11740 check 'solr stop' connection in 19961ms
ok 47 status detects locally running solr in 9180ms
ok 48 status does not expose cli parameters to end user in 269ms
ok 49 listing out files in 3846ms
ok 50 copying files around in 6851ms
ok 51 upconfig in 2811ms
> Task :solr:packaging:integrationTests FAILED
FAILURE: Build failed with an exception.
* Where:
Build file '/home/jenkins/jenkins-slave/workspace/Solr/Solr-check-9.3/solr/packaging/build.gradle' line: 285
* What went wrong:
Execution failed for task ':solr:packaging:integrationTests'.
> Process 'command '/home/jenkins/jenkins-slave/workspace/Solr/Solr-check-9.3/.gradle/node/packaging/node_modules/bats/bin/bats'' finished with non-zero exit value 1
* Try:
> Run with --stacktrace option to get the stack trace.
> Run with --info or --debug option to get more log output.
* Get more help at https://help.gradle.org
Deprecated Gradle features were used in this build, making it incompatible with Gradle 8.0.
You can use '--warning-mode all' to show the individual deprecation warnings and determine if they come from your own scripts or plugins.
See https://docs.gradle.org/7.6/userguide/command_line_interface.html#sec:command_line_warnings
BUILD FAILED in 54m 10s
643 actionable tasks: 643 executed
Publishing build scan...
https://ge.apache.org/s/wzznhnymqbp22
Build step 'Invoke Gradle script' changed build result to FAILURE
Build step 'Invoke Gradle script' marked build as failure
Archiving artifacts
Recording test results
[Checks API] No suitable checks publisher found.
Email was triggered for: Failure - Any
Sending email for trigger: Failure - Any