You are viewing a plain text version of this content. The canonical link for it is here.
Posted to builds@cassandra.apache.org by Apache Jenkins Server <je...@builds.apache.org> on 2021/09/09 23:38:42 UTC
Build complete: Cassandra-4.0 #207 [UNSTABLE]
bc052fa68f525155246de498cc86bb192f2d479a
-------------------------------------------------------------------------------
Build Cassandra-4.0 #207 Still Unstable
URL: https://ci-cassandra.apache.org/job/Cassandra-4.0/207/
-------------------------------------------------------------------------------
Changes:
[Caleb Rackliffe] Remove all the state pollution between tests in SSTableReaderTest
-------------------------------------------------------------------------------
Failed Tests:
4 tests failed.
FAILED: dtest-upgrade.upgrade_tests.paging_test.TestPagingDatasetChangesNodes2RF1_Upgrade_indev_3_0_x_To_indev_4_0_x.test_data_change_impacting_earlier_page
FAILED: org.apache.cassandra.net.ConnectionTest.testMessageDeliveryOnReconnect
FAILED: org.apache.cassandra.cql3.MemtableSizeTest.testTruncationReleasesLogSpace
FAILED: org.apache.cassandra.distributed.upgrade.MixedModeReadTest.mixedModeReadColumnSubsetDigestCheck
-------------------------------------------------------------------------------
For complete test report and logs see https://nightlies.apache.org/cassandra/Cassandra-4.0/207/