You are viewing a plain text version of this content. The canonical link for it is here.
Posted to commits@sling.apache.org by Apache Jenkins Server <je...@builds.apache.org> on 2018/10/16 15:29:52 UTC

Build failed in Jenkins: sling-launchpad-comparator-1.8 #55

See <https://builds.apache.org/job/sling-launchpad-comparator-1.8/55/display/redirect?page=changes>

Changes:

[rombert] Support the 'org.apache.sling.starter' artifact id

[rombert] Guard against no issues being fixed in a version

[rombert] Handle missing SVN revisions

[rombert] Switch changelogs to Git

[rombert] Update README

------------------------------------------
Started by an SCM change
[EnvInject] - Loading node environment variables.
Building remotely on H33 (ubuntu xenial) in workspace <https://builds.apache.org/job/sling-launchpad-comparator-1.8/ws/>
[WS-CLEANUP] Deleting project workspace...
[WS-CLEANUP] Done
Cloning the remote Git repository
Cloning repository https://github.com/apache/sling-launchpad-comparator.git
 > git init <https://builds.apache.org/job/sling-launchpad-comparator-1.8/ws/> # timeout=10
Fetching upstream changes from https://github.com/apache/sling-launchpad-comparator.git
 > git --version # timeout=10
 > git fetch --tags --progress https://github.com/apache/sling-launchpad-comparator.git +refs/heads/*:refs/remotes/origin/*
 > git config remote.origin.url https://github.com/apache/sling-launchpad-comparator.git # timeout=10
 > git config --add remote.origin.fetch +refs/heads/*:refs/remotes/origin/* # timeout=10
 > git config remote.origin.url https://github.com/apache/sling-launchpad-comparator.git # timeout=10
Fetching upstream changes from https://github.com/apache/sling-launchpad-comparator.git
 > git fetch --tags --progress https://github.com/apache/sling-launchpad-comparator.git +refs/heads/*:refs/remotes/origin/*
 > git rev-parse origin/master^{commit} # timeout=10
Checking out Revision 6c3ce295f85eafdad458fac7284a8d88ac99a21f (origin/master)
 > git config core.sparsecheckout # timeout=10
 > git checkout -f 6c3ce295f85eafdad458fac7284a8d88ac99a21f
Commit message: "Update README"
 > git rev-list --no-walk aa621a5b88bf61b7ff6ef300d9423113cde29047 # timeout=10
Parsing POMs
Modules changed, recalculating dependency graph
Established TCP socket on 36715
maven33-agent.jar already up to date
maven33-interceptor.jar already up to date
maven3-interceptor-commons.jar already up to date
[sling-launchpad-comparator-1.8] $ /home/jenkins/tools/java/latest1.8/bin/java -Xmx4g -Xms4g -cp /home/jenkins/jenkins-slave/maven33-agent.jar:/home/jenkins/tools/maven/apache-maven-3.3.9/boot/plexus-classworlds-2.5.2.jar:/home/jenkins/tools/maven/apache-maven-3.3.9/conf/logging jenkins.maven3.agent.Maven33Main /home/jenkins/tools/maven/apache-maven-3.3.9 /home/jenkins/jenkins-slave/slave.jar /home/jenkins/jenkins-slave/maven33-interceptor.jar /home/jenkins/jenkins-slave/maven3-interceptor-commons.jar 36715
<===[JENKINS REMOTING CAPACITY]===>   channel started
Executing Maven:  -B -f <https://builds.apache.org/job/sling-launchpad-comparator-1.8/ws/pom.xml> -Dmaven.repo.local=/home/jenkins/jenkins-slave/maven-repositories/0 -U clean deploy
[INFO] Scanning for projects...
[INFO]                                                                         
[INFO] ------------------------------------------------------------------------
[INFO] Building Apache Sling Launchpad Comparator 0.9.0-SNAPSHOT
[INFO] ------------------------------------------------------------------------
[INFO] Downloading: https://repo.maven.apache.org/maven2/org/eclipse/jgit/org.eclipse.jgit/5.1.2.201810061102-r/org.eclipse.jgit-5.1.2.201810061102-r.pom
[INFO] Downloaded: https://repo.maven.apache.org/maven2/org/eclipse/jgit/org.eclipse.jgit/5.1.2.201810061102-r/org.eclipse.jgit-5.1.2.201810061102-r.pom (10 KB at 23.7 KB/sec)
[INFO] Downloading: https://repo.maven.apache.org/maven2/org/eclipse/jgit/org.eclipse.jgit-parent/5.1.2.201810061102-r/org.eclipse.jgit-parent-5.1.2.201810061102-r.pom
[INFO] Downloaded: https://repo.maven.apache.org/maven2/org/eclipse/jgit/org.eclipse.jgit-parent/5.1.2.201810061102-r/org.eclipse.jgit-parent-5.1.2.201810061102-r.pom (32 KB at 812.6 KB/sec)
[INFO] Downloading: https://repo.maven.apache.org/maven2/org/eclipse/jgit/org.eclipse.jgit/5.1.2.201810061102-r/org.eclipse.jgit-5.1.2.201810061102-r.jar
[INFO] Downloaded: https://repo.maven.apache.org/maven2/org/eclipse/jgit/org.eclipse.jgit/5.1.2.201810061102-r/org.eclipse.jgit-5.1.2.201810061102-r.jar (2619 KB at 8906.5 KB/sec)
[INFO] 
[INFO] --- maven-clean-plugin:2.5:clean (default-clean) @ launchpad-comparator ---
[INFO] 
[INFO] --- maven-enforcer-plugin:1.3.1:enforce (enforce-java) @ launchpad-comparator ---
[INFO] 
[INFO] --- maven-antrun-plugin:1.8:run (set-bundle-required-execution-environment) @ launchpad-comparator ---
[INFO] Executing tasks

main:
Setting Bundle-RequiredExecutionEnvironment=JavaSE-1.8 from sling.java.version=8
[INFO] Executed tasks
[INFO] 
[INFO] --- maven-remote-resources-plugin:1.5:process (default) @ launchpad-comparator ---
[INFO] 
[INFO] --- maven-resources-plugin:2.7:resources (default-resources) @ launchpad-comparator ---
[INFO] Using 'UTF-8' encoding to copy filtered resources.
[INFO] skip non existing resourceDirectory <https://builds.apache.org/job/sling-launchpad-comparator-1.8/ws/src/main/resources>
[INFO] Copying 3 resources
[INFO] 
[INFO] --- maven-antrun-plugin:1.8:run (check-memory-task) @ launchpad-comparator ---
[INFO] Executing tasks

main:
     [echo] **************** WARNING (SLING-443/SLING-1782) ******************************
     [echo] On most platforms, you'll get OutOfMemoryErrors when building unless you set
     [echo] on 32bit platforms: MAVEN_OPTS="-Xmx256M -XX:MaxPermSize=256M", see SLING-443
     [echo] on 64bit platforms: MAVEN_OPTS="-Xmx512M -XX:MaxPermSize=512M", see SLING-1782
     [echo] ******************************************************************************
[INFO] Executed tasks
[INFO] 
[INFO] --- maven-compiler-plugin:3.2:compile (default-compile) @ launchpad-comparator ---
[INFO] Changes detected - recompiling the module!
[INFO] Compiling 11 source files to <https://builds.apache.org/job/sling-launchpad-comparator-1.8/ws/target/classes>
[INFO] 
[INFO] --- maven-resources-plugin:2.7:testResources (default-testResources) @ launchpad-comparator ---
[INFO] Using 'UTF-8' encoding to copy filtered resources.
[INFO] skip non existing resourceDirectory <https://builds.apache.org/job/sling-launchpad-comparator-1.8/ws/src/test/resources>
[INFO] Copying 3 resources
[INFO] 
[INFO] --- maven-compiler-plugin:3.2:testCompile (default-testCompile) @ launchpad-comparator ---
[INFO] Changes detected - recompiling the module!
[INFO] Compiling 1 source file to <https://builds.apache.org/job/sling-launchpad-comparator-1.8/ws/target/test-classes>
[INFO] 
[INFO] --- maven-surefire-plugin:2.18.1:test (default-test) @ launchpad-comparator ---
[INFO] Surefire report directory: <https://builds.apache.org/job/sling-launchpad-comparator-1.8/ws/target/surefire-reports>

-------------------------------------------------------
 T E S T S
-------------------------------------------------------
Running org.apache.sling.tooling.lc.ArtifactsTest
Tests run: 4, Failures: 0, Errors: 0, Skipped: 0, Time elapsed: 0.002 sec - in org.apache.sling.tooling.lc.ArtifactsTest

Results :

Tests run: 4, Failures: 0, Errors: 0, Skipped: 0

[JENKINS] Recording test results
[WARNING] Attempt to (de-)serialize anonymous class hudson.maven.reporters.SurefireArchiver$2; see: https://jenkins.io/redirect/serialization-of-anonymous-classes/
[INFO] 
[INFO] --- animal-sniffer-maven-plugin:1.14:check (default) @ launchpad-comparator ---
[INFO] Signature checking is skipped.
[WARNING] Attempt to (de-)serialize anonymous class hudson.maven.reporters.BuildInfoRecorder$1; see: https://jenkins.io/redirect/serialization-of-anonymous-classes/
[INFO] 
[INFO] --- maven-jar-plugin:2.5:jar (default-jar) @ launchpad-comparator ---
[INFO] Building jar: <https://builds.apache.org/job/sling-launchpad-comparator-1.8/ws/target/launchpad-comparator-0.9.0-SNAPSHOT.jar>
[INFO] 
[INFO] >>> maven-source-plugin:2.4:jar (attach-sources) > generate-sources @ launchpad-comparator >>>
[INFO] 
[INFO] --- maven-enforcer-plugin:1.3.1:enforce (enforce-java) @ launchpad-comparator ---
[INFO] 
[INFO] --- maven-antrun-plugin:1.8:run (set-bundle-required-execution-environment) @ launchpad-comparator ---
[INFO] Executing tasks

main:
Setting Bundle-RequiredExecutionEnvironment=JavaSE-1.8 from sling.java.version=8
[INFO] Executed tasks
[WARNING] Failed to getClass for org.apache.maven.plugin.source.SourceJarMojo
[INFO] 
[INFO] <<< maven-source-plugin:2.4:jar (attach-sources) < generate-sources @ launchpad-comparator <<<
[INFO] 
[INFO] --- maven-source-plugin:2.4:jar (attach-sources) @ launchpad-comparator ---
[INFO] Building jar: <https://builds.apache.org/job/sling-launchpad-comparator-1.8/ws/target/launchpad-comparator-0.9.0-SNAPSHOT-sources.jar>
[INFO] 
[INFO] --- maven-site-plugin:3.4:attach-descriptor (attach-descriptor) @ launchpad-comparator ---
[INFO] 
[INFO] --- maven-shade-plugin:2.4.1:shade (default) @ launchpad-comparator ---
[INFO] Including org.eclipse.aether:aether-api:jar:1.0.0.v20140518 in the shaded jar.
[INFO] Including org.eclipse.aether:aether-util:jar:1.0.0.v20140518 in the shaded jar.
[INFO] Including org.eclipse.aether:aether-impl:jar:1.0.0.v20140518 in the shaded jar.
[INFO] Including org.eclipse.aether:aether-spi:jar:1.0.0.v20140518 in the shaded jar.
[INFO] Including org.eclipse.aether:aether-connector-basic:jar:1.0.0.v20140518 in the shaded jar.
[INFO] Including org.eclipse.aether:aether-transport-file:jar:1.0.0.v20140518 in the shaded jar.
[INFO] Including org.eclipse.aether:aether-transport-http:jar:1.0.0.v20140518 in the shaded jar.
[INFO] Including org.apache.httpcomponents:httpclient:jar:4.2.6 in the shaded jar.
[INFO] Including org.apache.httpcomponents:httpcore:jar:4.2.5 in the shaded jar.
[INFO] Including commons-codec:commons-codec:jar:1.6 in the shaded jar.
[INFO] Including org.slf4j:jcl-over-slf4j:jar:1.6.2 in the shaded jar.
[INFO] Including org.eclipse.aether:aether-transport-wagon:jar:1.0.0.v20140518 in the shaded jar.
[INFO] Including org.apache.maven.wagon:wagon-provider-api:jar:1.0 in the shaded jar.
[INFO] Including org.apache.maven:maven-aether-provider:jar:3.1.0 in the shaded jar.
[INFO] Including org.apache.maven:maven-model:jar:3.1.0 in the shaded jar.
[INFO] Including org.apache.maven:maven-model-builder:jar:3.1.0 in the shaded jar.
[INFO] Including org.codehaus.plexus:plexus-interpolation:jar:1.16 in the shaded jar.
[INFO] Including org.apache.maven:maven-repository-metadata:jar:3.1.0 in the shaded jar.
[INFO] Including org.eclipse.sisu:org.eclipse.sisu.plexus:jar:0.0.0.M2a in the shaded jar.
[INFO] Including javax.enterprise:cdi-api:jar:1.0 in the shaded jar.
[INFO] Including javax.annotation:jsr250-api:jar:1.0 in the shaded jar.
[INFO] Including javax.inject:javax.inject:jar:1 in the shaded jar.
[INFO] Including com.google.guava:guava:jar:10.0.1 in the shaded jar.
[INFO] Including com.google.code.findbugs:jsr305:jar:1.3.9 in the shaded jar.
[INFO] Including org.sonatype.sisu:sisu-guice:jar:no_aop:3.1.0 in the shaded jar.
[INFO] Including aopalliance:aopalliance:jar:1.0 in the shaded jar.
[INFO] Including org.eclipse.sisu:org.eclipse.sisu.inject:jar:0.0.0.M2a in the shaded jar.
[INFO] Including asm:asm:jar:3.3.1 in the shaded jar.
[INFO] Including org.codehaus.plexus:plexus-classworlds:jar:2.4 in the shaded jar.
[INFO] Including org.codehaus.plexus:plexus-component-annotations:jar:1.5.5 in the shaded jar.
[INFO] Including org.codehaus.plexus:plexus-utils:jar:3.0.10 in the shaded jar.
[INFO] Including org.apache.maven.wagon:wagon-ssh:jar:1.0 in the shaded jar.
[INFO] Including com.jcraft:jsch:jar:0.1.44-1 in the shaded jar.
[INFO] Including org.apache.maven.wagon:wagon-ssh-common:jar:1.0 in the shaded jar.
[INFO] Including org.codehaus.plexus:plexus-interactivity-api:jar:1.0-alpha-6 in the shaded jar.
[INFO] Including org.slf4j:slf4j-api:jar:1.5.2 in the shaded jar.
[INFO] Including org.slf4j:slf4j-simple:jar:1.5.2 in the shaded jar.
[INFO] Including org.apache.sling:org.apache.sling.provisioning.model:jar:1.8.2 in the shaded jar.
[INFO] Including org.eclipse.jgit:org.eclipse.jgit:jar:5.1.2.201810061102-r in the shaded jar.
[INFO] Including com.jcraft:jzlib:jar:1.1.1 in the shaded jar.
[INFO] Including com.googlecode.javaewah:JavaEWAH:jar:1.1.6 in the shaded jar.
[INFO] Including com.google.code.gson:gson:jar:2.2.4 in the shaded jar.
[INFO] Replacing original artifact with shaded artifact.
[INFO] Replacing <https://builds.apache.org/job/sling-launchpad-comparator-1.8/ws/target/launchpad-comparator-0.9.0-SNAPSHOT.jar> with <https://builds.apache.org/job/sling-launchpad-comparator-1.8/ws/target/launchpad-comparator-0.9.0-SNAPSHOT-shaded.jar>
[INFO] Dependency-reduced POM written at: <https://builds.apache.org/job/sling-launchpad-comparator-1.8/ws/dependency-reduced-pom.xml>
[INFO] Dependency-reduced POM written at: <https://builds.apache.org/job/sling-launchpad-comparator-1.8/ws/dependency-reduced-pom.xml>
[INFO] 
[INFO] --- ianal-maven-plugin:1.0-alpha-1:verify-legal-files (default) @ launchpad-comparator ---
[INFO] Checking legal files in: launchpad-comparator-0.9.0-SNAPSHOT.jar
[INFO] Checking legal files in: launchpad-comparator-0.9.0-SNAPSHOT-sources.jar
[INFO] 
[INFO] --- apache-rat-plugin:0.11:check (default) @ launchpad-comparator ---
[INFO] 51 implicit excludes (use -debug for more details).
[INFO] Exclude: src/main/appended-resources/META-INF/*
[INFO] Exclude: velocity.log
[INFO] Exclude: target/*
[INFO] Exclude: README.md
[INFO] Exclude: maven-eclipse.xml
[INFO] Exclude: .*
[INFO] Exclude: .*/**
[INFO] Exclude: **/*.json
[INFO] Exclude: DEPENDENCIES
[INFO] Exclude: **/*.rej
[INFO] Exclude: dependency-reduced-pom.xml
[INFO] 16 resources included (use -debug for more details)
[INFO] Rat check: Summary of files. Unapproved: 1 unknown: 1 generated: 0 approved: 14 licence.
[WARNING] Attempt to (de-)serialize anonymous class hudson.maven.reporters.MavenArtifactArchiver$2; see: https://jenkins.io/redirect/serialization-of-anonymous-classes/
[JENKINS] Archiving disabled
[WARNING] Attempt to (de-)serialize anonymous class hudson.maven.reporters.MavenFingerprinter$1; see: https://jenkins.io/redirect/serialization-of-anonymous-classes/
[JENKINS] Archiving disabled
[INFO] ------------------------------------------------------------------------
[INFO] BUILD FAILURE
[INFO] ------------------------------------------------------------------------
[INFO] Total time: 01:26 min
[INFO] Finished at: 2018-10-16T15:29:50+00:00
[INFO] Final Memory: 74M/3925M
[INFO] ------------------------------------------------------------------------
Waiting for Jenkins to finish collecting data
[ERROR] Failed to execute goal org.apache.rat:apache-rat-plugin:0.11:check (default) on project launchpad-comparator: Too many files with unapproved license: 1 See RAT report in: <https://builds.apache.org/job/sling-launchpad-comparator-1.8/ws/target/rat.txt> -> [Help 1]
[ERROR] 
[ERROR] To see the full stack trace of the errors, re-run Maven with the -e switch.
[ERROR] Re-run Maven using the -X switch to enable full debug logging.
[ERROR] 
[ERROR] For more information about the errors and possible solutions, please read the following articles:
[ERROR] [Help 1] http://cwiki.apache.org/confluence/display/MAVEN/MojoFailureException
channel stopped
Recording test results

Jenkins build is back to normal : sling-launchpad-comparator-1.8 #56

Posted by Apache Jenkins Server <je...@builds.apache.org>.
See <https://builds.apache.org/job/sling-launchpad-comparator-1.8/56/display/redirect?page=changes>