You are viewing a plain text version of this content. The canonical link for it is here.
Posted to dev@lucene.apache.org by Apache Jenkins Server <je...@builds.apache.org> on 2012/12/28 03:52:21 UTC
[JENKINS] Lucene-Solr-Tests-trunk-Java6 - Build # 15750 - Still
Failing
Build: https://builds.apache.org/job/Lucene-Solr-Tests-trunk-Java6/15750/
1 tests failed.
REGRESSION: org.apache.solr.cloud.SyncSliceTest.testDistribSearch
Error Message:
shard1 should have just been set up to be inconsistent - but it's still consistent
Stack Trace:
java.lang.AssertionError: shard1 should have just been set up to be inconsistent - but it's still consistent
at __randomizedtesting.SeedInfo.seed([8A86F0CDD603F100:B607ED5A15C913C]:0)
at org.junit.Assert.fail(Assert.java:93)
at org.junit.Assert.assertTrue(Assert.java:43)
at org.junit.Assert.assertNotNull(Assert.java:526)
at org.apache.solr.cloud.SyncSliceTest.doTest(SyncSliceTest.java:214)
at org.apache.solr.BaseDistributedSearchTestCase.testDistribSearch(BaseDistributedSearchTestCase.java:794)
at sun.reflect.NativeMethodAccessorImpl.invoke0(Native Method)
at sun.reflect.NativeMethodAccessorImpl.invoke(NativeMethodAccessorImpl.java:57)
at sun.reflect.DelegatingMethodAccessorImpl.invoke(DelegatingMethodAccessorImpl.java:43)
at java.lang.reflect.Method.invoke(Method.java:616)
at com.carrotsearch.randomizedtesting.RandomizedRunner.invoke(RandomizedRunner.java:1559)
at com.carrotsearch.randomizedtesting.RandomizedRunner.access$600(RandomizedRunner.java:79)
at com.carrotsearch.randomizedtesting.RandomizedRunner$6.evaluate(RandomizedRunner.java:737)
at com.carrotsearch.randomizedtesting.RandomizedRunner$7.evaluate(RandomizedRunner.java:773)
at com.carrotsearch.randomizedtesting.RandomizedRunner$8.evaluate(RandomizedRunner.java:787)
at com.carrotsearch.randomizedtesting.rules.SystemPropertiesRestoreRule$1.evaluate(SystemPropertiesRestoreRule.java:53)
at org.apache.lucene.util.TestRuleSetupTeardownChained$1.evaluate(TestRuleSetupTeardownChained.java:50)
at org.apache.lucene.util.TestRuleFieldCacheSanity$1.evaluate(TestRuleFieldCacheSanity.java:51)
at org.apache.lucene.util.AbstractBeforeAfterRule$1.evaluate(AbstractBeforeAfterRule.java:46)
at com.carrotsearch.randomizedtesting.rules.SystemPropertiesInvariantRule$1.evaluate(SystemPropertiesInvariantRule.java:55)
at org.apache.lucene.util.TestRuleThreadAndTestName$1.evaluate(TestRuleThreadAndTestName.java:49)
at org.apache.lucene.util.TestRuleIgnoreAfterMaxFailures$1.evaluate(TestRuleIgnoreAfterMaxFailures.java:70)
at org.apache.lucene.util.TestRuleMarkFailure$1.evaluate(TestRuleMarkFailure.java:48)
at com.carrotsearch.randomizedtesting.rules.StatementAdapter.evaluate(StatementAdapter.java:36)
at com.carrotsearch.randomizedtesting.ThreadLeakControl$StatementRunner.run(ThreadLeakControl.java:358)
at com.carrotsearch.randomizedtesting.ThreadLeakControl.forkTimeoutingTask(ThreadLeakControl.java:782)
at com.carrotsearch.randomizedtesting.ThreadLeakControl$3.evaluate(ThreadLeakControl.java:442)
at com.carrotsearch.randomizedtesting.RandomizedRunner.runSingleTest(RandomizedRunner.java:746)
at com.carrotsearch.randomizedtesting.RandomizedRunner$3.evaluate(RandomizedRunner.java:648)
at com.carrotsearch.randomizedtesting.RandomizedRunner$4.evaluate(RandomizedRunner.java:682)
at com.carrotsearch.randomizedtesting.RandomizedRunner$5.evaluate(RandomizedRunner.java:693)
at com.carrotsearch.randomizedtesting.rules.StatementAdapter.evaluate(StatementAdapter.java:36)
at com.carrotsearch.randomizedtesting.rules.SystemPropertiesRestoreRule$1.evaluate(SystemPropertiesRestoreRule.java:53)
at org.apache.lucene.util.AbstractBeforeAfterRule$1.evaluate(AbstractBeforeAfterRule.java:46)
at org.apache.lucene.util.TestRuleStoreClassName$1.evaluate(TestRuleStoreClassName.java:42)
at com.carrotsearch.randomizedtesting.rules.SystemPropertiesInvariantRule$1.evaluate(SystemPropertiesInvariantRule.java:55)
at com.carrotsearch.randomizedtesting.rules.NoShadowingOrOverridesOnMethodsRule$1.evaluate(NoShadowingOrOverridesOnMethodsRule.java:39)
at com.carrotsearch.randomizedtesting.rules.NoShadowingOrOverridesOnMethodsRule$1.evaluate(NoShadowingOrOverridesOnMethodsRule.java:39)
at com.carrotsearch.randomizedtesting.rules.StatementAdapter.evaluate(StatementAdapter.java:36)
at org.apache.lucene.util.TestRuleAssertionsRequired$1.evaluate(TestRuleAssertionsRequired.java:43)
at org.apache.lucene.util.TestRuleMarkFailure$1.evaluate(TestRuleMarkFailure.java:48)
at org.apache.lucene.util.TestRuleIgnoreAfterMaxFailures$1.evaluate(TestRuleIgnoreAfterMaxFailures.java:70)
at org.apache.lucene.util.TestRuleIgnoreTestSuites$1.evaluate(TestRuleIgnoreTestSuites.java:55)
at com.carrotsearch.randomizedtesting.rules.StatementAdapter.evaluate(StatementAdapter.java:36)
at com.carrotsearch.randomizedtesting.ThreadLeakControl$StatementRunner.run(ThreadLeakControl.java:358)
at java.lang.Thread.run(Thread.java:679)
Build Log:
[...truncated 8767 lines...]
[junit4:junit4] Suite: org.apache.solr.cloud.SyncSliceTest
[junit4:junit4] 2> 0 T3256 oas.BaseDistributedSearchTestCase.initHostContext Setting hostContext system property: /
[junit4:junit4] 2> 4 T3256 oas.SolrTestCaseJ4.setUp ###Starting testDistribSearch
[junit4:junit4] 2> Creating dataDir: /usr/home/hudson/hudson-slave/workspace/Lucene-Solr-Tests-trunk-Java6/solr/build/solr-core/test/J1/./solrtest-SyncSliceTest-1356662992408
[junit4:junit4] 2> 5 T3256 oasc.ZkTestServer.run STARTING ZK TEST SERVER
[junit4:junit4] 2> 6 T3257 oasc.ZkTestServer$ZKServerMain.runFromConfig Starting server
[junit4:junit4] 2> 9 T3257 oazs.ZooKeeperServer.setTickTime tickTime set to 1000
[junit4:junit4] 2> 9 T3257 oazs.ZooKeeperServer.setMinSessionTimeout minSessionTimeout set to -1
[junit4:junit4] 2> 9 T3257 oazs.ZooKeeperServer.setMaxSessionTimeout maxSessionTimeout set to -1
[junit4:junit4] 2> 10 T3257 oazs.NIOServerCnxnFactory.configure binding to port 0.0.0.0/0.0.0.0:0
[junit4:junit4] 2> 11 T3257 oazsp.FileTxnSnapLog.save Snapshotting: 0x0 to /usr/home/hudson/hudson-slave/workspace/Lucene-Solr-Tests-trunk-Java6/solr/build/solr-core/test/J1/./org.apache.solr.cloud.SyncSliceTest-1356662992407/zookeeper/server1/data/version-2/snapshot.0
[junit4:junit4] 2> 107 T3256 oasc.ZkTestServer.run start zk server on port:29221
[junit4:junit4] 2> 107 T3256 oaz.ZooKeeper.<init> Initiating client connection, connectString=127.0.0.1:29221 sessionTimeout=10000 watcher=org.apache.solr.common.cloud.ConnectionManager@3911d28d
[junit4:junit4] 2> 108 T3256 oascc.ConnectionManager.waitForConnected Waiting for client to connect to ZooKeeper
[junit4:junit4] 2> 108 T3262 oaz.ClientCnxn$SendThread.logStartConnect Opening socket connection to server localhost/127.0.0.1:29221. Will not attempt to authenticate using SASL (access denied (javax.security.auth.AuthPermission getLoginConfiguration))
[junit4:junit4] 2> 109 T3262 oaz.ClientCnxn$SendThread.primeConnection Socket connection established to localhost/127.0.0.1:29221, initiating session
[junit4:junit4] 2> 109 T3258 oazs.NIOServerCnxnFactory.run Accepted socket connection from /140.211.11.196:29222
[junit4:junit4] 2> 110 T3258 oazs.ZooKeeperServer.processConnectRequest Client attempting to establish new session at /140.211.11.196:29222
[junit4:junit4] 2> 110 T3260 oazsp.FileTxnLog.append Creating new log file: log.1
[junit4:junit4] 2> 139 T3260 oazs.ZooKeeperServer.finishSessionInit Established session 0x13bdf6a6e1f0000 with negotiated timeout 10000 for client /140.211.11.196:29222
[junit4:junit4] 2> 139 T3262 oaz.ClientCnxn$SendThread.onConnected Session establishment complete on server localhost/127.0.0.1:29221, sessionid = 0x13bdf6a6e1f0000, negotiated timeout = 10000
[junit4:junit4] 2> 139 T3263 oascc.ConnectionManager.process Watcher org.apache.solr.common.cloud.ConnectionManager@3911d28d name:ZooKeeperConnection Watcher:127.0.0.1:29221 got event WatchedEvent state:SyncConnected type:None path:null path:null type:None
[junit4:junit4] 2> 140 T3256 oascc.ConnectionManager.waitForConnected Client is connected to ZooKeeper
[junit4:junit4] 2> 140 T3256 oascc.SolrZkClient.makePath makePath: /solr
[junit4:junit4] 2> 143 T3261 oazs.PrepRequestProcessor.pRequest2Txn Processed session termination for sessionid: 0x13bdf6a6e1f0000
[junit4:junit4] 2> 153 T3263 oaz.ClientCnxn$EventThread.run EventThread shut down
[junit4:junit4] 2> 153 T3258 oazs.NIOServerCnxn.closeSock Closed socket connection for client /140.211.11.196:29222 which had sessionid 0x13bdf6a6e1f0000
[junit4:junit4] 2> 153 T3256 oaz.ZooKeeper.close Session: 0x13bdf6a6e1f0000 closed
[junit4:junit4] 2> 154 T3256 oaz.ZooKeeper.<init> Initiating client connection, connectString=127.0.0.1:29221/solr sessionTimeout=10000 watcher=org.apache.solr.common.cloud.ConnectionManager@4f4b0d3a
[junit4:junit4] 2> 154 T3256 oascc.ConnectionManager.waitForConnected Waiting for client to connect to ZooKeeper
[junit4:junit4] 2> 155 T3264 oaz.ClientCnxn$SendThread.logStartConnect Opening socket connection to server localhost/127.0.0.1:29221. Will not attempt to authenticate using SASL (access denied (javax.security.auth.AuthPermission getLoginConfiguration))
[junit4:junit4] 2> 155 T3264 oaz.ClientCnxn$SendThread.primeConnection Socket connection established to localhost/127.0.0.1:29221, initiating session
[junit4:junit4] 2> 155 T3258 oazs.NIOServerCnxnFactory.run Accepted socket connection from /140.211.11.196:29223
[junit4:junit4] 2> 156 T3258 oazs.ZooKeeperServer.processConnectRequest Client attempting to establish new session at /140.211.11.196:29223
[junit4:junit4] 2> 157 T3260 oazs.ZooKeeperServer.finishSessionInit Established session 0x13bdf6a6e1f0001 with negotiated timeout 10000 for client /140.211.11.196:29223
[junit4:junit4] 2> 157 T3264 oaz.ClientCnxn$SendThread.onConnected Session establishment complete on server localhost/127.0.0.1:29221, sessionid = 0x13bdf6a6e1f0001, negotiated timeout = 10000
[junit4:junit4] 2> 158 T3265 oascc.ConnectionManager.process Watcher org.apache.solr.common.cloud.ConnectionManager@4f4b0d3a name:ZooKeeperConnection Watcher:127.0.0.1:29221/solr got event WatchedEvent state:SyncConnected type:None path:null path:null type:None
[junit4:junit4] 2> 158 T3256 oascc.ConnectionManager.waitForConnected Client is connected to ZooKeeper
[junit4:junit4] 2> 158 T3256 oascc.SolrZkClient.makePath makePath: /collections/collection1
[junit4:junit4] 2> 168 T3256 oascc.SolrZkClient.makePath makePath: /collections/collection1/shards
[junit4:junit4] 2> 172 T3256 oascc.SolrZkClient.makePath makePath: /collections/control_collection
[junit4:junit4] 2> 174 T3256 oascc.SolrZkClient.makePath makePath: /collections/control_collection/shards
[junit4:junit4] 2> 184 T3256 oasc.AbstractZkTestCase.putConfig put /usr/home/hudson/hudson-slave/workspace/Lucene-Solr-Tests-trunk-Java6/solr/build/solr-core/test-files/solr/collection1/conf/solrconfig.xml to /configs/conf1/solrconfig.xml
[junit4:junit4] 2> 184 T3256 oascc.SolrZkClient.makePath makePath: /configs/conf1/solrconfig.xml
[junit4:junit4] 2> 198 T3256 oasc.AbstractZkTestCase.putConfig put /usr/home/hudson/hudson-slave/workspace/Lucene-Solr-Tests-trunk-Java6/solr/build/solr-core/test-files/solr/collection1/conf/schema.xml to /configs/conf1/schema.xml
[junit4:junit4] 2> 199 T3256 oascc.SolrZkClient.makePath makePath: /configs/conf1/schema.xml
[junit4:junit4] 2> 302 T3256 oasc.AbstractZkTestCase.putConfig put /usr/home/hudson/hudson-slave/workspace/Lucene-Solr-Tests-trunk-Java6/solr/build/solr-core/test-files/solr/collection1/conf/stopwords.txt to /configs/conf1/stopwords.txt
[junit4:junit4] 2> 303 T3256 oascc.SolrZkClient.makePath makePath: /configs/conf1/stopwords.txt
[junit4:junit4] 2> 306 T3256 oasc.AbstractZkTestCase.putConfig put /usr/home/hudson/hudson-slave/workspace/Lucene-Solr-Tests-trunk-Java6/solr/build/solr-core/test-files/solr/collection1/conf/protwords.txt to /configs/conf1/protwords.txt
[junit4:junit4] 2> 307 T3256 oascc.SolrZkClient.makePath makePath: /configs/conf1/protwords.txt
[junit4:junit4] 2> 310 T3256 oasc.AbstractZkTestCase.putConfig put /usr/home/hudson/hudson-slave/workspace/Lucene-Solr-Tests-trunk-Java6/solr/build/solr-core/test-files/solr/collection1/conf/currency.xml to /configs/conf1/currency.xml
[junit4:junit4] 2> 311 T3256 oascc.SolrZkClient.makePath makePath: /configs/conf1/currency.xml
[junit4:junit4] 2> 314 T3256 oasc.AbstractZkTestCase.putConfig put /usr/home/hudson/hudson-slave/workspace/Lucene-Solr-Tests-trunk-Java6/solr/build/solr-core/test-files/solr/collection1/conf/open-exchange-rates.json to /configs/conf1/open-exchange-rates.json
[junit4:junit4] 2> 315 T3256 oascc.SolrZkClient.makePath makePath: /configs/conf1/open-exchange-rates.json
[junit4:junit4] 2> 322 T3256 oasc.AbstractZkTestCase.putConfig put /usr/home/hudson/hudson-slave/workspace/Lucene-Solr-Tests-trunk-Java6/solr/build/solr-core/test-files/solr/collection1/conf/mapping-ISOLatin1Accent.txt to /configs/conf1/mapping-ISOLatin1Accent.txt
[junit4:junit4] 2> 323 T3256 oascc.SolrZkClient.makePath makePath: /configs/conf1/mapping-ISOLatin1Accent.txt
[junit4:junit4] 2> 326 T3256 oasc.AbstractZkTestCase.putConfig put /usr/home/hudson/hudson-slave/workspace/Lucene-Solr-Tests-trunk-Java6/solr/build/solr-core/test-files/solr/collection1/conf/old_synonyms.txt to /configs/conf1/old_synonyms.txt
[junit4:junit4] 2> 327 T3256 oascc.SolrZkClient.makePath makePath: /configs/conf1/old_synonyms.txt
[junit4:junit4] 2> 330 T3256 oasc.AbstractZkTestCase.putConfig put /usr/home/hudson/hudson-slave/workspace/Lucene-Solr-Tests-trunk-Java6/solr/build/solr-core/test-files/solr/collection1/conf/synonyms.txt to /configs/conf1/synonyms.txt
[junit4:junit4] 2> 330 T3256 oascc.SolrZkClient.makePath makePath: /configs/conf1/synonyms.txt
[junit4:junit4] 2> 333 T3261 oazs.PrepRequestProcessor.pRequest2Txn Processed session termination for sessionid: 0x13bdf6a6e1f0001
[junit4:junit4] 2> 341 T3265 oaz.ClientCnxn$EventThread.run EventThread shut down
[junit4:junit4] 2> 341 T3256 oaz.ZooKeeper.close Session: 0x13bdf6a6e1f0001 closed
[junit4:junit4] 2> 341 T3258 oazs.NIOServerCnxn.closeSock Closed socket connection for client /140.211.11.196:29223 which had sessionid 0x13bdf6a6e1f0001
[junit4:junit4] 2> 494 T3256 oejs.Server.doStart jetty-8.1.8.v20121106
[junit4:junit4] 2> 500 T3256 oejs.AbstractConnector.doStart Started SocketConnector@127.0.0.1:29224
[junit4:junit4] 2> 500 T3256 oasc.SolrResourceLoader.locateSolrHome JNDI not configured for solr (NoInitialContextEx)
[junit4:junit4] 2> 501 T3256 oasc.SolrResourceLoader.locateSolrHome using system property solr.solr.home: /usr/home/hudson/hudson-slave/workspace/Lucene-Solr-Tests-trunk-Java6/solr/build/solr-core/test/J1/./org.apache.solr.cloud.SyncSliceTest-controljetty-1356662992744
[junit4:junit4] 2> 502 T3256 oasc.SolrResourceLoader.<init> new SolrResourceLoader for deduced Solr Home: '/usr/home/hudson/hudson-slave/workspace/Lucene-Solr-Tests-trunk-Java6/solr/build/solr-core/test/J1/./org.apache.solr.cloud.SyncSliceTest-controljetty-1356662992744/'
[junit4:junit4] 2> 536 T3256 oass.SolrDispatchFilter.init SolrDispatchFilter.init()
[junit4:junit4] 2> 537 T3256 oasc.SolrResourceLoader.locateSolrHome JNDI not configured for solr (NoInitialContextEx)
[junit4:junit4] 2> 538 T3256 oasc.SolrResourceLoader.locateSolrHome using system property solr.solr.home: /usr/home/hudson/hudson-slave/workspace/Lucene-Solr-Tests-trunk-Java6/solr/build/solr-core/test/J1/./org.apache.solr.cloud.SyncSliceTest-controljetty-1356662992744
[junit4:junit4] 2> 538 T3256 oasc.CoreContainer$Initializer.initialize looking for solr.xml: /usr/home/hudson/hudson-slave/workspace/Lucene-Solr-Tests-trunk-Java6/solr/build/solr-core/test/J1/./org.apache.solr.cloud.SyncSliceTest-controljetty-1356662992744/solr.xml
[junit4:junit4] 2> 539 T3256 oasc.CoreContainer.<init> New CoreContainer 2135125922
[junit4:junit4] 2> 539 T3256 oasc.CoreContainer.load Loading CoreContainer using Solr Home: '/usr/home/hudson/hudson-slave/workspace/Lucene-Solr-Tests-trunk-Java6/solr/build/solr-core/test/J1/./org.apache.solr.cloud.SyncSliceTest-controljetty-1356662992744/'
[junit4:junit4] 2> 540 T3256 oasc.SolrResourceLoader.<init> new SolrResourceLoader for directory: '/usr/home/hudson/hudson-slave/workspace/Lucene-Solr-Tests-trunk-Java6/solr/build/solr-core/test/J1/./org.apache.solr.cloud.SyncSliceTest-controljetty-1356662992744/'
[junit4:junit4] 2> 561 T3256 oashc.HttpShardHandlerFactory.getParameter Setting socketTimeout to: 30000
[junit4:junit4] 2> 562 T3256 oashc.HttpShardHandlerFactory.getParameter Setting urlScheme to: http://
[junit4:junit4] 2> 562 T3256 oashc.HttpShardHandlerFactory.getParameter Setting connTimeout to: 15000
[junit4:junit4] 2> 563 T3256 oashc.HttpShardHandlerFactory.getParameter Setting maxConnectionsPerHost to: 20
[junit4:junit4] 2> 563 T3256 oashc.HttpShardHandlerFactory.getParameter Setting corePoolSize to: 0
[junit4:junit4] 2> 564 T3256 oashc.HttpShardHandlerFactory.getParameter Setting maximumPoolSize to: 2147483647
[junit4:junit4] 2> 564 T3256 oashc.HttpShardHandlerFactory.getParameter Setting maxThreadIdleTime to: 5
[junit4:junit4] 2> 565 T3256 oashc.HttpShardHandlerFactory.getParameter Setting sizeOfQueue to: -1
[junit4:junit4] 2> 565 T3256 oashc.HttpShardHandlerFactory.getParameter Setting fairnessPolicy to: false
[junit4:junit4] 2> 566 T3256 oascsi.HttpClientUtil.createClient Creating new http client, config:maxConnectionsPerHost=20&maxConnections=10000&socketTimeout=30000&connTimeout=15000&retry=false
[junit4:junit4] 2> 586 T3256 oasc.CoreContainer.load Registering Log Listener
[junit4:junit4] 2> 604 T3256 oasc.CoreContainer.initZooKeeper Zookeeper client=127.0.0.1:29221/solr
[junit4:junit4] 2> 605 T3256 oasc.ZkController.checkChrootPath zkHost includes chroot
[junit4:junit4] 2> 606 T3256 oaz.ZooKeeper.<init> Initiating client connection, connectString=127.0.0.1:29221 sessionTimeout=60000 watcher=org.apache.solr.common.cloud.ConnectionManager@17f038cf
[junit4:junit4] 2> 607 T3256 oascc.ConnectionManager.waitForConnected Waiting for client to connect to ZooKeeper
[junit4:junit4] 2> 607 T3275 oaz.ClientCnxn$SendThread.logStartConnect Opening socket connection to server localhost/127.0.0.1:29221. Will not attempt to authenticate using SASL (access denied (javax.security.auth.AuthPermission getLoginConfiguration))
[junit4:junit4] 2> 608 T3275 oaz.ClientCnxn$SendThread.primeConnection Socket connection established to localhost/127.0.0.1:29221, initiating session
[junit4:junit4] 2> 608 T3258 oazs.NIOServerCnxnFactory.run Accepted socket connection from /140.211.11.196:29225
[junit4:junit4] 2> 608 T3258 oazs.ZooKeeperServer.processConnectRequest Client attempting to establish new session at /140.211.11.196:29225
[junit4:junit4] 2> 610 T3260 oazs.ZooKeeperServer.finishSessionInit Established session 0x13bdf6a6e1f0002 with negotiated timeout 20000 for client /140.211.11.196:29225
[junit4:junit4] 2> 610 T3275 oaz.ClientCnxn$SendThread.onConnected Session establishment complete on server localhost/127.0.0.1:29221, sessionid = 0x13bdf6a6e1f0002, negotiated timeout = 20000
[junit4:junit4] 2> 610 T3276 oascc.ConnectionManager.process Watcher org.apache.solr.common.cloud.ConnectionManager@17f038cf name:ZooKeeperConnection Watcher:127.0.0.1:29221 got event WatchedEvent state:SyncConnected type:None path:null path:null type:None
[junit4:junit4] 2> 611 T3256 oascc.ConnectionManager.waitForConnected Client is connected to ZooKeeper
[junit4:junit4] 2> 612 T3261 oazs.PrepRequestProcessor.pRequest2Txn Processed session termination for sessionid: 0x13bdf6a6e1f0002
[junit4:junit4] 2> 613 T3276 oaz.ClientCnxn$EventThread.run EventThread shut down
[junit4:junit4] 2> 613 T3258 oazs.NIOServerCnxn.doIO WARNING caught end of stream exception EndOfStreamException: Unable to read additional data from client sessionid 0x13bdf6a6e1f0002, likely client has closed socket
[junit4:junit4] 2> at org.apache.zookeeper.server.NIOServerCnxn.doIO(NIOServerCnxn.java:220)
[junit4:junit4] 2> at org.apache.zookeeper.server.NIOServerCnxnFactory.run(NIOServerCnxnFactory.java:208)
[junit4:junit4] 2> at java.lang.Thread.run(Thread.java:679)
[junit4:junit4] 2>
[junit4:junit4] 2> 613 T3256 oaz.ZooKeeper.close Session: 0x13bdf6a6e1f0002 closed
[junit4:junit4] 2> 614 T3258 oazs.NIOServerCnxn.closeSock Closed socket connection for client /140.211.11.196:29225 which had sessionid 0x13bdf6a6e1f0002
[junit4:junit4] 2> 613 T3256 oascsi.HttpClientUtil.createClient Creating new http client, config:maxConnections=500&maxConnectionsPerHost=16&socketTimeout=15000&connTimeout=30000
[junit4:junit4] 2> 624 T3256 oaz.ZooKeeper.<init> Initiating client connection, connectString=127.0.0.1:29221/solr sessionTimeout=30000 watcher=org.apache.solr.common.cloud.ConnectionManager@1dc2e031
[junit4:junit4] 2> 625 T3256 oascc.ConnectionManager.waitForConnected Waiting for client to connect to ZooKeeper
[junit4:junit4] 2> 626 T3277 oaz.ClientCnxn$SendThread.logStartConnect Opening socket connection to server localhost/127.0.0.1:29221. Will not attempt to authenticate using SASL (access denied (javax.security.auth.AuthPermission getLoginConfiguration))
[junit4:junit4] 2> 626 T3277 oaz.ClientCnxn$SendThread.primeConnection Socket connection established to localhost/127.0.0.1:29221, initiating session
[junit4:junit4] 2> 626 T3258 oazs.NIOServerCnxnFactory.run Accepted socket connection from /140.211.11.196:29226
[junit4:junit4] 2> 627 T3258 oazs.ZooKeeperServer.processConnectRequest Client attempting to establish new session at /140.211.11.196:29226
[junit4:junit4] 2> 628 T3260 oazs.ZooKeeperServer.finishSessionInit Established session 0x13bdf6a6e1f0003 with negotiated timeout 20000 for client /140.211.11.196:29226
[junit4:junit4] 2> 628 T3277 oaz.ClientCnxn$SendThread.onConnected Session establishment complete on server localhost/127.0.0.1:29221, sessionid = 0x13bdf6a6e1f0003, negotiated timeout = 20000
[junit4:junit4] 2> 628 T3278 oascc.ConnectionManager.process Watcher org.apache.solr.common.cloud.ConnectionManager@1dc2e031 name:ZooKeeperConnection Watcher:127.0.0.1:29221/solr got event WatchedEvent state:SyncConnected type:None path:null path:null type:None
[junit4:junit4] 2> 629 T3256 oascc.ConnectionManager.waitForConnected Client is connected to ZooKeeper
[junit4:junit4] 2> 630 T3261 oazs.PrepRequestProcessor.pRequest Got user-level KeeperException when processing sessionid:0x13bdf6a6e1f0003 type:create cxid:0x2 zxid:0x1a txntype:-1 reqpath:n/a Error Path:/solr/overseer Error:KeeperErrorCode = NodeExists for /solr/overseer
[junit4:junit4] 2> 639 T3256 oascc.SolrZkClient.makePath makePath: /live_nodes
[junit4:junit4] 2> 641 T3256 oasc.ZkController.createEphemeralLiveNode Register node as live in ZooKeeper:/live_nodes/127.0.0.1:29224_
[junit4:junit4] 2> 642 T3261 oazs.PrepRequestProcessor.pRequest Got user-level KeeperException when processing sessionid:0x13bdf6a6e1f0003 type:delete cxid:0x7 zxid:0x1c txntype:-1 reqpath:n/a Error Path:/solr/live_nodes/127.0.0.1:29224_ Error:KeeperErrorCode = NoNode for /solr/live_nodes/127.0.0.1:29224_
[junit4:junit4] 2> 643 T3256 oascc.SolrZkClient.makePath makePath: /live_nodes/127.0.0.1:29224_
[junit4:junit4] 2> 653 T3256 oascc.SolrZkClient.makePath makePath: /overseer_elect/election
[junit4:junit4] 2> 658 T3261 oazs.PrepRequestProcessor.pRequest Got user-level KeeperException when processing sessionid:0x13bdf6a6e1f0003 type:delete cxid:0x15 zxid:0x21 txntype:-1 reqpath:n/a Error Path:/solr/overseer_elect/leader Error:KeeperErrorCode = NoNode for /solr/overseer_elect/leader
[junit4:junit4] 2> 659 T3256 oascc.SolrZkClient.makePath makePath: /overseer_elect/leader
[junit4:junit4] 2> 669 T3256 oasc.Overseer.start Overseer (id=88910265870909443-127.0.0.1:29224_-n_0000000000) starting
[junit4:junit4] 2> 670 T3261 oazs.PrepRequestProcessor.pRequest Got user-level KeeperException when processing sessionid:0x13bdf6a6e1f0003 type:create cxid:0x1a zxid:0x23 txntype:-1 reqpath:n/a Error Path:/solr/overseer Error:KeeperErrorCode = NodeExists for /solr/overseer
[junit4:junit4] 2> 671 T3261 oazs.PrepRequestProcessor.pRequest Got user-level KeeperException when processing sessionid:0x13bdf6a6e1f0003 type:create cxid:0x1b zxid:0x24 txntype:-1 reqpath:n/a Error Path:/solr/overseer Error:KeeperErrorCode = NodeExists for /solr/overseer
[junit4:junit4] 2> 672 T3261 oazs.PrepRequestProcessor.pRequest Got user-level KeeperException when processing sessionid:0x13bdf6a6e1f0003 type:create cxid:0x1c zxid:0x25 txntype:-1 reqpath:n/a Error Path:/solr/overseer Error:KeeperErrorCode = NodeExists for /solr/overseer
[junit4:junit4] 2> 674 T3261 oazs.PrepRequestProcessor.pRequest Got user-level KeeperException when processing sessionid:0x13bdf6a6e1f0003 type:create cxid:0x1d zxid:0x26 txntype:-1 reqpath:n/a Error Path:/solr/overseer Error:KeeperErrorCode = NodeExists for /solr/overseer
[junit4:junit4] 2> 680 T3280 oasc.OverseerCollectionProcessor.run Process current queue of collection messages
[junit4:junit4] 2> 681 T3256 oascc.SolrZkClient.makePath makePath: /clusterstate.json
[junit4:junit4] 2> 688 T3256 oascc.ZkStateReader.createClusterStateWatchersAndUpdate Updating cluster state from ZooKeeper...
[junit4:junit4] 2> 690 T3279 oasc.Overseer$ClusterStateUpdater.run Starting to work on the main queue
[junit4:junit4] 2> 695 T3281 oasc.CoreContainer.create Creating SolrCore 'collection1' using instanceDir: /usr/home/hudson/hudson-slave/workspace/Lucene-Solr-Tests-trunk-Java6/solr/build/solr-core/test/J1/./org.apache.solr.cloud.SyncSliceTest-controljetty-1356662992744/collection1
[junit4:junit4] 2> 696 T3281 oasc.ZkController.createCollectionZkNode Check for collection zkNode:control_collection
[junit4:junit4] 2> 696 T3281 oasc.ZkController.createCollectionZkNode Collection zkNode exists
[junit4:junit4] 2> 696 T3281 oasc.ZkController.readConfigName Load collection config from:/collections/control_collection
[junit4:junit4] 2> 698 T3281 oasc.SolrResourceLoader.<init> new SolrResourceLoader for directory: '/usr/home/hudson/hudson-slave/workspace/Lucene-Solr-Tests-trunk-Java6/solr/build/solr-core/test/J1/./org.apache.solr.cloud.SyncSliceTest-controljetty-1356662992744/collection1/'
[junit4:junit4] 2> 699 T3281 oasc.SolrResourceLoader.replaceClassLoader Adding 'file:/usr/home/hudson/hudson-slave/workspace/Lucene-Solr-Tests-trunk-Java6/solr/build/solr-core/test/J1/org.apache.solr.cloud.SyncSliceTest-controljetty-1356662992744/collection1/lib/README' to classloader
[junit4:junit4] 2> 699 T3281 oasc.SolrResourceLoader.replaceClassLoader Adding 'file:/usr/home/hudson/hudson-slave/workspace/Lucene-Solr-Tests-trunk-Java6/solr/build/solr-core/test/J1/org.apache.solr.cloud.SyncSliceTest-controljetty-1356662992744/collection1/lib/classes/' to classloader
[junit4:junit4] 2> 750 T3281 oasc.SolrConfig.<init> Using Lucene MatchVersion: LUCENE_50
[junit4:junit4] 2> 832 T3281 oasc.SolrConfig.<init> Loaded SolrConfig: solrconfig.xml
[junit4:junit4] 2> 933 T3281 oass.IndexSchema.readSchema Reading Solr Schema
[junit4:junit4] 2> 939 T3281 oass.IndexSchema.readSchema Schema name=test
[junit4:junit4] 2> 1529 T3281 oass.OpenExchangeRatesOrgProvider.init Initialized with rates=open-exchange-rates.json, refreshInterval=1440.
[junit4:junit4] 2> 1541 T3281 oass.IndexSchema.readSchema default search field in schema is text
[junit4:junit4] 2> 1545 T3281 oass.IndexSchema.readSchema unique key field: id
[junit4:junit4] 2> 1557 T3281 oass.FileExchangeRateProvider.reload Reloading exchange rates from file currency.xml
[junit4:junit4] 2> 1561 T3281 oass.FileExchangeRateProvider.reload Reloading exchange rates from file currency.xml
[junit4:junit4] 2> 1565 T3281 oass.OpenExchangeRatesOrgProvider.reload Reloading exchange rates from open-exchange-rates.json
[junit4:junit4] 2> 1566 T3281 oass.OpenExchangeRatesOrgProvider.reload Reloading exchange rates from open-exchange-rates.json
[junit4:junit4] 2> 1567 T3281 oasc.SolrCore.<init> [collection1] Opening new SolrCore at /usr/home/hudson/hudson-slave/workspace/Lucene-Solr-Tests-trunk-Java6/solr/build/solr-core/test/J1/./org.apache.solr.cloud.SyncSliceTest-controljetty-1356662992744/collection1/, dataDir=./org.apache.solr.cloud.SyncSliceTest-1356662992407/control/data/
[junit4:junit4] 2> 1568 T3281 oasc.JmxMonitoredMap.<init> JMX monitoring is enabled. Adding Solr mbeans to JMX Server: com.sun.jmx.mbeanserver.JmxMBeanServer@4513e9fd
[junit4:junit4] 2> 1568 T3281 oasc.SolrCore.initDirectoryFactory solr.StandardDirectoryFactory
[junit4:junit4] 2> 1600 T3281 oasc.CachingDirectoryFactory.get return new directory for /usr/home/hudson/hudson-slave/workspace/Lucene-Solr-Tests-trunk-Java6/solr/build/solr-core/test/J1/./org.apache.solr.cloud.SyncSliceTest-1356662992407/control/data forceNew:false
[junit4:junit4] 2> 1600 T3281 oasc.CachingDirectoryFactory.close Releasing directory:/usr/home/hudson/hudson-slave/workspace/Lucene-Solr-Tests-trunk-Java6/solr/build/solr-core/test/J1/./org.apache.solr.cloud.SyncSliceTest-1356662992407/control/data
[junit4:junit4] 2> 1601 T3281 oasc.SolrCore.getNewIndexDir New index directory detected: old=null new=./org.apache.solr.cloud.SyncSliceTest-1356662992407/control/data/index/
[junit4:junit4] 2> 1601 T3281 oasc.SolrCore.initIndex WARNING [collection1] Solr index directory './org.apache.solr.cloud.SyncSliceTest-1356662992407/control/data/index' doesn't exist. Creating new index...
[junit4:junit4] 2> 1602 T3281 oasc.CachingDirectoryFactory.get return new directory for /usr/home/hudson/hudson-slave/workspace/Lucene-Solr-Tests-trunk-Java6/solr/build/solr-core/test/J1/./org.apache.solr.cloud.SyncSliceTest-1356662992407/control/data/index forceNew:false
[junit4:junit4] 2> 1634 T3281 oasc.SolrDeletionPolicy.onCommit SolrDeletionPolicy.onCommit: commits:num=1
[junit4:junit4] 2> commit{dir=RateLimitedDirectoryWrapper(org.apache.lucene.store.NIOFSDirectory@/usr/home/hudson/hudson-slave/workspace/Lucene-Solr-Tests-trunk-Java6/solr/build/solr-core/test/J1/org.apache.solr.cloud.SyncSliceTest-1356662992407/control/data/index lockFactory=org.apache.lucene.store.NativeFSLockFactory@6e594e22),segFN=segments_1,generation=1,filenames=[segments_1]
[junit4:junit4] 2> 1635 T3281 oasc.SolrDeletionPolicy.updateCommits newest commit = 1[segments_1]
[junit4:junit4] 2> 1635 T3281 oasc.CachingDirectoryFactory.close Releasing directory:/usr/home/hudson/hudson-slave/workspace/Lucene-Solr-Tests-trunk-Java6/solr/build/solr-core/test/J1/./org.apache.solr.cloud.SyncSliceTest-1356662992407/control/data/index
[junit4:junit4] 2> 1636 T3281 oasc.SolrCore.initWriters created xml: solr.XMLResponseWriter
[junit4:junit4] 2> 1637 T3281 oasup.UpdateRequestProcessorChain.init inserting DistributedUpdateProcessorFactory into updateRequestProcessorChain "dedupe"
[junit4:junit4] 2> 1638 T3281 oasup.UpdateRequestProcessorChain.init inserting DistributedUpdateProcessorFactory into updateRequestProcessorChain "dedupe-allfields"
[junit4:junit4] 2> 1638 T3281 oasup.UpdateRequestProcessorChain.init inserting DistributedUpdateProcessorFactory into updateRequestProcessorChain "stored_sig"
[junit4:junit4] 2> 1638 T3281 oasup.UpdateRequestProcessorChain.init inserting DistributedUpdateProcessorFactory into updateRequestProcessorChain "uniq-fields"
[junit4:junit4] 2> 1639 T3281 oasup.UpdateRequestProcessorChain.init inserting DistributedUpdateProcessorFactory into updateRequestProcessorChain "distrib-dup-test-chain-implicit"
[junit4:junit4] 2> 1639 T3281 oasc.RequestHandlers.initHandlersFromConfig adding lazy requestHandler: solr.ReplicationHandler
[junit4:junit4] 2> 1639 T3281 oasc.RequestHandlers.initHandlersFromConfig created /replication: solr.ReplicationHandler
[junit4:junit4] 2> 1640 T3281 oasc.RequestHandlers.initHandlersFromConfig created standard: solr.StandardRequestHandler
[junit4:junit4] 2> 1640 T3281 oasc.RequestHandlers.initHandlersFromConfig created /get: solr.RealTimeGetHandler
[junit4:junit4] 2> 1641 T3281 oasc.RequestHandlers.initHandlersFromConfig created dismax: solr.SearchHandler
[junit4:junit4] 2> 1641 T3281 oasc.RequestHandlers.initHandlersFromConfig created mock: org.apache.solr.core.MockQuerySenderListenerReqHandler
[junit4:junit4] 2> 1641 T3281 oasc.RequestHandlers.initHandlersFromConfig created /admin/: org.apache.solr.handler.admin.AdminHandlers
[junit4:junit4] 2> 1642 T3281 oasc.RequestHandlers.initHandlersFromConfig created defaults: solr.StandardRequestHandler
[junit4:junit4] 2> 1642 T3281 oasc.RequestHandlers.initHandlersFromConfig adding lazy requestHandler: solr.StandardRequestHandler
[junit4:junit4] 2> 1642 T3281 oasc.RequestHandlers.initHandlersFromConfig created lazy: solr.StandardRequestHandler
[junit4:junit4] 2> 1643 T3281 oasc.RequestHandlers.initHandlersFromConfig created /update: solr.UpdateRequestHandler
[junit4:junit4] 2> 1643 T3281 oasc.RequestHandlers.initHandlersFromConfig created /terms: org.apache.solr.handler.component.SearchHandler
[junit4:junit4] 2> 1643 T3281 oasc.RequestHandlers.initHandlersFromConfig created spellCheckCompRH: org.apache.solr.handler.component.SearchHandler
[junit4:junit4] 2> 1644 T3281 oasc.RequestHandlers.initHandlersFromConfig created spellCheckCompRH_Direct: org.apache.solr.handler.component.SearchHandler
[junit4:junit4] 2> 1644 T3281 oasc.RequestHandlers.initHandlersFromConfig created spellCheckWithWordbreak: org.apache.solr.handler.component.SearchHandler
[junit4:junit4] 2> 1644 T3281 oasc.RequestHandlers.initHandlersFromConfig created spellCheckWithWordbreak_Direct: org.apache.solr.handler.component.SearchHandler
[junit4:junit4] 2> 1645 T3281 oasc.RequestHandlers.initHandlersFromConfig created spellCheckCompRH1: org.apache.solr.handler.component.SearchHandler
[junit4:junit4] 2> 1645 T3281 oasc.RequestHandlers.initHandlersFromConfig created mltrh: org.apache.solr.handler.component.SearchHandler
[junit4:junit4] 2> 1646 T3281 oasc.RequestHandlers.initHandlersFromConfig created tvrh: org.apache.solr.handler.component.SearchHandler
[junit4:junit4] 2> 1646 T3281 oasc.RequestHandlers.initHandlersFromConfig created /mlt: solr.MoreLikeThisHandler
[junit4:junit4] 2> 1646 T3281 oasc.RequestHandlers.initHandlersFromConfig created /debug/dump: solr.DumpRequestHandler
[junit4:junit4] 2> 1653 T3281 oashl.XMLLoader.init xsltCacheLifetimeSeconds=60
[junit4:junit4] 2> 1657 T3281 oasc.SolrCore.initDeprecatedSupport WARNING solrconfig.xml uses deprecated <admin/gettableFiles>, Please update your config to use the ShowFileRequestHandler.
[junit4:junit4] 2> 1658 T3281 oasc.SolrCore.initDeprecatedSupport WARNING adding ShowFileRequestHandler with hidden files: [SCHEMA.XML, OLD_SYNONYMS.TXT, STOPWORDS.TXT, PROTWORDS.TXT, OPEN-EXCHANGE-RATES.JSON, SYNONYMS.TXT, CURRENCY.XML, MAPPING-ISOLATIN1ACCENT.TXT]
[junit4:junit4] 2> 1660 T3281 oasc.CachingDirectoryFactory.close Releasing directory:/usr/home/hudson/hudson-slave/workspace/Lucene-Solr-Tests-trunk-Java6/solr/build/solr-core/test/J1/./org.apache.solr.cloud.SyncSliceTest-1356662992407/control/data
[junit4:junit4] 2> 1662 T3281 oass.SolrIndexSearcher.<init> Opening Searcher@31d32022 main
[junit4:junit4] 2> 1663 T3281 oasu.CommitTracker.<init> Hard AutoCommit: disabled
[junit4:junit4] 2> 1663 T3281 oasu.CommitTracker.<init> Soft AutoCommit: disabled
[junit4:junit4] 2> 1663 T3281 oashc.SpellCheckComponent.inform Initializing spell checkers
[junit4:junit4] 2> 1669 T3281 oass.DirectSolrSpellChecker.init init: {name=direct,classname=DirectSolrSpellChecker,field=lowerfilt,minQueryLength=3}
[junit4:junit4] 2> 1720 T3282 oasc.SolrCore.registerSearcher [collection1] Registered new searcher Searcher@31d32022 main{StandardDirectoryReader(segments_1:1)}
[junit4:junit4] 2> 1723 T3281 oasc.ZkController.publish publishing core=collection1 state=down
[junit4:junit4] 2> 1724 T3281 oasc.ZkController.publish numShards not found on descriptor - reading it from system property
[junit4:junit4] 2> 1724 T3261 oazs.PrepRequestProcessor.pRequest Got user-level KeeperException when processing sessionid:0x13bdf6a6e1f0003 type:create cxid:0x56 zxid:0x29 txntype:-1 reqpath:n/a Error Path:/solr/overseer/queue Error:KeeperErrorCode = NoNode for /solr/overseer/queue
[junit4:junit4] 2> 2197 T3279 oascc.ZkStateReader.updateClusterState Updating cloud state from ZooKeeper...
[junit4:junit4] 2> 2198 T3279 oasc.Overseer$ClusterStateUpdater.updateState Update state numShards=1 message={
[junit4:junit4] 2> "operation":"state",
[junit4:junit4] 2> "numShards":"1",
[junit4:junit4] 2> "shard":null,
[junit4:junit4] 2> "roles":null,
[junit4:junit4] 2> "state":"down",
[junit4:junit4] 2> "core":"collection1",
[junit4:junit4] 2> "collection":"control_collection",
[junit4:junit4] 2> "node_name":"127.0.0.1:29224_",
[junit4:junit4] 2> "base_url":"http://127.0.0.1:29224"}
[junit4:junit4] 2> 2198 T3279 oasc.Overseer$ClusterStateUpdater.createCollection Create collection control_collection with numShards 1
[junit4:junit4] 2> 2198 T3279 oasc.Overseer$ClusterStateUpdater.updateState Assigning new node to shard shard=shard1
[junit4:junit4] 2> 2199 T3261 oazs.PrepRequestProcessor.pRequest Got user-level KeeperException when processing sessionid:0x13bdf6a6e1f0003 type:create cxid:0x5e zxid:0x2c txntype:-1 reqpath:n/a Error Path:/solr/overseer/queue-work Error:KeeperErrorCode = NoNode for /solr/overseer/queue-work
[junit4:junit4] 2> 2214 T3278 oascc.ZkStateReader$2.process A cluster state change: WatchedEvent state:SyncConnected type:NodeDataChanged path:/clusterstate.json, has occurred - updating... (live nodes size: 1)
[junit4:junit4] 2> 2736 T3281 oasc.CoreContainer.registerCore registering core: collection1
[junit4:junit4] 2> 2736 T3281 oasc.ZkController.register Register replica - core:collection1 address:http://127.0.0.1:29224 collection:control_collection shard:shard1
[junit4:junit4] 2> 2737 T3281 oascc.SolrZkClient.makePath makePath: /collections/control_collection/leader_elect/shard1/election
[junit4:junit4] 2> 2762 T3261 oazs.PrepRequestProcessor.pRequest Got user-level KeeperException when processing sessionid:0x13bdf6a6e1f0003 type:delete cxid:0x7b zxid:0x36 txntype:-1 reqpath:n/a Error Path:/solr/collections/control_collection/leaders Error:KeeperErrorCode = NoNode for /solr/collections/control_collection/leaders
[junit4:junit4] 2> 2763 T3281 oasc.ShardLeaderElectionContext.runLeaderProcess Running the leader process.
[junit4:junit4] 2> 2763 T3261 oazs.PrepRequestProcessor.pRequest Got user-level KeeperException when processing sessionid:0x13bdf6a6e1f0003 type:create cxid:0x7c zxid:0x37 txntype:-1 reqpath:n/a Error Path:/solr/overseer Error:KeeperErrorCode = NodeExists for /solr/overseer
[junit4:junit4] 2> 2774 T3281 oasc.ShardLeaderElectionContext.waitForReplicasToComeUp Enough replicas found to continue.
[junit4:junit4] 2> 2774 T3281 oasc.ShardLeaderElectionContext.runLeaderProcess I may be the new leader - try and sync
[junit4:junit4] 2> 2774 T3281 oasc.SyncStrategy.sync Sync replicas to http://127.0.0.1:29224/collection1/
[junit4:junit4] 2> 2774 T3281 oasc.SyncStrategy.syncReplicas Sync Success - now sync replicas to me
[junit4:junit4] 2> 2775 T3281 oasc.SyncStrategy.syncToMe http://127.0.0.1:29224/collection1/ has no replicas
[junit4:junit4] 2> 2775 T3281 oasc.ShardLeaderElectionContext.runLeaderProcess I am the new leader: http://127.0.0.1:29224/collection1/
[junit4:junit4] 2> 2775 T3281 oascc.SolrZkClient.makePath makePath: /collections/control_collection/leaders/shard1
[junit4:junit4] 2> 2779 T3261 oazs.PrepRequestProcessor.pRequest Got user-level KeeperException when processing sessionid:0x13bdf6a6e1f0003 type:create cxid:0x86 zxid:0x3b txntype:-1 reqpath:n/a Error Path:/solr/overseer Error:KeeperErrorCode = NodeExists for /solr/overseer
[junit4:junit4] 2> 3220 T3279 oascc.ZkStateReader.updateClusterState Updating cloud state from ZooKeeper...
[junit4:junit4] 2> 3267 T3278 oascc.ZkStateReader$2.process A cluster state change: WatchedEvent state:SyncConnected type:NodeDataChanged path:/clusterstate.json, has occurred - updating... (live nodes size: 1)
[junit4:junit4] 2> 3347 T3281 oasc.ZkController.register We are http://127.0.0.1:29224/collection1/ and leader is http://127.0.0.1:29224/collection1/
[junit4:junit4] 2> 3347 T3281 oasc.ZkController.register No LogReplay needed for core=collection1 baseURL=http://127.0.0.1:29224
[junit4:junit4] 2> 3347 T3281 oasc.ZkController.checkRecovery I am the leader, no recovery necessary
[junit4:junit4] 2> 3347 T3281 oasc.ZkController.publish publishing core=collection1 state=active
[junit4:junit4] 2> 3348 T3281 oasc.ZkController.publish numShards not found on descriptor - reading it from system property
[junit4:junit4] 2> 3349 T3281 oascc.ZkStateReader.updateClusterState Updating cloud state from ZooKeeper...
[junit4:junit4] 2> 3350 T3256 oass.SolrDispatchFilter.init user.dir=/usr/home/hudson/hudson-slave/workspace/Lucene-Solr-Tests-trunk-Java6/solr/build/solr-core/test/J1
[junit4:junit4] 2> 3351 T3256 oass.SolrDispatchFilter.init SolrDispatchFilter.init() done
[junit4:junit4] 2> 3351 T3256 oascsi.HttpClientUtil.createClient Creating new http client, config:maxConnections=128&maxConnectionsPerHost=32&followRedirects=false
[junit4:junit4] 2> 3364 T3256 oascsi.HttpClientUtil.createClient Creating new http client, config:
[junit4:junit4] 2> 3373 T3256 oaz.ZooKeeper.<init> Initiating client connection, connectString=127.0.0.1:29221/solr sessionTimeout=10000 watcher=org.apache.solr.common.cloud.ConnectionManager@43361842
[junit4:junit4] 2> 3374 T3256 oascc.ConnectionManager.waitForConnected Waiting for client to connect to ZooKeeper
[junit4:junit4] 2> 3374 T3283 oaz.ClientCnxn$SendThread.logStartConnect Opening socket connection to server localhost/127.0.0.1:29221. Will not attempt to authenticate using SASL (access denied (javax.security.auth.AuthPermission getLoginConfiguration))
[junit4:junit4] 2> 3374 T3283 oaz.ClientCnxn$SendThread.primeConnection Socket connection established to localhost/127.0.0.1:29221, initiating session
[junit4:junit4] 2> 3375 T3258 oazs.NIOServerCnxnFactory.run Accepted socket connection from /140.211.11.196:29227
[junit4:junit4] 2> 3375 T3258 oazs.ZooKeeperServer.processConnectRequest Client attempting to establish new session at /140.211.11.196:29227
[junit4:junit4] 2> 3376 T3260 oazs.ZooKeeperServer.finishSessionInit Established session 0x13bdf6a6e1f0004 with negotiated timeout 10000 for client /140.211.11.196:29227
[junit4:junit4] 2> 3376 T3283 oaz.ClientCnxn$SendThread.onConnected Session establishment complete on server localhost/127.0.0.1:29221, sessionid = 0x13bdf6a6e1f0004, negotiated timeout = 10000
[junit4:junit4] 2> 3377 T3284 oascc.ConnectionManager.process Watcher org.apache.solr.common.cloud.ConnectionManager@43361842 name:ZooKeeperConnection Watcher:127.0.0.1:29221/solr got event WatchedEvent state:SyncConnected type:None path:null path:null type:None
[junit4:junit4] 2> 3377 T3256 oascc.ConnectionManager.waitForConnected Client is connected to ZooKeeper
[junit4:junit4] 2> 3378 T3256 oascc.ZkStateReader.createClusterStateWatchersAndUpdate Updating cluster state from ZooKeeper...
[junit4:junit4] 2> 3379 T3256 oasc.ChaosMonkey.monkeyLog monkey: init - expire sessions:true cause connection loss:true
[junit4:junit4] 2> 3534 T3256 oejs.Server.doStart jetty-8.1.8.v20121106
[junit4:junit4] 2> 3537 T3256 oejs.AbstractConnector.doStart Started SocketConnector@127.0.0.1:29228
[junit4:junit4] 2> 3538 T3256 oasc.SolrResourceLoader.locateSolrHome JNDI not configured for solr (NoInitialContextEx)
[junit4:junit4] 2> 3538 T3256 oasc.SolrResourceLoader.locateSolrHome using system property solr.solr.home: /usr/home/hudson/hudson-slave/workspace/Lucene-Solr-Tests-trunk-Java6/solr/build/solr-core/test/J1/./org.apache.solr.cloud.SyncSliceTest-jetty1-1356662995783
[junit4:junit4] 2> 3539 T3256 oasc.SolrResourceLoader.<init> new SolrResourceLoader for deduced Solr Home: '/usr/home/hudson/hudson-slave/workspace/Lucene-Solr-Tests-trunk-Java6/solr/build/solr-core/test/J1/./org.apache.solr.cloud.SyncSliceTest-jetty1-1356662995783/'
[junit4:junit4] 2> 3574 T3256 oass.SolrDispatchFilter.init SolrDispatchFilter.init()
[junit4:junit4] 2> 3574 T3256 oasc.SolrResourceLoader.locateSolrHome JNDI not configured for solr (NoInitialContextEx)
[junit4:junit4] 2> 3575 T3256 oasc.SolrResourceLoader.locateSolrHome using system property solr.solr.home: /usr/home/hudson/hudson-slave/workspace/Lucene-Solr-Tests-trunk-Java6/solr/build/solr-core/test/J1/./org.apache.solr.cloud.SyncSliceTest-jetty1-1356662995783
[junit4:junit4] 2> 3575 T3256 oasc.CoreContainer$Initializer.initialize looking for solr.xml: /usr/home/hudson/hudson-slave/workspace/Lucene-Solr-Tests-trunk-Java6/solr/build/solr-core/test/J1/./org.apache.solr.cloud.SyncSliceTest-jetty1-1356662995783/solr.xml
[junit4:junit4] 2> 3576 T3256 oasc.CoreContainer.<init> New CoreContainer 389932570
[junit4:junit4] 2> 3577 T3256 oasc.CoreContainer.load Loading CoreContainer using Solr Home: '/usr/home/hudson/hudson-slave/workspace/Lucene-Solr-Tests-trunk-Java6/solr/build/solr-core/test/J1/./org.apache.solr.cloud.SyncSliceTest-jetty1-1356662995783/'
[junit4:junit4] 2> 3577 T3256 oasc.SolrResourceLoader.<init> new SolrResourceLoader for directory: '/usr/home/hudson/hudson-slave/workspace/Lucene-Solr-Tests-trunk-Java6/solr/build/solr-core/test/J1/./org.apache.solr.cloud.SyncSliceTest-jetty1-1356662995783/'
[junit4:junit4] 2> 3599 T3256 oashc.HttpShardHandlerFactory.getParameter Setting socketTimeout to: 30000
[junit4:junit4] 2> 3599 T3256 oashc.HttpShardHandlerFactory.getParameter Setting urlScheme to: http://
[junit4:junit4] 2> 3600 T3256 oashc.HttpShardHandlerFactory.getParameter Setting connTimeout to: 15000
[junit4:junit4] 2> 3600 T3256 oashc.HttpShardHandlerFactory.getParameter Setting maxConnectionsPerHost to: 20
[junit4:junit4] 2> 3601 T3256 oashc.HttpShardHandlerFactory.getParameter Setting corePoolSize to: 0
[junit4:junit4] 2> 3601 T3256 oashc.HttpShardHandlerFactory.getParameter Setting maximumPoolSize to: 2147483647
[junit4:junit4] 2> 3602 T3256 oashc.HttpShardHandlerFactory.getParameter Setting maxThreadIdleTime to: 5
[junit4:junit4] 2> 3602 T3256 oashc.HttpShardHandlerFactory.getParameter Setting sizeOfQueue to: -1
[junit4:junit4] 2> 3603 T3256 oashc.HttpShardHandlerFactory.getParameter Setting fairnessPolicy to: false
[junit4:junit4] 2> 3603 T3256 oascsi.HttpClientUtil.createClient Creating new http client, config:maxConnectionsPerHost=20&maxConnections=10000&socketTimeout=30000&connTimeout=15000&retry=false
[junit4:junit4] 2> 3621 T3256 oasc.CoreContainer.load Registering Log Listener
[junit4:junit4] 2> 3639 T3256 oasc.CoreContainer.initZooKeeper Zookeeper client=127.0.0.1:29221/solr
[junit4:junit4] 2> 3640 T3256 oasc.ZkController.checkChrootPath zkHost includes chroot
[junit4:junit4] 2> 3641 T3256 oaz.ZooKeeper.<init> Initiating client connection, connectString=127.0.0.1:29221 sessionTimeout=60000 watcher=org.apache.solr.common.cloud.ConnectionManager@6432256d
[junit4:junit4] 2> 3642 T3256 oascc.ConnectionManager.waitForConnected Waiting for client to connect to ZooKeeper
[junit4:junit4] 2> 3642 T3294 oaz.ClientCnxn$SendThread.logStartConnect Opening socket connection to server localhost/127.0.0.1:29221. Will not attempt to authenticate using SASL (access denied (javax.security.auth.AuthPermission getLoginConfiguration))
[junit4:junit4] 2> 3643 T3294 oaz.ClientCnxn$SendThread.primeConnection Socket connection established to localhost/127.0.0.1:29221, initiating session
[junit4:junit4] 2> 3643 T3258 oazs.NIOServerCnxnFactory.run Accepted socket connection from /140.211.11.196:29229
[junit4:junit4] 2> 3643 T3258 oazs.ZooKeeperServer.processConnectRequest Client attempting to establish new session at /140.211.11.196:29229
[junit4:junit4] 2> 3648 T3260 oazs.ZooKeeperServer.finishSessionInit Established session 0x13bdf6a6e1f0005 with negotiated timeout 20000 for client /140.211.11.196:29229
[junit4:junit4] 2> 3648 T3294 oaz.ClientCnxn$SendThread.onConnected Session establishment complete on server localhost/127.0.0.1:29221, sessionid = 0x13bdf6a6e1f0005, negotiated timeout = 20000
[junit4:junit4] 2> 3648 T3295 oascc.ConnectionManager.process Watcher org.apache.solr.common.cloud.ConnectionManager@6432256d name:ZooKeeperConnection Watcher:127.0.0.1:29221 got event WatchedEvent state:SyncConnected type:None path:null path:null type:None
[junit4:junit4] 2> 3648 T3256 oascc.ConnectionManager.waitForConnected Client is connected to ZooKeeper
[junit4:junit4] 2> 3650 T3261 oazs.PrepRequestProcessor.pRequest2Txn Processed session termination for sessionid: 0x13bdf6a6e1f0005
[junit4:junit4] 2> 3663 T3295 oaz.ClientCnxn$EventThread.run EventThread shut down
[junit4:junit4] 2> 3664 T3258 oazs.NIOServerCnxn.closeSock Closed socket connection for client /140.211.11.196:29229 which had sessionid 0x13bdf6a6e1f0005
[junit4:junit4] 2> 3663 T3256 oaz.ZooKeeper.close Session: 0x13bdf6a6e1f0005 closed
[junit4:junit4] 2> 3664 T3256 oascsi.HttpClientUtil.createClient Creating new http client, config:maxConnections=500&maxConnectionsPerHost=16&socketTimeout=15000&connTimeout=30000
[junit4:junit4] 2> 3673 T3256 oaz.ZooKeeper.<init> Initiating client connection, connectString=127.0.0.1:29221/solr sessionTimeout=30000 watcher=org.apache.solr.common.cloud.ConnectionManager@997f1d5
[junit4:junit4] 2> 3674 T3256 oascc.ConnectionManager.waitForConnected Waiting for client to connect to ZooKeeper
[junit4:junit4] 2> 3674 T3296 oaz.ClientCnxn$SendThread.logStartConnect Opening socket connection to server localhost/127.0.0.1:29221. Will not attempt to authenticate using SASL (access denied (javax.security.auth.AuthPermission getLoginConfiguration))
[junit4:junit4] 2> 3675 T3296 oaz.ClientCnxn$SendThread.primeConnection Socket connection established to localhost/127.0.0.1:29221, initiating session
[junit4:junit4] 2> 3675 T3258 oazs.NIOServerCnxnFactory.run Accepted socket connection from /140.211.11.196:29230
[junit4:junit4] 2> 3676 T3258 oazs.ZooKeeperServer.processConnectRequest Client attempting to establish new session at /140.211.11.196:29230
[junit4:junit4] 2> 3677 T3260 oazs.ZooKeeperServer.finishSessionInit Established session 0x13bdf6a6e1f0006 with negotiated timeout 20000 for client /140.211.11.196:29230
[junit4:junit4] 2> 3677 T3296 oaz.ClientCnxn$SendThread.onConnected Session establishment complete on server localhost/127.0.0.1:29221, sessionid = 0x13bdf6a6e1f0006, negotiated timeout = 20000
[junit4:junit4] 2> 3677 T3297 oascc.ConnectionManager.process Watcher org.apache.solr.common.cloud.ConnectionManager@997f1d5 name:ZooKeeperConnection Watcher:127.0.0.1:29221/solr got event WatchedEvent state:SyncConnected type:None path:null path:null type:None
[junit4:junit4] 2> 3678 T3256 oascc.ConnectionManager.waitForConnected Client is connected to ZooKeeper
[junit4:junit4] 2> 3678 T3261 oazs.PrepRequestProcessor.pRequest Got user-level KeeperException when processing sessionid:0x13bdf6a6e1f0006 type:create cxid:0x1 zxid:0x49 txntype:-1 reqpath:n/a Error Path:/solr/overseer Error:KeeperErrorCode = NodeExists for /solr/overseer
[junit4:junit4] 2> 3680 T3261 oazs.PrepRequestProcessor.pRequest Got user-level KeeperException when processing sessionid:0x13bdf6a6e1f0006 type:create cxid:0x2 zxid:0x4a txntype:-1 reqpath:n/a Error Path:/solr/overseer Error:KeeperErrorCode = NodeExists for /solr/overseer
[junit4:junit4] 2> 3688 T3256 oasc.ZkController.createEphemeralLiveNode Register node as live in ZooKeeper:/live_nodes/127.0.0.1:29228_
[junit4:junit4] 2> 3688 T3261 oazs.PrepRequestProcessor.pRequest Got user-level KeeperException when processing sessionid:0x13bdf6a6e1f0006 type:delete cxid:0x4 zxid:0x4b txntype:-1 reqpath:n/a Error Path:/solr/live_nodes/127.0.0.1:29228_ Error:KeeperErrorCode = NoNode for /solr/live_nodes/127.0.0.1:29228_
[junit4:junit4] 2> 3689 T3256 oascc.SolrZkClient.makePath makePath: /live_nodes/127.0.0.1:29228_
[junit4:junit4] 2> 3692 T3284 oascc.ZkStateReader$3.process Updating live nodes... (2)
[junit4:junit4] 2> 3692 T3278 oascc.ZkStateReader$3.process Updating live nodes... (2)
[junit4:junit4] 2> 3692 T3278 oascc.ZkStateReader$2.process A cluster state change: WatchedEvent state:SyncConnected type:NodeChildrenChanged path:/live_nodes, has occurred - updating... (live nodes size: 2)
[junit4:junit4] 2> 3700 T3256 oascc.ZkStateReader.createClusterStateWatchersAndUpdate Updating cluster state from ZooKeeper...
[junit4:junit4] 2> 3707 T3298 oasc.CoreContainer.create Creating SolrCore 'collection1' using instanceDir: /usr/home/hudson/hudson-slave/workspace/Lucene-Solr-Tests-trunk-Java6/solr/build/solr-core/test/J1/./org.apache.solr.cloud.SyncSliceTest-jetty1-1356662995783/collection1
[junit4:junit4] 2> 3707 T3298 oasc.ZkController.createCollectionZkNode Check for collection zkNode:collection1
[junit4:junit4] 2> 3707 T3298 oasc.ZkController.createCollectionZkNode Collection zkNode exists
[junit4:junit4] 2> 3708 T3298 oasc.ZkController.readConfigName Load collection config from:/collections/collection1
[junit4:junit4] 2> 3709 T3298 oasc.SolrResourceLoader.<init> new SolrResourceLoader for directory: '/usr/home/hudson/hudson-slave/workspace/Lucene-Solr-Tests-trunk-Java6/solr/build/solr-core/test/J1/./org.apache.solr.cloud.SyncSliceTest-jetty1-1356662995783/collection1/'
[junit4:junit4] 2> 3710 T3298 oasc.SolrResourceLoader.replaceClassLoader Adding 'file:/usr/home/hudson/hudson-slave/workspace/Lucene-Solr-Tests-trunk-Java6/solr/build/solr-core/test/J1/org.apache.solr.cloud.SyncSliceTest-jetty1-1356662995783/collection1/lib/classes/' to classloader
[junit4:junit4] 2> 3711 T3298 oasc.SolrResourceLoader.replaceClassLoader Adding 'file:/usr/home/hudson/hudson-slave/workspace/Lucene-Solr-Tests-trunk-Java6/solr/build/solr-core/test/J1/org.apache.solr.cloud.SyncSliceTest-jetty1-1356662995783/collection1/lib/README' to classloader
[junit4:junit4] 2> 3760 T3298 oasc.SolrConfig.<init> Using Lucene MatchVersion: LUCENE_50
[junit4:junit4] 2> 3806 T3279 oascc.ZkStateReader.updateClusterState Updating cloud state from ZooKeeper...
[junit4:junit4] 2> 3807 T3279 oasc.Overseer$ClusterStateUpdater.updateState Update state numShards=1 message={
[junit4:junit4] 2> "operation":"state",
[junit4:junit4] 2> "numShards":"1",
[junit4:junit4] 2> "shard":"shard1",
[junit4:junit4] 2> "roles":null,
[junit4:junit4] 2> "state":"active",
[junit4:junit4] 2> "core":"collection1",
[junit4:junit4] 2> "collection":"control_collection",
[junit4:junit4] 2> "node_name":"127.0.0.1:29224_",
[junit4:junit4] 2> "base_url":"http://127.0.0.1:29224"}
[junit4:junit4] 2> 3823 T3297 oascc.ZkStateReader$2.process A cluster state change: WatchedEvent state:SyncConnected type:NodeDataChanged path:/clusterstate.json, has occurred - updating... (live nodes size: 2)
[junit4:junit4] 2> 3823 T3284 oascc.ZkStateReader$2.process A cluster state change: WatchedEvent state:SyncConnected type:NodeDataChanged path:/clusterstate.json, has occurred - updating... (live nodes size: 2)
[junit4:junit4] 2> 3823 T3278 oascc.ZkStateReader$2.process A cluster state change: WatchedEvent state:SyncConnected type:NodeDataChanged path:/clusterstate.json, has occurred - updating... (live nodes size: 2)
[junit4:junit4] 2> 3830 T3298 oasc.SolrConfig.<init> Loaded SolrConfig: solrconfig.xml
[junit4:junit4] 2> 3930 T3298 oass.IndexSchema.readSchema Reading Solr Schema
[junit4:junit4] 2> 3936 T3298 oass.IndexSchema.readSchema Schema name=test
[junit4:junit4] 2> 4543 T3298 oass.OpenExchangeRatesOrgProvider.init Initialized with rates=open-exchange-rates.json, refreshInterval=1440.
[junit4:junit4] 2> 4555 T3298 oass.IndexSchema.readSchema default search field in schema is text
[junit4:junit4] 2> 4559 T3298 oass.IndexSchema.readSchema unique key field: id
[junit4:junit4] 2> 4571 T3298 oass.FileExchangeRateProvider.reload Reloading exchange rates from file currency.xml
[junit4:junit4] 2> 4574 T3298 oass.FileExchangeRateProvider.reload Reloading exchange rates from file currency.xml
[junit4:junit4] 2> 4577 T3298 oass.OpenExchangeRatesOrgProvider.reload Reloading exchange rates from open-exchange-rates.json
[junit4:junit4] 2> 4578 T3298 oass.OpenExchangeRatesOrgProvider.reload Reloading exchange rates from open-exchange-rates.json
[junit4:junit4] 2> 4579 T3298 oasc.SolrCore.<init> [collection1] Opening new SolrCore at /usr/home/hudson/hudson-slave/workspace/Lucene-Solr-Tests-trunk-Java6/solr/build/solr-core/test/J1/./org.apache.solr.cloud.SyncSliceTest-jetty1-1356662995783/collection1/, dataDir=./org.apache.solr.cloud.SyncSliceTest-1356662992407/jetty1/
[junit4:junit4] 2> 4579 T3298 oasc.JmxMonitoredMap.<init> JMX monitoring is enabled. Adding Solr mbeans to JMX Server: com.sun.jmx.mbeanserver.JmxMBeanServer@4513e9fd
[junit4:junit4] 2> 4580 T3298 oasc.SolrCore.initDirectoryFactory solr.StandardDirectoryFactory
[junit4:junit4] 2> 4580 T3298 oasc.CachingDirectoryFactory.get return new directory for /usr/home/hudson/hudson-slave/workspace/Lucene-Solr-Tests-trunk-Java6/solr/build/solr-core/test/J1/./org.apache.solr.cloud.SyncSliceTest-1356662992407/jetty1 forceNew:false
[junit4:junit4] 2> 4581 T3298 oasc.CachingDirectoryFactory.close Releasing directory:/usr/home/hudson/hudson-slave/workspace/Lucene-Solr-Tests-trunk-Java6/solr/build/solr-core/test/J1/./org.apache.solr.cloud.SyncSliceTest-1356662992407/jetty1
[junit4:junit4] 2> 4581 T3298 oasc.SolrCore.getNewIndexDir New index directory detected: old=null new=./org.apache.solr.cloud.SyncSliceTest-1356662992407/jetty1/index/
[junit4:junit4] 2> 4581 T3298 oasc.SolrCore.initIndex WARNING [collection1] Solr index directory './org.apache.solr.cloud.SyncSliceTest-1356662992407/jetty1/index' doesn't exist. Creating new index...
[junit4:junit4] 2> 4582 T3298 oasc.CachingDirectoryFactory.get return new directory for /usr/home/hudson/hudson-slave/workspace/Lucene-Solr-Tests-trunk-Java6/solr/build/solr-core/test/J1/./org.apache.solr.cloud.SyncSliceTest-1356662992407/jetty1/index forceNew:false
[junit4:junit4] 2> 4610 T3298 oasc.SolrDeletionPolicy.onCommit SolrDeletionPolicy.onCommit: commits:num=1
[junit4:junit4] 2> commit{dir=RateLimitedDirectoryWrapper(org.apache.lucene.store.NIOFSDirectory@/usr/home/hudson/hudson-slave/workspace/Lucene-Solr-Tests-trunk-Java6/solr/build/solr-core/test/J1/org.apache.solr.cloud.SyncSliceTest-1356662992407/jetty1/index lockFactory=org.apache.lucene.store.NativeFSLockFactory@20d1604a),segFN=segments_1,generation=1,filenames=[segments_1]
[junit4:junit4] 2> 4611 T3298 oasc.SolrDeletionPolicy.updateCommits newest commit = 1[segments_1]
[junit4:junit4] 2> 4611 T3298 oasc.CachingDirectoryFactory.close Releasing directory:/usr/home/hudson/hudson-slave/workspace/Lucene-Solr-Tests-trunk-Java6/solr/build/solr-core/test/J1/./org.apache.solr.cloud.SyncSliceTest-1356662992407/jetty1/index
[junit4:junit4] 2> 4611 T3298 oasc.SolrCore.initWriters created xml: solr.XMLResponseWriter
[junit4:junit4] 2> 4613 T3298 oasup.UpdateRequestProcessorChain.init inserting DistributedUpdateProcessorFactory into updateRequestProcessorChain "dedupe"
[junit4:junit4] 2> 4613 T3298 oasup.UpdateRequestProcessorChain.init inserting DistributedUpdateProcessorFactory into updateRequestProcessorChain "dedupe-allfields"
[junit4:junit4] 2> 4613 T3298 oasup.UpdateRequestProcessorChain.init inserting DistributedUpdateProcessorFactory into updateRequestProcessorChain "stored_sig"
[junit4:junit4] 2> 4613 T3298 oasup.UpdateRequestProcessorChain.init inserting DistributedUpdateProcessorFactory into updateRequestProcessorChain "uniq-fields"
[junit4:junit4] 2> 4614 T3298 oasup.UpdateRequestProcessorChain.init inserting DistributedUpdateProcessorFactory into updateRequestProcessorChain "distrib-dup-test-chain-implicit"
[junit4:junit4] 2> 4614 T3298 oasc.RequestHandlers.initHandlersFromConfig adding lazy requestHandler: solr.ReplicationHandler
[junit4:junit4] 2> 4614 T3298 oasc.RequestHandlers.initHandlersFromConfig created /replication: solr.ReplicationHandler
[junit4:junit4] 2> 4615 T3298 oasc.RequestHandlers.initHandlersFromConfig created standard: solr.StandardRequestHandler
[junit4:junit4] 2> 4615 T3298 oasc.RequestHandlers.initHandlersFromConfig created /get: solr.RealTimeGetHandler
[junit4:junit4] 2> 4615 T3298 oasc.RequestHandlers.initHandlersFromConfig created dismax: solr.SearchHandler
[junit4:junit4] 2> 4616 T3298 oasc.RequestHandlers.initHandlersFromConfig created mock: org.apache.solr.core.MockQuerySenderListenerReqHandler
[junit4:junit4] 2> 4616 T3298 oasc.RequestHandlers.initHandlersFromConfig created /admin/: org.apache.solr.handler.admin.AdminHandlers
[junit4:junit4] 2> 4616 T3298 oasc.RequestHandlers.initHandlersFromConfig created defaults: solr.StandardRequestHandler
[junit4:junit4] 2> 4616 T3298 oasc.RequestHandlers.initHandlersFromConfig adding lazy requestHandler: solr.StandardRequestHandler
[junit4:junit4] 2> 4617 T3298 oasc.RequestHandlers.initHandlersFromConfig created lazy: solr.StandardRequestHandler
[junit4:junit4] 2> 4617 T3298 oasc.RequestHandlers.initHandlersFromConfig created /update: solr.UpdateRequestHandler
[junit4:junit4] 2> 4617 T3298 oasc.RequestHandlers.initHandlersFromConfig created /terms: org.apache.solr.handler.component.SearchHandler
[junit4:junit4] 2> 4618 T3298 oasc.RequestHandlers.initHandlersFromConfig created spellCheckCompRH: org.apache.solr.handler.component.SearchHandler
[junit4:junit4] 2> 4618 T3298 oasc.RequestHandlers.initHandlersFromConfig created spellCheckCompRH_Direct: org.apache.solr.handler.component.SearchHandler
[junit4:junit4] 2> 4618 T3298 oasc.RequestHandlers.initHandlersFromConfig created spellCheckWithWordbreak: org.apache.solr.handler.component.SearchHandler
[junit4:junit4] 2> 4619 T3298 oasc.RequestHandlers.initHandlersFromConfig created spellCheckWithWordbreak_Direct: org.apache.solr.handler.component.SearchHandler
[junit4:junit4] 2> 4619 T3298 oasc.RequestHandlers.initHandlersFromConfig created spellCheckCompRH1: org.apache.solr.handler.component.SearchHandler
[junit4:junit4] 2> 4619 T3298 oasc.RequestHandlers.initHandlersFromConfig created mltrh: org.apache.solr.handler.component.SearchHandler
[junit4:junit4] 2> 4619 T3298 oasc.RequestHandlers.initHandlersFromConfig created tvrh: org.apache.solr.handler.component.SearchHandler
[junit4:junit4] 2> 4620 T3298 oasc.RequestHandlers.initHandlersFromConfig created /mlt: solr.MoreLikeThisHandler
[junit4:junit4] 2> 4620 T3298 oasc.RequestHandlers.initHandlersFromConfig created /debug/dump: solr.DumpRequestHandler
[junit4:junit4] 2> 4625 T3298 oashl.XMLLoader.init xsltCacheLifetimeSeconds=60
[junit4:junit4] 2> 4628 T3298 oasc.SolrCore.initDeprecatedSupport WARNING solrconfig.xml uses deprecated <admin/gettableFiles>, Please update your config to use the ShowFileRequestHandler.
[junit4:junit4] 2> 4628 T3298 oasc.SolrCore.initDeprecatedSupport WARNING adding ShowFileRequestHandler with hidden files: [SCHEMA.XML, OLD_SYNONYMS.TXT, STOPWORDS.TXT, PROTWORDS.TXT, OPEN-EXCHANGE-RATES.JSON, SYNONYMS.TXT, CURRENCY.XML, MAPPING-ISOLATIN1ACCENT.TXT]
[junit4:junit4] 2> 4630 T3298 oasc.CachingDirectoryFactory.close Releasing directory:/usr/home/hudson/hudson-slave/workspace/Lucene-Solr-Tests-trunk-Java6/solr/build/solr-core/test/J1/./org.apache.solr.cloud.SyncSliceTest-1356662992407/jetty1
[junit4:junit4] 2> 4631 T3298 oass.SolrIndexSearcher.<init> Opening Searcher@376284d0 main
[junit4:junit4] 2> 4632 T3298 oasu.CommitTracker.<init> Hard AutoCommit: disabled
[junit4:junit4] 2> 4632 T3298 oasu.CommitTracker.<init> Soft AutoCommit: disabled
[junit4:junit4] 2> 4632 T3298 oashc.SpellCheckComponent.inform Initializing spell checkers
[junit4:junit4] 2> 4637 T3298 oass.DirectSolrSpellChecker.init init: {name=direct,classname=DirectSolrSpellChecker,field=lowerfilt,minQueryLength=3}
[junit4:junit4] 2> 4683 T3299 oasc.SolrCore.registerSearcher [collection1] Registered new searcher Searcher@376284d0 main{StandardDirectoryReader(segments_1:1)}
[junit4:junit4] 2> 4688 T3298 oasc.ZkController.publish publishing core=collection1 state=down
[junit4:junit4] 2> 4688 T3298 oasc.ZkController.publish numShards not found on descriptor - reading it from system property
[junit4:junit4] 2> 4830 T3279 oascc.ZkStateReader.updateClusterState Updating cloud state from ZooKeeper...
[junit4:junit4] 2> 4831 T3279 oasc.Overseer$ClusterStateUpdater.updateState Update state numShards=1 message={
[junit4:junit4] 2> "operation":"state",
[junit4:junit4] 2> "numShards":"1",
[junit4:junit4] 2> "shard":null,
[junit4:junit4] 2> "roles":null,
[junit4:junit4] 2> "state":"down",
[junit4:junit4] 2> "core":"collection1",
[junit4:junit4] 2> "collection":"collection1",
[junit4:junit4] 2> "node_name":"127.0.0.1:29228_",
[junit4:junit4] 2> "base_url":"http://127.0.0.1:29228"}
[junit4:junit4] 2> 4831 T3279 oasc.Overseer$ClusterStateUpdater.createCollection Create collection collection1 with numShards 1
[junit4:junit4] 2> 4831 T3279 oasc.Overseer$ClusterStateUpdater.updateState Assigning new node to shard shard=shard1
[junit4:junit4] 2> 4843 T3284 oascc.ZkStateReader$2.process A cluster state change: WatchedEvent state:SyncConnected type:NodeDataChanged path:/clusterstate.json, has occurred - updating... (live nodes size: 2)
[junit4:junit4] 2> 4843 T3278 oascc.ZkStateReader$2.process A cluster state change: WatchedEvent state:SyncConnected type:NodeDataChanged path:/clusterstate.json, has occurred - updating... (live nodes size: 2)
[junit4:junit4] 2> 4843 T3297 oascc.ZkStateReader$2.process A cluster state change: WatchedEvent state:SyncConnected type:NodeDataChanged path:/clusterstate.json, has occurred - updating... (live nodes size: 2)
[junit4:junit4] 2> 5690 T3298 oasc.CoreContainer.registerCore registering core: collection1
[junit4:junit4] 2> 5690 T3298 oasc.ZkController.register Register replica - core:collection1 address:http://127.0.0.1:29228 collection:collection1 shard:shard1
[junit4:junit4] 2> 5691 T3298 oascc.SolrZkClient.makePath makePath: /collections/collection1/leader_elect/shard1/election
[junit4:junit4] 2> 5735 T3261 oazs.PrepRequestProcessor.pRequest Got user-level KeeperException when processing sessionid:0x13bdf6a6e1f0006 type:delete cxid:0x45 zxid:0x5b txntype:-1 reqpath:n/a Error Path:/solr/collections/collection1/leaders Error:KeeperErrorCode = NoNode for /solr/collections/collection1/leaders
[junit4:junit4] 2> 5735 T3298 oasc.ShardLeaderElectionContext.runLeaderProcess Running the leader process.
[junit4:junit4] 2> 5736 T3261 oazs.PrepRequestProcessor.pRequest Got user-level KeeperException when processing sessionid:0x13bdf6a6e1f0006 type:create cxid:0x46 zxid:0x5c txntype:-1 reqpath:n/a Error Path:/solr/overseer Error:KeeperErrorCode = NodeExists for /solr/overseer
[junit4:junit4] 2> 5746 T3298 oasc.ShardLeaderElectionContext.waitForReplicasToComeUp Enough replicas found to continue.
[junit4:junit4] 2> 5746 T3298 oasc.ShardLeaderElectionContext.runLeaderProcess I may be the new leader - try and sync
[junit4:junit4] 2> 5747 T3298 oasc.SyncStrategy.sync Sync replicas to http://127.0.0.1:29228/collection1/
[junit4:junit4] 2> 5747 T3298 oasc.SyncStrategy.syncReplicas Sync Success - now sync replicas to me
[junit4:junit4] 2> 5747 T3298 oasc.SyncStrategy.syncToMe http://127.0.0.1:29228/collection1/ has no replicas
[junit4:junit4] 2> 5748 T3298 oasc.ShardLeaderElectionContext.runLeaderProcess I am the new leader: http://127.0.0.1:29228/collection1/
[junit4:junit4] 2> 5748 T3298 oascc.SolrZkClient.makePath makePath: /collections/collection1/leaders/shard1
[junit4:junit4] 2> 5751 T3261 oazs.PrepRequestProcessor.pRequest Got user-level KeeperException when processing sessionid:0x13bdf6a6e1f0006 type:create cxid:0x50 zxid:0x60 txntype:-1 reqpath:n/a Error Path:/solr/overseer Error:KeeperErrorCode = NodeExists for /solr/overseer
[junit4:junit4] 2> 5849 T3279 oascc.ZkStateReader.updateClusterState Updating cloud state from ZooKeeper...
[junit4:junit4] 2> 5862 T3278 oascc.ZkStateReader$2.process A cluster state change: WatchedEvent state:SyncConnected type:NodeDataChanged path:/clusterstate.json, has occurred - updating... (live nodes size: 2)
[junit4:junit4] 2> 5862 T3297 oascc.ZkStateReader$2.process A cluster state change: WatchedEvent state:SyncConnected type:NodeDataChanged path:/clusterstate.json, has occurred - updating... (live nodes size: 2)
[junit4:junit4] 2> 5862 T3284 oascc.ZkStateReader$2.process A cluster state change: WatchedEvent state:SyncConnected type:NodeDataChanged path:/clusterstate.json, has occurred - updating... (live nodes size: 2)
[junit4:junit4] 2> 5864 T3298 oasc.ZkController.register We are http://127.0.0.1:29228/collection1/ and leader is http://127.0.0.1:29228/collection1/
[junit4:junit4] 2> 5864 T3298 oasc.ZkController.register No LogReplay needed for core=collection1 baseURL=http://127.0.0.1:29228
[junit4:junit4] 2> 5864 T3298 oasc.ZkController.checkRecovery I am the leader, no recovery necessary
[junit4:junit4] 2> 5864 T3298 oasc.ZkController.publish publishing core=collection1 state=active
[junit4:junit4] 2> 5865 T3298 oasc.ZkController.publish numShards not found on descriptor - reading it from system property
[junit4:junit4] 2> 5866 T3298 oascc.ZkStateReader.updateClusterState Updating cloud state from ZooKeeper...
[junit4:junit4] 2> 5867 T3256 oass.SolrDispatchFilter.init user.dir=/usr/home/hudson/hudson-slave/workspace/Lucene-Solr-Tests-trunk-Java6/solr/build/solr-core/test/J1
[junit4:junit4] 2> 5868 T3256 oass.SolrDispatchFilter.init SolrDispatchFilter.init() done
[junit4:junit4] 2> 5868 T3256 oascsi.HttpClientUtil.createClient Creating new http client, config:maxConnections=128&maxConnectionsPerHost=32&followRedirects=false
[junit4:junit4] 2> 6033 T3256 oejs.Server.doStart jetty-8.1.8.v20121106
[junit4:junit4] 2> 6037 T3256 oejs.AbstractConnector.doStart Started SocketConnector@127.0.0.1:29231
[junit4:junit4] 2> 6037 T3256 oasc.SolrResourceLoader.locateSolrHome JNDI not configured for solr (NoInitialContextEx)
[junit4:junit4] 2> 6038 T3256 oasc.SolrResourceLoader.locateSolrHome using system property solr.solr.home: /usr/home/hudson/hudson-slave/workspace/Lucene-Solr-Tests-trunk-Java6/solr/build/solr-core/test/J1/./org.apache.solr.cloud.SyncSliceTest-jetty2-1356662998284
[junit4:junit4] 2> 6038 T3256 oasc.SolrResourceLoader.<init> new SolrResourceLoader for deduced Solr Home: '/usr/home/hudson/hudson-slave/workspace/Lucene-Solr-Tests-trunk-Java6/solr/build/solr-core/test/J1/./org.apache.solr.cloud.SyncSliceTest-jetty2-1356662998284/'
[junit4:junit4] 2> 6073 T3256 oass.SolrDispatchFilter.init SolrDispatchFilter.init()
[junit4:junit4] 2> 6073 T3256 oasc.SolrResourceLoader.locateSolrHome JNDI not configured for solr (NoInitialContextEx)
[junit4:junit4] 2> 6074 T3256 oasc.SolrResourceLoader.locateSolrHome using system property solr.solr.home: /usr/home/hudson/hudson-slave/workspace/Lucene-Solr-Tests-trunk-Java6/solr/build/solr-core/test/J1/./org.apache.solr.cloud.SyncSliceTest-jetty2-1356662998284
[junit4:junit4] 2> 6074 T3256 oasc.CoreContainer$Initializer.initialize looking for solr.xml: /usr/home/hudson/hudson-slave/workspace/Lucene-Solr-Tests-trunk-Java6/solr/build/solr-core/test/J1/./org.apache.solr.cloud.SyncSliceTest-jetty2-1356662998284/solr.xml
[junit4:junit4] 2> 6075 T3256 oasc.CoreContainer.<init> New CoreContainer 1554302115
[junit4:junit4] 2> 6075 T3256 oasc.CoreContainer.load Loading CoreContainer using Solr Home: '/usr/home/hudson/hudson-slave/workspace/Lucene-Solr-Tests-trunk-Java6/solr/build/solr-core/test/J1/./org.apache.solr.cloud.SyncSliceTest-jetty2-1356662998284/'
[junit4:junit4] 2> 6076 T3256 oasc.SolrResourceLoader.<init> new SolrResourceLoader for directory: '/usr/home/hudson/hudson-slave/workspace/Lucene-Solr-Tests-trunk-Java6/solr/build/solr-core/test/J1/./org.apache.solr.cloud.SyncSliceTest-jetty2-1356662998284/'
[junit4:junit4] 2> 6097 T3256 oashc.HttpShardHandlerFactory.getParameter Setting socketTimeout to: 30000
[junit4:junit4] 2> 6098 T3256 oashc.HttpShardHandlerFactory.getParameter Setting urlScheme to: http://
[junit4:junit4] 2> 6098 T3256 oashc.HttpShardHandlerFactory.getParameter Setting connTimeout to: 15000
[junit4:junit4] 2> 6099 T3256 oashc.HttpShardHandlerFactory.getParameter Setting maxConnectionsPerHost to: 20
[junit4:junit4] 2> 6099 T3256 oashc.HttpShardHandlerFactory.getParameter Setting corePoolSize to: 0
[junit4:junit4] 2> 6100 T3256 oashc.HttpShardHandlerFactory.getParameter Setting maximumPoolSize to: 2147483647
[junit4:junit4] 2> 6100 T3256 oashc.HttpShardHandlerFactory.getParameter Setting maxThreadIdleTime to: 5
[junit4:junit4] 2> 6101 T3256 oashc.HttpShardHandlerFactory.getParameter Setting sizeOfQueue to: -1
[junit4:junit4] 2> 6101 T3256 oashc.HttpShardHandlerFactory.getParameter Setting fairnessPolicy to: false
[junit4:junit4] 2> 6102 T3256 oascsi.HttpClientUtil.createClient Creating new http client, config:maxConnectionsPerHost=20&maxConnections=10000&socketTimeout=30000&connTimeout=15000&retry=false
[junit4:junit4] 2> 6120 T3256 oasc.CoreContainer.load Registering Log Listener
[junit4:junit4] 2> 6138 T3256 oasc.CoreContainer.initZooKeeper Zookeeper client=127.0.0.1:29221/solr
[junit4:junit4] 2> 6139 T3256 oasc.ZkController.checkChrootPath zkHost includes chroot
[junit4:junit4] 2> 6139 T3256 oaz.ZooKeeper.<init> Initiating client connection, connectString=127.0.0.1:29221 sessionTimeout=60000 watcher=org.apache.solr.common.cloud.ConnectionManager@281bb229
[junit4:junit4] 2> 6140 T3256 oascc.ConnectionManager.waitForConnected Waiting for client to connect to ZooKeeper
[junit4:junit4] 2> 6141 T3309 oaz.ClientCnxn$SendThread.logStartConnect Opening socket connection to server localhost/127.0.0.1:29221. Will not attempt to authenticate using SASL (access denied (javax.security.auth.AuthPermission getLoginConfiguration))
[junit4:junit4] 2> 6141 T3309 oaz.ClientCnxn$SendThread.primeConnection Socket connection established to localhost/127.0.0.1:29221, initiating session
[junit4:junit4] 2> 6141 T3258 oazs.NIOServerCnxnFactory.run Accepted socket connection from /140.211.11.196:29232
[junit4:junit4] 2> 6142 T3258 oazs.ZooKeeperServer.processConnectRequest Client attempting to establish new session at /140.211.11.196:29232
[junit4:junit4] 2> 6144 T3260 oazs.ZooKeeperServer.finishSessionInit Established session 0x13bdf6a6e1f0007 with negotiated timeout 20000 for client /140.211.11.196:29232
[junit4:junit4] 2> 6144 T3309 oaz.ClientCnxn$SendThread.onConnected Session establishment complete on server localhost/127.0.0.1:29221, sessionid = 0x13bdf6a6e1f0007, negotiated timeout = 20000
[junit4:junit4] 2> 6144 T3310 oascc.ConnectionManager.process Watcher org.apache.solr.common.cloud.ConnectionManager@281bb229 name:ZooKeeperConnection Watcher:127.0.0.1:29221 got event WatchedEvent state:SyncConnected type:None path:null path:null type:None
[junit4:junit4] 2> 6145 T3256 oascc.ConnectionManager.waitForConnected Client is connected to ZooKeeper
[junit4:junit4] 2> 6146 T3261 oazs.PrepRequestProcessor.pRequest2Txn Processed session termination for sessionid: 0x13bdf6a6e1f0007
[junit4:junit4] 2> 6159 T3310 oaz.ClientCnxn$EventThread.run EventThread shut down
[junit4:junit4] 2> 6159 T3258 oazs.NIOServerCnxn.closeSock Closed socket connection for client /140.211.11.196:29232 which had sessionid 0x13bdf6a6e1f0007
[junit4:junit4] 2> 6159 T3256 oaz.ZooKeeper.close Session: 0x13bdf6a6e1f0007 closed
[junit4:junit4] 2> 6160 T3256 oascsi.HttpClientUtil.createClient Creating new http client, config:maxConnections=500&maxConnectionsPerHost=16&socketTimeout=15000&connTimeout=30000
[junit4:junit4] 2> 6169 T3256 oaz.ZooKeeper.<init> Initiating client connection, connectString=127.0.0.1:29221/solr sessionTimeout=30000 watcher=org.apache.solr.common.cloud.ConnectionManager@4a59610
[junit4:junit4] 2> 6170 T3256 oascc.ConnectionManager.waitForConnected Waiting for client to connect to ZooKeeper
[junit4:junit4] 2> 6170 T3311 oaz.ClientCnxn$SendThread.logStartConnect Opening socket connection to server localhost/127.0.0.1:29221. Will not attempt to authenticate using SASL (access denied (javax.security.auth.AuthPermission getLoginConfiguration))
[junit4:junit4] 2> 6171 T3311 oaz.ClientCnxn$SendThread.primeConnection Socket connection established to localhost/127.0.0.1:29221, initiating session
[junit4:junit4] 2> 6171 T3258 oazs.NIOServerCnxnFactory.run Accepted socket connection from /140.211.11.196:29233
[junit4:junit4] 2> 6171 T3258 oazs.ZooKeeperServer.processConnectRequest Client attempting to establish new session at /140.211.11.196:29233
[junit4:junit4] 2> 6172 T3260 oazs.ZooKeeperServer.finishSessionInit Established session 0x13bdf6a6e1f0008 with negotiated timeout 20000 for client /140.211.11.196:29233
[junit4:junit4] 2> 6173 T3311 oaz.ClientCnxn$SendThread.onConnected Session establishment complete on server localhost/127.0.0.1:29221, sessionid = 0x13bdf6a6e1f0008, negotiated timeout = 20000
[junit4:junit4] 2> 6173 T3312 oascc.ConnectionManager.process Watcher org.apache.solr.common.cloud.ConnectionManager@4a59610 name:ZooKeeperConnection Watcher:127.0.0.1:29221/solr got event WatchedEvent state:SyncConnected type:None path:null path:null type:None
[junit4:junit4] 2> 6173 T3256 oascc.ConnectionManager.waitForConnected Client is connected to ZooKeeper
[junit4:junit4] 2> 6174 T3261 oazs.PrepRequestProcessor.pRequest Got user-level KeeperException when processing sessionid:0x13bdf6a6e1f0008 type:create cxid:0x1 zxid:0x6d txntype:-1 reqpath:n/a Error Path:/solr/overseer Error:KeeperErrorCode = NodeExists for /solr/overseer
[junit4:junit4] 2> 6180 T3261 oazs.PrepRequestProcessor.pRequest Got user-level KeeperException when processing sessionid:0x13bdf6a6e1f0008 type:create cxid:0x2 zxid:0x6e txntype:-1 reqpath:n/a Error Path:/solr/overseer Error:KeeperErrorCode = NodeExists for /solr/overseer
[junit4:junit4] 2> 6181 T3256 oasc.ZkController.createEphemeralLiveNode Register node as live in ZooKeeper:/live_nodes/127.0.0.1:29231_
[junit4:junit4] 2> 6182 T3261 oazs.PrepRequestProcessor.pRequest Got user-level KeeperException when processing sessionid:0x13bdf6a6e1f0008 type:delete cxid:0x4 zxid:0x6f txntype:-1 reqpath:n/a Error Path:/solr/live_nodes/127.0.0.1:29231_ Error:KeeperErrorCode = NoNode for /solr/live_nodes/127.0.0.1:29231_
[junit4:junit4] 2> 6183 T3256 oascc.SolrZkClient.makePath makePath: /live_nodes/127.0.0.1:29231_
[junit4:junit4] 2> 6192 T3284 oascc.ZkStateReader$2.process A cluster state change: WatchedEvent state:SyncConnected type:NodeChildrenChanged path:/live_nodes, has occurred - updating... (live nodes size: 2)
[junit4:junit4] 2> 6193 T3297 oascc.ZkStateReader$3.process Updating live nodes... (3)
[junit4:junit4] 2> 6193 T3278 oascc.ZkStateReader$3.process Updating live nodes... (3)
[junit4:junit4] 2> 6193 T3297 oascc.ZkStateReader$2.process A cluster state change: WatchedEvent state:SyncConnected type:NodeChildrenChanged path:/live_nodes, has occurred - updating... (live nodes size: 3)
[junit4:junit4] 2> 6193 T3278 oascc.ZkStateReader$2.process A cluster state change: WatchedEvent state:SyncConnected type:NodeChildrenChanged path:/live_nodes, has occurred - updating... (live nodes size: 3)
[junit4:junit4] 2> 6194 T3284 oascc.ZkStateReader$3.process Updating live nodes... (3)
[junit4:junit4] 2> 6196 T3256 oascc.ZkStateReader.createClusterStateWatchersAndUpdate Updating cluster state from ZooKeeper...
[junit4:junit4] 2> 6202 T3313 oasc.CoreContainer.create Creating SolrCore 'collection1' using instanceDir: /usr/home/hudson/hudson-slave/workspace/Lucene-Solr-Tests-trunk-Java6/solr/build/solr-core/test/J1/./org.apache.solr.cloud.SyncSliceTest-jetty2-1356662998284/collection1
[junit4:junit4] 2> 6202 T3313 oasc.ZkController.createCollectionZkNode Check for collection zkNode:collection1
[junit4:junit4] 2> 6203 T3313 oasc.ZkController.createCollectionZkNode Collection zkNode exists
[junit4:junit4] 2> 6203 T3313 oasc.ZkController.readConfigName Load collection config from:/collections/collection1
[junit4:junit4] 2> 6204 T3313 oasc.SolrResourceLoader.<init> new SolrResourceLoader for directory: '/usr/home/hudson/hudson-slave/workspace/Lucene-Solr-Tests-trunk-Java6/solr/build/solr-core/test/J1/./org.apache.solr.cloud.SyncSliceTest-jetty2-1356662998284/collection1/'
[junit4:junit4] 2> 6205 T3313 oasc.SolrResourceLoader.replaceClassLoader Adding 'file:/usr/home/hudson/hudson-slave/workspace/Lucene-Solr-Tests-trunk-Java6/solr/build/solr-core/test/J1/org.apache.solr.cloud.SyncSliceTest-jetty2-1356662998284/collection1/lib/classes/' to classloader
[junit4:junit4] 2> 6206 T3313 oasc.SolrResourceLoader.replaceClassLoader Adding 'file:/usr/home/hudson/hudson-slave/workspace/Lucene-Solr-Tests-trunk-Java6/solr/build/solr-core/test/J1/org.apache.solr.cloud.SyncSliceTest-jetty2-1356662998284/collection1/lib/README' to classloader
[junit4:junit4] 2> 6261 T3313 oasc.SolrConfig.<init> Using Lucene MatchVersion: LUCENE_50
[junit4:junit4] 2> 6331 T3313 oasc.SolrConfig.<init> Loaded SolrConfig: solrconfig.xml
[junit4:junit4] 2> 6368 T3279 oascc.ZkStateReader.updateClusterState Updating cloud state from ZooKeeper...
[junit4:junit4] 2> 6369 T3279 oasc.Overseer$ClusterStateUpdater.updateState Update state numShards=1 message={
[junit4:junit4] 2> "operation":"state",
[junit4:junit4] 2> "numShards":"1",
[junit4:junit4] 2> "shard":"shard1",
[junit4:junit4] 2> "roles":null,
[junit4:junit4] 2> "state":"active",
[junit4:junit4] 2> "core":"collection1",
[junit4:junit4] 2> "collection":"collection1",
[junit4:junit4] 2> "node_name":"127.0.0.1:29228_",
[junit4:junit4] 2> "base_url":"http://127.0.0.1:29228"}
[junit4:junit4] 2> 6382 T3297 oascc.ZkStateReader$2.process A cluster state change: WatchedEvent state:SyncConnected type:NodeDataChanged path:/clusterstate.json, has occurred - updating... (live nodes size: 3)
[junit4:junit4] 2> 6382 T3278 oascc.ZkStateReader$2.process A cluster state change: WatchedEvent state:SyncConnected type:NodeDataChanged path:/clusterstate.json, has occurred - updating... (live nodes size: 3)
[junit4:junit4] 2> 6382 T3284 oascc.ZkStateReader$2.process A cluster state change: WatchedEvent state:SyncConnected type:NodeDataChanged path:/clusterstate.json, has occurred - updating... (live nodes size: 3)
[junit4:junit4] 2> 6432 T3313 oass.IndexSchema.readSchema Reading Solr Schema
[junit4:junit4] 2> 6432 T3312 oascc.ZkStateReader$2.process A cluster state change: WatchedEvent state:SyncConnected type:NodeDataChanged path:/clusterstate.json, has occurred - updating... (live nodes size: 3)
[junit4:junit4] 2> 6439 T3313 oass.IndexSchema.readSchema Schema name=test
[junit4:junit4] 2> 7069 T3313 oass.OpenExchangeRatesOrgProvider.init Initialized with rates=open-exchange-rates.json, refreshInterval=1440.
[junit4:junit4] 2> 7077 T3313 oass.IndexSchema.readSchema default search field in schema is text
[junit4:junit4] 2> 7080 T3313 oass.IndexSchema.readSchema unique key field: id
[junit4:junit4] 2> 7090 T3313 oass.FileExchangeRateProvider.reload Reloading exchange rates from file currency.xml
[junit4:junit4] 2> 7093 T3313 oass.FileExchangeRateProvider.reload Reloading exchange rates from file currency.xml
[junit4:junit4] 2> 7097 T3313 oass.OpenExchangeRatesOrgProvider.reload Reloading exchange rates from open-exchange-rates.json
[junit4:junit4] 2> 7098 T3313 oass.OpenExchangeRatesOrgProvider.reload Reloading exchange rates from open-exchange-rates.json
[junit4:junit4] 2> 7098 T3313 oasc.SolrCore.<init> [collection1] Opening new SolrCore at /usr/home/hudson/hudson-slave/workspace/Lucene-Solr-Tests-trunk-Java6/solr/build/solr-core/test/J1/./org.apache.solr.cloud.SyncSliceTest-jetty2-1356662998284/collection1/, dataDir=./org.apache.solr.cloud.SyncSliceTest-1356662992407/jetty2/
[junit4:junit4] 2> 7099 T3313 oasc.JmxMonitoredMap.<init> JMX monitoring is enabled. Adding Solr mbeans to JMX Server: com.sun.jmx.mbeanserver.JmxMBeanServer@4513e9fd
[junit4:junit4] 2> 7099 T3313 oasc.SolrCore.initDirectoryFactory solr.StandardDirectoryFactory
[junit4:junit4] 2> 7100 T3313 oasc.CachingDirectoryFactory.get return new directory for /usr/home/hudson/hudson-slave/workspace/Lucene-Solr-Tests-trunk-Java6/solr/build/solr-core/test/J1/./org.apache.solr.cloud.SyncSliceTest-1356662992407/jetty2 forceNew:false
[junit4:junit4] 2> 7100 T3313 oasc.CachingDirectoryFactory.close Releasing directory:/usr/home/hudson/hudson-slave/workspace/Lucene-Solr-Tests-trunk-Java6/solr/build/solr-core/test/J1/./org.apache.solr.cloud.SyncSliceTest-1356662992407/jetty2
[junit4:junit4] 2> 7100 T3313 oasc.SolrCore.getNewIndexDir New index directory detected: old=null new=./org.apache.solr.cloud.SyncSliceTest-1356662992407/jetty2/index/
[junit4:junit4] 2> 7101 T3313 oasc.SolrCore.initIndex WARNING [collection1] Solr index directory './org.apache.solr.cloud.SyncSliceTest-1356662992407/jetty2/index' doesn't exist. Creating new index...
[junit4:junit4] 2> 7101 T3313 oasc.CachingDirectoryFactory.get return new directory for /usr/home/hudson/hudson-slave/workspace/Lucene-Solr-Tests-trunk-Java6/solr/build/solr-core/test/J1/./org.apache.solr.cloud.SyncSliceTest-1356662992407/jetty2/index forceNew:false
[junit4:junit4] 2> 7130 T3313 oasc.SolrDeletionPolicy.onCommit SolrDeletionPolicy.onCommit: commits:num=1
[junit4:junit4] 2> commit{dir=RateLimitedDirectoryWrapper(org.apache.lucene.store.NIOFSDirectory@/usr/home/hudson/hudson-slave/workspace/Lucene-Solr-Tests-trunk-Java6/solr/build/solr-core/test/J1/org.apache.solr.cloud.SyncSliceTest-1356662992407/jetty2/index lockFactory=org.apache.lucene.store.NativeFSLockFactory@3338eb09),segFN=segments_1,generation=1,filenames=[segments_1]
[junit4:junit4] 2> 7131 T3313 oasc.SolrDeletionPolicy.updateCommits newest commit = 1[segments_1]
[junit4:junit4] 2> 7131 T3313 oasc.CachingDirectoryFactory.close Releasing directory:/usr/home/hudson/hudson-slave/workspace/Lucene-Solr-Tests-trunk-Java6/solr/build/solr-core/test/J1/./org.apache.solr.cloud.SyncSliceTest-1356662992407/jetty2/index
[junit4:junit4] 2> 7131 T3313 oasc.SolrCore.initWriters created xml: solr.XMLResponseWriter
[junit4:junit4] 2> 7133 T3313 oasup.UpdateRequestProcessorChain.init inserting DistributedUpdateProcessorFactory into updateRequestProcessorChain "dedupe"
[junit4:junit4] 2> 7133 T3313 oasup.UpdateRequestProcessorChain.init inserting DistributedUpdateProcessorFactory into updateRequestProcessorChain "dedupe-allfields"
[junit4:junit4] 2> 7133 T3313 oasup.UpdateRequestProcessorChain.init inserting DistributedUpdateProcessorFactory into updateRequestProcessorChain "stored_sig"
[junit4:junit4] 2> 7134 T3313 oasup.UpdateRequestProcessorChain.init inserting DistributedUpdateProcessorFactory into updateRequestProcessorChain "uniq-fields"
[junit4:junit4] 2> 7134 T3313 oasup.UpdateRequestProcessorChain.init inserting DistributedUpdateProcessorFactory into updateRequestProcessorChain "distrib-dup-test-chain-implicit"
[junit4:junit4] 2> 7134 T3313 oasc.RequestHandlers.initHandlersFromConfig adding lazy requestHandler: solr.ReplicationHandler
[junit4:junit4] 2> 7135 T3313 oasc.RequestHandlers.initHandlersFromConfig created /replication: solr.ReplicationHandler
[junit4:junit4] 2> 7135 T3313 oasc.RequestHandlers.initHandlersFromConfig created standard: solr.StandardRequestHandler
[junit4:junit4] 2> 7135 T3313 oasc.RequestHandlers.initHandlersFromConfig created /get: solr.RealTimeGetHandler
[junit4:junit4] 2> 7136 T3313 oasc.RequestHandlers.initHandlersFromConfig created dismax: solr.SearchHandler
[junit4:junit4] 2> 7136 T3313 oasc.RequestHandlers.initHandlersFromConfig created mock: org.apache.solr.core.MockQuerySenderListenerReqHandler
[junit4:junit4] 2> 7136 T3313 oasc.RequestHandlers.initHandlersFromConfig created /admin/: org.apache.solr.handler.admin.AdminHandlers
[junit4:junit4] 2> 7137 T3313 oasc.RequestHandlers.initHandlersFromConfig created defaults: solr.StandardRequestHandler
[junit4:junit4] 2> 7137 T3313 oasc.RequestHandlers.initHandlersFromConfig adding lazy requestHandler: solr.StandardRequestHandler
[junit4:junit4] 2> 7137 T3313 oasc.RequestHandlers.initHandlersFromConfig created lazy: solr.StandardRequestHandler
[junit4:junit4] 2> 7137 T3313 oasc.RequestHandlers.initHandlersFromConfig created /update: solr.UpdateRequestHandler
[junit4:junit4] 2> 7138 T3313 oasc.RequestHandlers.initHandlersFromConfig created /terms: org.apache.solr.handler.component.SearchHandler
[junit4:junit4] 2> 7138 T3313 oasc.RequestHandlers.initHandlersFromConfig created spellCheckCompRH: org.apache.solr.handler.component.SearchHandler
[junit4:junit4] 2> 7138 T3313 oasc.RequestHandlers.initHandlersFromConfig created spellCheckCompRH_Direct: org.apache.solr.handler.component.SearchHandler
[junit4:junit4] 2> 7139 T3313 oasc.RequestHandlers.initHandlersFromConfig created spellCheckWithWordbreak: org.apache.solr.handler.component.SearchHandler
[junit4:junit4] 2> 7139 T3313 oasc.RequestHandlers.initHandlersFromConfig created spellCheckWithWordbreak_Direct: org.apache.solr.handler.component.SearchHandler
[junit4:junit4] 2> 7139 T3313 oasc.RequestHandlers.initHandlersFromConfig created spellCheckCompRH1: org.apache.solr.handler.component.SearchHandler
[junit4:junit4] 2> 7139 T3313 oasc.RequestHandlers.initHandlersFromConfig created mltrh: org.apache.solr.handler.component.SearchHandler
[junit4:junit4] 2> 7140 T3313 oasc.RequestHandlers.initHandlersFromConfig created tvrh: org.apache.solr.handler.component.SearchHandler
[junit4:junit4] 2> 7140 T3313 oasc.RequestHandlers.initHandlersFromConfig created /mlt: solr.MoreLikeThisHandler
[junit4:junit4] 2> 7140 T3313 oasc.RequestHandlers.initHandlersFromConfig created /debug/dump: solr.DumpRequestHandler
[junit4:junit4] 2> 7145 T3313 oashl.XMLLoader.init xsltCacheLifetimeSeconds=60
[junit4:junit4] 2> 7148 T3313 oasc.SolrCore.initDeprecatedSupport WARNING solrconfig.xml uses deprecated <admin/gettableFiles>, Please update your config to use the ShowFileRequestHandler.
[junit4:junit4] 2> 7149 T3313 oasc.SolrCore.initDeprecatedSupport WARNING adding ShowFileRequestHandler with hidden files: [SCHEMA.XML, OLD_SYNONYMS.TXT, STOPWORDS.TXT, PROTWORDS.TXT, OPEN-EXCHANGE-RATES.JSON, SYNONYMS.TXT, CURRENCY.XML, MAPPING-ISOLATIN1ACCENT.TXT]
[junit4:junit4] 2> 7151 T3313 oasc.CachingDirectoryFactory.close Releasing directory:/usr/home/hudson/hudson-slave/workspace/Lucene-Solr-Tests-trunk-Java6/solr/build/solr-core/test/J1/./org.apache.solr.cloud.SyncSliceTest-1356662992407/jetty2
[junit4:junit4] 2> 7152 T3313 oass.SolrIndexSearcher.<init> Opening Searcher@389744ae main
[junit4:junit4] 2> 7153 T3313 oasu.CommitTracker.<init> Hard AutoCommit: disabled
[junit4:junit4] 2> 7153 T3313 oasu.CommitTracker.<init> Soft AutoCommit: disabled
[junit4:junit4] 2> 7153 T3313 oashc.SpellCheckComponent.inform Initializing spell checkers
[junit4:junit4] 2> 7158 T3313 oass.DirectSolrSpellChecker.init init: {name=direct,classname=DirectSolrSpellChecker,field=lowerfilt,minQueryLength=3}
[junit4:junit4] 2> 7203 T3314 oasc.SolrCore.registerSearcher [collection1] Registered new searcher Searcher@389744ae main{StandardDirectoryReader(segments_1:1)}
[junit4:junit4] 2> 7206 T3313 oasc.ZkController.publish publishing core=collection1 state=down
[junit4:junit4] 2> 7206 T3313 oasc.ZkController.publish numShards not found on descriptor - reading it from system property
[junit4:junit4] 2> 7388 T3279 oascc.ZkStateReader.updateClusterState Updating cloud state from ZooKeeper...
[junit4:junit4] 2> 7389 T3279 oasc.Overseer$ClusterStateUpdater.updateState Update state numShards=1 message={
[junit4:junit4] 2> "operation":"state",
[junit4:junit4] 2> "numShards":"1",
[junit4:junit4] 2> "shard":null,
[junit4:junit4] 2> "roles":null,
[junit4:junit4] 2> "state":"down",
[junit4:junit4] 2> "core":"collection1",
[junit4:junit4] 2> "collection":"collection1",
[junit4:junit4] 2> "node_name":"127.0.0.1:29231_",
[junit4:junit4] 2> "base_url":"http://127.0.0.1:29231"}
[junit4:junit4] 2> 7389 T3279 oasc.Overseer$ClusterStateUpdater.updateState Collection already exists with numShards=1
[junit4:junit4] 2> 7389 T3279 oasc.Overseer$ClusterStateUpdater.updateState Assigning new node to shard shard=shard1
[junit4:junit4] 2> 7393 T3312 oascc.ZkStateReader$2.process A cluster state change: WatchedEvent state:SyncConnected type:NodeDataChanged path:/clusterstate.json, has occurred - updating... (live nodes size: 3)
[junit4:junit4] 2> 7393 T3297 oascc.ZkStateReader$2.process A cluster state change: WatchedEvent state:SyncConnected type:NodeDataChanged path:/clusterstate.json, has occurred - updating... (live nodes size: 3)
[junit4:junit4] 2> 7393 T3284 oascc.ZkStateReader$2.process A cluster state change: WatchedEvent state:SyncConnected type:NodeDataChanged path:/clusterstate.json, has occurred - updating... (live nodes size: 3)
[junit4:junit4] 2> 7393 T3278 oascc.ZkStateReader$2.process A cluster state change: WatchedEvent state:SyncConnected type:NodeDataChanged path:/clusterstate.json, has occurred - updating... (live nodes size: 3)
[junit4:junit4] 2> 8208 T3313 oasc.CoreContainer.registerCore registering core: collection1
[junit4:junit4] 2> 8208 T3313 oasc.ZkController.register Register replica - core:collection1 address:http://127.0.0.1:29231 collection:collection1 shard:shard1
[junit4:junit4] 2> 8227 T3313 oasc.ZkController.register We are http://127.0.0.1:29231/collection1/ and leader is http://127.0.0.1:29228/collection1/
[junit4:junit4] 2> 8228 T3313 oasc.ZkController.register No LogReplay needed for core=collection1 baseURL=http://127.0.0.1:29231
[junit4:junit4] 2> 8228 T3313 oasc.ZkController.checkRecovery Core needs to recover:collection1
[junit4:junit4] 2> 8228 T3313 oasu.DefaultSolrCoreState.doRecovery Running recovery - first canceling any ongoing recovery
[junit4:junit4] 2> ASYNC NEW_CORE C180 name=collection1 org.apache.solr.core.SolrCore@27e0cb03 url=http://127.0.0.1:29231/collection1 node=127.0.0.1:29231_ C180_STATE=coll:collection1 core:collection1 props:{shard=null, roles=null, state=down, core=collection1, collection=collection1, node_name=127.0.0.1:29231_, base_url=http://127.0.0.1:29231}
[junit4:junit4] 2> 8228 T3315 C180 P29231 oasc.RecoveryStrategy.run Starting recovery process. core=collection1 recoveringAfterStartup=true
[junit4:junit4] 2> 8230 T3315 C180 P29231 oasc.RecoveryStrategy.doRecovery ###### startupVersions=[]
[junit4:junit4] 2> 8230 T3313 oascc.ZkStateReader.updateClusterState Updating cloud state from ZooKeeper...
[junit4:junit4] 2> 8230 T3315 C180 P29231 oasc.ZkController.publish publishing core=collection1 state=recovering
[junit4:junit4] 2> 8230 T3315 C180 P29231 oasc.ZkController.publish numShards not found on descriptor - reading it from system property
[junit4:junit4] 2> 8231 T3256 oass.SolrDispatchFilter.init user.dir=/usr/home/hudson/hudson-slave/workspace/Lucene-Solr-Tests-trunk-Java6/solr/build/solr-core/test/J1
[junit4:junit4] 2> 8232 T3315 C180 P29231 oascsi.HttpClientUtil.createClient Creating new http client, config:maxConnections=128&maxConnectionsPerHost=32&followRedirects=false
[junit4:junit4] 2> 8232 T3256 oass.SolrDispatchFilter.init SolrDispatchFilter.init() done
[junit4:junit4] 2> 8232 T3256 oascsi.HttpClientUtil.createClient Creating new http client, config:maxConnections=128&maxConnectionsPerHost=32&followRedirects=false
[junit4:junit4] 2> 8408 T3279 oascc.ZkStateReader.updateClusterState Updating cloud state from ZooKeeper...
[junit4:junit4] 2> 8408 T3279 oasc.Overseer$ClusterStateUpdater.updateState Update state numShards=1 message={
[junit4:junit4] 2> "operation":"state",
[junit4:junit4] 2> "numShards":"1",
[junit4:junit4] 2> "shard":"shard1",
[junit4:junit4] 2> "roles":null,
[junit4:junit4] 2> "state":"recovering",
[junit4:junit4] 2> "core":"collection1",
[junit4:junit4] 2> "collection":"collection1",
[junit4:junit4] 2> "node_name":"127.0.0.1:29231_",
[junit4:junit4] 2> "base_url":"http://127.0.0.1:29231"}
[junit4:junit4] 2> 8421 T3256 oejs.Server.doStart jetty-8.1.8.v20121106
[junit4:junit4] 2> 8424 T3256 oejs.AbstractConnector.doStart Started SocketConnector@127.0.0.1:29236
[junit4:junit4] 2> 8425 T3256 oasc.SolrResourceLoader.locateSolrHome JNDI not configured for solr (NoInitialContextEx)
[junit4:junit4] 2> 8425 T3256 oasc.SolrResourceLoader.locateSolrHome using system property solr.solr.home: /usr/home/hudson/hudson-slave/workspace/Lucene-Solr-Tests-trunk-Java6/solr/build/solr-core/test/J1/./org.apache.solr.cloud.SyncSliceTest-jetty3-1356663000658
[junit4:junit4] 2> 8426 T3256 oasc.SolrResourceLoader.<init> new SolrResourceLoader for deduced Solr Home: '/usr/home/hudson/hudson-slave/workspace/Lucene-Solr-Tests-trunk-Java6/solr/build/solr-core/test/J1/./org.apache.solr.cloud.SyncSliceTest-jetty3-1356663000658/'
[junit4:junit4] 2> 8433 T3284 oascc.ZkStateReader$2.process A cluster state change: WatchedEvent state:SyncConnected type:NodeDataChanged path:/clusterstate.json, has occurred - updating... (live nodes size: 3)
[junit4:junit4] 2> 8433 T3297 oascc.ZkStateReader$2.process A cluster state change: WatchedEvent state:SyncConnected type:NodeDataChanged path:/clusterstate.json, has occurred - updating... (live nodes size: 3)
[junit4:junit4] 2> 8433 T3278 oascc.ZkStateReader$2.process A cluster state change: WatchedEvent state:SyncConnected type:NodeDataChanged path:/clusterstate.json, has occurred - updating... (live nodes size: 3)
[junit4:junit4] 2> 8433 T3312 oascc.ZkStateReader$2.process A cluster state change: WatchedEvent state:SyncConnected type:NodeDataChanged path:/clusterstate.json, has occurred - updating... (live nodes size: 3)
[junit4:junit4] 2> 8465 T3256 oass.SolrDispatchFilter.init SolrDispatchFilter.init()
[junit4:junit4] 2> 8466 T3256 oasc.SolrResourceLoader.locateSolrHome JNDI not configured for solr (NoInitialContextEx)
[junit4:junit4] 2> 8466 T3256 oasc.SolrResourceLoader.locateSolrHome using system property solr.solr.home: /usr/home/hudson/hudson-slave/workspace/Lucene-Solr-Tests-trunk-Java6/solr/build/solr-core/test/J1/./org.apache.solr.cloud.SyncSliceTest-jetty3-1356663000658
[junit4:junit4] 2> 8467 T3256 oasc.CoreContainer$Initializer.initialize looking for solr.xml: /usr/home/hudson/hudson-slave/workspace/Lucene-Solr-Tests-trunk-Java6/solr/build/solr-core/test/J1/./org.apache.solr.cloud.SyncSliceTest-jetty3-1356663000658/solr.xml
[junit4:junit4] 2> 8467 T3256 oasc.CoreContainer.<init> New CoreContainer 235534268
[junit4:junit4] 2> 8468 T3256 oasc.CoreContainer.load Loading CoreContainer using Solr Home: '/usr/home/hudson/hudson-slave/workspace/Lucene-Solr-Tests-trunk-Java6/solr/build/solr-core/test/J1/./org.apache.solr.cloud.SyncSliceTest-jetty3-1356663000658/'
[junit4:junit4] 2> 8469 T3256 oasc.SolrResourceLoader.<init> new SolrResourceLoader for directory: '/usr/home/hudson/hudson-slave/workspace/Lucene-Solr-Tests-trunk-Java6/solr/build/solr-core/test/J1/./org.apache.solr.cloud.SyncSliceTest-jetty3-1356663000658/'
[junit4:junit4] 2> 8492 T3256 oashc.HttpShardHandlerFactory.getParameter Setting socketTimeout to: 30000
[junit4:junit4] 2> 8492 T3256 oashc.HttpShardHandlerFactory.getParameter Setting urlScheme to: http://
[junit4:junit4] 2> 8493 T3256 oashc.HttpShardHandlerFactory.getParameter Setting connTimeout to: 15000
[junit4:junit4] 2> 8493 T3256 oashc.HttpShardHandlerFactory.getParameter Setting maxConnectionsPerHost to: 20
[junit4:junit4] 2> 8494 T3256 oashc.HttpShardHandlerFactory.getParameter Setting corePoolSize to: 0
[junit4:junit4] 2> 8494 T3256 oashc.HttpShardHandlerFactory.getParameter Setting maximumPoolSize to: 2147483647
[junit4:junit4] 2> 8495 T3256 oashc.HttpShardHandlerFactory.getParameter Setting maxThreadIdleTime to: 5
[junit4:junit4] 2> 8495 T3256 oashc.HttpShardHandlerFactory.getParameter Setting sizeOfQueue to: -1
[junit4:junit4] 2> 8496 T3256 oashc.HttpShardHandlerFactory.getParameter Setting fairnessPolicy to: false
[junit4:junit4] 2> 8496 T3256 oascsi.HttpClientUtil.createClient Creating new http client, config:maxConnectionsPerHost=20&maxConnections=10000&socketTimeout=30000&connTimeout=15000&retry=false
[junit4:junit4] 2> 8517 T3256 oasc.CoreContainer.load Registering Log Listener
[junit4:junit4] 2> 8537 T3256 oasc.CoreContainer.initZooKeeper Zookeeper client=127.0.0.1:29221/solr
[junit4:junit4] 2> 8538 T3256 oasc.ZkController.checkChrootPath zkHost includes chroot
[junit4:junit4] 2> 8538 T3256 oaz.ZooKeeper.<init> Initiating client connection, connectString=127.0.0.1:29221 sessionTimeout=60000 watcher=org.apache.solr.common.cloud.ConnectionManager@52838e14
[junit4:junit4] 2> 8539 T3256 oascc.ConnectionManager.waitForConnected Waiting for client to connect to ZooKeeper
[junit4:junit4] 2> 8540 T3325 oaz.ClientCnxn$SendThread.logStartConnect Opening socket connection to server localhost/127.0.0.1:29221. Will not attempt to authenticate using SASL (access denied (javax.security.auth.AuthPermission getLoginConfiguration))
[junit4:junit4] 2> 8540 T3325 oaz.ClientCnxn$SendThread.primeConnection Socket connection established to localhost/127.0.0.1:29221, initiating session
[junit4:junit4] 2> 8541 T3258 oazs.NIOServerCnxnFactory.run Accepted socket connection from /140.211.11.196:29237
[junit4:junit4] 2> 8541 T3258 oazs.ZooKeeperServer.processConnectRequest Client attempting to establish new session at /140.211.11.196:29237
[junit4:junit4] 2> 8547 T3260 oazs.ZooKeeperServer.finishSessionInit Established session 0x13bdf6a6e1f0009 with negotiated timeout 20000 for client /140.211.11.196:29237
[junit4:junit4] 2> 8547 T3325 oaz.ClientCnxn$SendThread.onConnected Session establishment complete on server localhost/127.0.0.1:29221, sessionid = 0x13bdf6a6e1f0009, negotiated timeout = 20000
[junit4:junit4] 2> 8548 T3326 oascc.ConnectionManager.process Watcher org.apache.solr.common.cloud.ConnectionManager@52838e14 name:ZooKeeperConnection Watcher:127.0.0.1:29221 got event WatchedEvent state:SyncConnected type:None path:null path:null type:None
[junit4:junit4] 2> 8548 T3256 oascc.ConnectionManager.waitForConnected Client is connected to ZooKeeper
[junit4:junit4] 2> 8549 T3261 oazs.PrepRequestProcessor.pRequest2Txn Processed session termination for sessionid: 0x13bdf6a6e1f0009
[junit4:junit4] 2> 8550 T3326 oaz.ClientCnxn$EventThread.run EventThread shut down
[junit4:junit4] 2> 8550 T3256 oaz.ZooKeeper.close Session: 0x13bdf6a6e1f0009 closed
[junit4:junit4] 2> 8550 T3258 oazs.NIOServerCnxn.closeSock Closed socket connection for client /140.211.11.196:29237 which had sessionid 0x13bdf6a6e1f0009
[junit4:junit4] 2> 8550 T3256 oascsi.HttpClientUtil.createClient Creating new http client, config:maxConnections=500&maxConnectionsPerHost=16&socketTimeout=15000&connTimeout=30000
[junit4:junit4] 2> 8561 T3256 oaz.ZooKeeper.<init> Initiating client connection, connectString=127.0.0.1:29221/solr sessionTimeout=30000 watcher=org.apache.solr.common.cloud.ConnectionManager@66db51b
[junit4:junit4] 2> 8562 T3256 oascc.ConnectionManager.waitForConnected Waiting for client to connect to ZooKeeper
[junit4:junit4] 2> 8563 T3327 oaz.ClientCnxn$SendThread.logStartConnect Opening socket connection to server localhost/127.0.0.1:29221. Will not attempt to authenticate using SASL (access denied (javax.security.auth.AuthPermission getLoginConfiguration))
[junit4:junit4] 2> 8563 T3327 oaz.ClientCnxn$SendThread.primeConnection Socket connection established to localhost/127.0.0.1:29221, initiating session
[junit4:junit4] 2> 8563 T3258 oazs.NIOServerCnxnFactory.run Accepted socket connection from /140.211.11.196:29238
[junit4:junit4] 2> 8564 T3258 oazs.ZooKeeperServer.processConnectRequest Client attempting to establish new session at /140.211.11.196:29238
[junit4:junit4] 2> 8565 T3260 oazs.ZooKeeperServer.finishSessionInit Established session 0x13bdf6a6e1f000a with negotiated timeout 20000 for client /140.211.11.196:29238
[junit4:junit4] 2> 8565 T3327 oaz.ClientCnxn$SendThread.onConnected Session establishment complete on server localhost/127.0.0.1:29221, sessionid = 0x13bdf6a6e1f000a, negotiated timeout = 20000
[junit4:junit4] 2> 8566 T3328 oascc.ConnectionManager.process Watcher org.apache.solr.common.cloud.ConnectionManager@66db51b name:ZooKeeperConnection Watcher:127.0.0.1:29221/solr got event WatchedEvent state:SyncConnected type:None path:null path:null type:None
[junit4:junit4] 2> 8566 T3256 oascc.ConnectionManager.waitForConnected Client is connected to ZooKeeper
[junit4:junit4] 2> 8567 T3261 oazs.PrepRequestProcessor.pRequest Got user-level KeeperException when processing sessionid:0x13bdf6a6e1f000a type:create cxid:0x1 zxid:0x84 txntype:-1 reqpath:n/a Error Path:/solr/overseer Error:KeeperErrorCode = NodeExists for /solr/overseer
[junit4:junit4] 2> 8569 T3261 oazs.PrepRequestProcessor.pRequest Got user-level KeeperException when processing sessionid:0x13bdf6a6e1f000a type:create cxid:0x2 zxid:0x85 txntype:-1 reqpath:n/a Error Path:/solr/overseer Error:KeeperErrorCode = NodeExists for /solr/overseer
[junit4:junit4] 2> 8578 T3256 oasc.ZkController.createEphemeralLiveNode Register node as live in ZooKeeper:/live_nodes/127.0.0.1:29236_
[junit4:junit4] 2> 8578 T3261 oazs.PrepRequestProcessor.pRequest Got user-level KeeperException when processing sessionid:0x13bdf6a6e1f000a type:delete cxid:0x4 zxid:0x86 txntype:-1 reqpath:n/a Error Path:/solr/live_nodes/127.0.0.1:29236_ Error:KeeperErrorCode = NoNode for /solr/live_nodes/127.0.0.1:29236_
[junit4:junit4] 2> 8579 T3256 oascc.SolrZkClient.makePath makePath: /live_nodes/127.0.0.1:29236_
[junit4:junit4] 2> 8582 T3284 oascc.ZkStateReader$2.process A cluster state change: WatchedEvent state:SyncConnected type:NodeChildrenChanged path:/live_nodes, has occurred - updating... (live nodes size: 3)
[junit4:junit4] 2> 8582 T3312 oascc.ZkStateReader$2.process A cluster state change: WatchedEvent state:SyncConnected type:NodeChildrenChanged path:/live_nodes, has occurred - updating... (live nodes size: 3)
[junit4:junit4] 2> 8582 T3278 oascc.ZkStateReader$3.process Updating live nodes... (4)
[junit4:junit4] 2> 8582 T3297 oascc.ZkStateReader$3.process Updating live nodes... (4)
[junit4:junit4] 2> 8583 T3278 oascc.ZkStateReader$2.process A cluster state change: WatchedEvent state:SyncConnected type:NodeChildrenChanged path:/live_nodes, has occurred - updating... (live nodes size: 4)
[junit4:junit4] 2> 8583 T3297 oascc.ZkStateReader$2.process A cluster state change: WatchedEvent state:SyncConnected type:NodeChildrenChanged path:/live_nodes, has occurred - updating... (live nodes size: 4)
[junit4:junit4] 2> 8583 T3284 oascc.ZkStateReader$3.process Updating live nodes... (4)
[junit4:junit4] 2> 8584 T3312 oascc.ZkStateReader$3.process Updating live nodes... (4)
[junit4:junit4] 2> 8585 T3256 oascc.ZkStateReader.createClusterStateWatchersAndUpdate Updating cluster state from ZooKeeper...
[junit4:junit4] 2> 8592 T3329 oasc.CoreContainer.create Creating SolrCore 'collection1' using instanceDir: /usr/home/hudson/hudson-slave/workspace/Lucene-Solr-Tests-trunk-Java6/solr/build/solr-core/test/J1/./org.apache.solr.cloud.SyncSliceTest-jetty3-1356663000658/collection1
[junit4:junit4] 2> 8592 T3329 oasc.ZkController.createCollectionZkNode Check for collection zkNode:collection1
[junit4:junit4] 2> 8593 T3329 oasc.ZkController.createCollectionZkNode Collection zkNode exists
[junit4:junit4] 2> 8593 T3329 oasc.ZkController.readConfigName Load collection config from:/collections/collection1
[junit4:junit4] 2> 8594 T3329 oasc.SolrResourceLoader.<init> new SolrResourceLoader for directory: '/usr/home/hudson/hudson-slave/workspace/Lucene-Solr-Tests-trunk-Java6/solr/build/solr-core/test/J1/./org.apache.solr.cloud.SyncSliceTest-jetty3-1356663000658/collection1/'
[junit4:junit4] 2> 8595 T3329 oasc.SolrResourceLoader.replaceClassLoader Adding 'file:/usr/home/hudson/hudson-slave/workspace/Lucene-Solr-Tests-trunk-Java6/solr/build/solr-core/test/J1/org.apache.solr.cloud.SyncSliceTest-jetty3-1356663000658/collection1/lib/classes/' to classloader
[junit4:junit4] 2> 8596 T3329 oasc.SolrResourceLoader.replaceClassLoader Adding 'file:/usr/home/hudson/hudson-slave/workspace/Lucene-Solr-Tests-trunk-Java6/solr/build/solr-core/test/J1/org.apache.solr.cloud.SyncSliceTest-jetty3-1356663000658/collection1/lib/README' to classloader
[junit4:junit4] 2> 8648 T3329 oasc.SolrConfig.<init> Using Lucene MatchVersion: LUCENE_50
[junit4:junit4] 2> 8718 T3329 oasc.SolrConfig.<init> Loaded SolrConfig: solrconfig.xml
[junit4:junit4] 2> 8819 T3329 oass.IndexSchema.readSchema Reading Solr Schema
[junit4:junit4] 2> 8826 T3329 oass.IndexSchema.readSchema Schema name=test
[junit4:junit4] 2> 9318 T3329 oass.OpenExchangeRatesOrgProvider.init Initialized with rates=open-exchange-rates.json, refreshInterval=1440.
[junit4:junit4] 2> 9327 T3329 oass.IndexSchema.readSchema default search field in schema is text
[junit4:junit4] 2> 9330 T3329 oass.IndexSchema.readSchema unique key field: id
[junit4:junit4] 2> 9340 T3329 oass.FileExchangeRateProvider.reload Reloading exchange rates from file currency.xml
[junit4:junit4] 2> 9343 T3329 oass.FileExchangeRateProvider.reload Reloading exchange rates from file currency.xml
[junit4:junit4] 2> 9347 T3329 oass.OpenExchangeRatesOrgProvider.reload Reloading exchange rates from open-exchange-rates.json
[junit4:junit4] 2> 9347 T3329 oass.OpenExchangeRatesOrgProvider.reload Reloading exchange rates from open-exchange-rates.json
[junit4:junit4] 2> 9348 T3329 oasc.SolrCore.<init> [collection1] Opening new SolrCore at /usr/home/hudson/hudson-slave/workspace/Lucene-Solr-Tests-trunk-Java6/solr/build/solr-core/test/J1/./org.apache.solr.cloud.SyncSliceTest-jetty3-1356663000658/collection1/, dataDir=./org.apache.solr.cloud.SyncSliceTest-1356662992407/jetty3/
[junit4:junit4] 2> 9349 T3329 oasc.JmxMonitoredMap.<init> JMX monitoring is enabled. Adding Solr mbeans to JMX Server: com.sun.jmx.mbeanserver.JmxMBeanServer@4513e9fd
[junit4:junit4] 2> 9349 T3329 oasc.SolrCore.initDirectoryFactory solr.StandardDirectoryFactory
[junit4:junit4] 2> 9350 T3329 oasc.CachingDirectoryFactory.get return new directory for /usr/home/hudson/hudson-slave/workspace/Lucene-Solr-Tests-trunk-Java6/solr/build/solr-core/test/J1/./org.apache.solr.cloud.SyncSliceTest-1356662992407/jetty3 forceNew:false
[junit4:junit4] 2> 9350 T3329 oasc.CachingDirectoryFactory.close Releasing directory:/usr/home/hudson/hudson-slave/workspace/Lucene-Solr-Tests-trunk-Java6/solr/build/solr-core/test/J1/./org.apache.solr.cloud.SyncSliceTest-1356662992407/jetty3
[junit4:junit4] 2> 9350 T3329 oasc.SolrCore.getNewIndexDir New index directory detected: old=null new=./org.apache.solr.cloud.SyncSliceTest-1356662992407/jetty3/index/
[junit4:junit4] 2> 9351 T3329 oasc.SolrCore.initIndex WARNING [collection1] Solr index directory './org.apache.solr.cloud.SyncSliceTest-1356662992407/jetty3/index' doesn't exist. Creating new index...
[junit4:junit4] 2> 9351 T3329 oasc.CachingDirectoryFactory.get return new directory for /usr/home/hudson/hudson-slave/workspace/Lucene-Solr-Tests-trunk-Java6/solr/build/solr-core/test/J1/./org.apache.solr.cloud.SyncSliceTest-1356662992407/jetty3/index forceNew:false
[junit4:junit4] 2> 9355 T3329 oasc.SolrDeletionPolicy.onCommit SolrDeletionPolicy.onCommit: commits:num=1
[junit4:junit4] 2> commit{dir=RateLimitedDirectoryWrapper(org.apache.lucene.store.NIOFSDirectory@/usr/home/hudson/hudson-slave/workspace/Lucene-Solr-Tests-trunk-Java6/solr/build/solr-core/test/J1/org.apache.solr.cloud.SyncSliceTest-1356662992407/jetty3/index lockFactory=org.apache.lucene.store.NativeFSLockFactory@7d0a6cbc),segFN=segments_1,generation=1,filenames=[segments_1]
[junit4:junit4] 2> 9356 T3329 oasc.SolrDeletionPolicy.updateCommits newest commit = 1[segments_1]
[junit4:junit4] 2> 9356 T3329 oasc.CachingDirectoryFactory.close Releasing directory:/usr/home/hudson/hudson-slave/workspace/Lucene-Solr-Tests-trunk-Java6/solr/build/solr-core/test/J1/./org.apache.solr.cloud.SyncSliceTest-1356662992407/jetty3/index
[junit4:junit4] 2> 9356 T3329 oasc.SolrCore.initWriters created xml: solr.XMLResponseWriter
[junit4:junit4] 2> 9358 T3329 oasup.UpdateRequestProcessorChain.init inserting DistributedUpdateProcessorFactory into updateRequestProcessorChain "dedupe"
[junit4:junit4] 2> 9358 T3329 oasup.UpdateRequestProcessorChain.init inserting DistributedUpdateProcessorFactory into updateRequestProcessorChain "dedupe-allfields"
[junit4:junit4] 2> 9358 T3329 oasup.UpdateRequestProcessorChain.init inserting DistributedUpdateProcessorFactory into updateRequestProcessorChain "stored_sig"
[junit4:junit4] 2> 9359 T3329 oasup.UpdateRequestProcessorChain.init inserting DistributedUpdateProcessorFactory into updateRequestProcessorChain "uniq-fields"
[junit4:junit4] 2> 9359 T3329 oasup.UpdateRequestProcessorChain.init inserting DistributedUpdateProcessorFactory into updateRequestProcessorChain "distrib-dup-test-chain-implicit"
[junit4:junit4] 2> 9359 T3329 oasc.RequestHandlers.initHandlersFromConfig adding lazy requestHandler: solr.ReplicationHandler
[junit4:junit4] 2> 9359 T3329 oasc.RequestHandlers.initHandlersFromConfig created /replication: solr.ReplicationHandler
[junit4:junit4] 2> 9360 T3329 oasc.RequestHandlers.initHandlersFromConfig created standard: solr.StandardRequestHandler
[junit4:junit4] 2> 9360 T3329 oasc.RequestHandlers.initHandlersFromConfig created /get: solr.RealTimeGetHandler
[junit4:junit4] 2> 9360 T3329 oasc.RequestHandlers.initHandlersFromConfig created dismax: solr.SearchHandler
[junit4:junit4] 2> 9361 T3329 oasc.RequestHandlers.initHandlersFromConfig created mock: org.apache.solr.core.MockQuerySenderListenerReqHandler
[junit4:junit4] 2> 9361 T3329 oasc.RequestHandlers.initHandlersFromConfig created /admin/: org.apache.solr.handler.admin.AdminHandlers
[junit4:junit4] 2> 9361 T3329 oasc.RequestHandlers.initHandlersFromConfig created defaults: solr.StandardRequestHandler
[junit4:junit4] 2> 9362 T3329 oasc.RequestHandlers.initHandlersFromConfig adding lazy requestHandler: solr.StandardRequestHandler
[junit4:junit4] 2> 9362 T3329 oasc.RequestHandlers.initHandlersFromConfig created lazy: solr.StandardRequestHandler
[junit4:junit4] 2> 9362 T3329 oasc.RequestHandlers.initHandlersFromConfig created /update: solr.UpdateRequestHandler
[junit4:junit4] 2> 9362 T3329 oasc.RequestHandlers.initHandlersFromConfig created /terms: org.apache.solr.handler.component.SearchHandler
[junit4:junit4] 2> 9363 T3329 oasc.RequestHandlers.initHandlersFromConfig created spellCheckCompRH: org.apache.solr.handler.component.SearchHandler
[junit4:junit4] 2> 9363 T3329 oasc.RequestHandlers.initHandlersFromConfig created spellCheckCompRH_Direct: org.apache.solr.handler.component.SearchHandler
[junit4:junit4] 2> 9363 T3329 oasc.RequestHandlers.initHandlersFromConfig created spellCheckWithWordbreak: org.apache.solr.handler.component.SearchHandler
[junit4:junit4] 2> 9364 T3329 oasc.RequestHandlers.initHandlersFromConfig created spellCheckWithWordbreak_Direct: org.apache.solr.handler.component.SearchHandler
[junit4:junit4] 2> 9364 T3329 oasc.RequestHandlers.initHandlersFromConfig created spellCheckCompRH1: org.apache.solr.handler.component.SearchHandler
[junit4:junit4] 2> 9364 T3329 oasc.RequestHandlers.initHandlersFromConfig created mltrh: org.apache.solr.handler.component.SearchHandler
[junit4:junit4] 2> 9365 T3329 oasc.RequestHandlers.initHandlersFromConfig created tvrh: org.apache.solr.handler.component.SearchHandler
[junit4:junit4] 2> 9365 T3329 oasc.RequestHandlers.initHandlersFromConfig created /mlt: solr.MoreLikeThisHandler
[junit4:junit4] 2> 9365 T3329 oasc.RequestHandlers.initHandlersFromConfig created /debug/dump: solr.DumpRequestHandler
[junit4:junit4] 2> 9371 T3329 oashl.XMLLoader.init xsltCacheLifetimeSeconds=60
[junit4:junit4] 2> 9374 T3329 oasc.SolrCore.initDeprecatedSupport WARNING solrconfig.xml uses deprecated <admin/gettableFiles>, Please update your config to use the ShowFileRequestHandler.
[junit4:junit4] 2> 9375 T3329 oasc.SolrCore.initDeprecatedSupport WARNING adding ShowFileRequestHandler with hidden files: [SCHEMA.XML, OLD_SYNONYMS.TXT, STOPWORDS.TXT, PROTWORDS.TXT, OPEN-EXCHANGE-RATES.JSON, SYNONYMS.TXT, CURRENCY.XML, MAPPING-ISOLATIN1ACCENT.TXT]
[junit4:junit4] 2> 9377 T3329 oasc.CachingDirectoryFactory.close Releasing directory:/usr/home/hudson/hudson-slave/workspace/Lucene-Solr-Tests-trunk-Java6/solr/build/solr-core/test/J1/./org.apache.solr.cloud.SyncSliceTest-1356662992407/jetty3
[junit4:junit4] 2> 9378 T3329 oass.SolrIndexSearcher.<init> Opening Searcher@4ca441fc main
[junit4:junit4] 2> 9379 T3329 oasu.CommitTracker.<init> Hard AutoCommit: disabled
[junit4:junit4] 2> 9379 T3329 oasu.CommitTracker.<init> Soft AutoCommit: disabled
[junit4:junit4] 2> 9379 T3329 oashc.SpellCheckComponent.inform Initializing spell checkers
[junit4:junit4] 2> 9384 T3329 oass.DirectSolrSpellChecker.init init: {name=direct,classname=DirectSolrSpellChecker,field=lowerfilt,minQueryLength=3}
[junit4:junit4] 2> 9429 T3330 oasc.SolrCore.registerSearcher [collection1] Registered new searcher Searcher@4ca441fc main{StandardDirectoryReader(segments_1:1)}
[junit4:junit4] 2> 9433 T3329 oasc.ZkController.publish publishing core=collection1 state=down
[junit4:junit4] 2> 9433 T3329 oasc.ZkController.publish numShards not found on descriptor - reading it from system property
[junit4:junit4] 2> 9444 T3279 oascc.ZkStateReader.updateClusterState Updating cloud state from ZooKeeper...
[junit4:junit4] 2> 9445 T3279 oasc.Overseer$ClusterStateUpdater.updateState Update state numShards=1 message={
[junit4:junit4] 2> "operation":"state",
[junit4:junit4] 2> "numShards":"1",
[junit4:junit4] 2> "shard":null,
[junit4:junit4] 2> "roles":null,
[junit4:junit4] 2> "state":"down",
[junit4:junit4] 2> "core":"collection1",
[junit4:junit4] 2> "collection":"collection1",
[junit4:junit4] 2> "node_name":"127.0.0.1:29236_",
[junit4:junit4] 2> "base_url":"http://127.0.0.1:29236"}
[junit4:junit4] 2> 9445 T3279 oasc.Overseer$ClusterStateUpdater.updateState Collection already exists with numShards=1
[junit4:junit4] 2> 9445 T3279 oasc.Overseer$ClusterStateUpdater.updateState Assigning new node to shard shard=shard1
[junit4:junit4] 2> 9448 T3284 oascc.ZkStateReader$2.process A cluster state change: WatchedEvent state:SyncConnected type:NodeDataChanged path:/clusterstate.json, has occurred - updating... (live nodes size: 4)
[junit4:junit4] 2> 9448 T3328 oascc.ZkStateReader$2.process A cluster state change: WatchedEvent state:SyncConnected type:NodeDataChanged path:/clusterstate.json, has occurred - updating... (live nodes size: 4)
[junit4:junit4] 2> 9448 T3297 oascc.ZkStateReader$2.process A cluster state change: WatchedEvent state:SyncConnected type:NodeDataChanged path:/clusterstate.json, has occurred - updating... (live nodes size: 4)
[junit4:junit4] 2> 9448 T3312 oascc.ZkStateReader$2.process A cluster state change: WatchedEvent state:SyncConnected type:NodeDataChanged path:/clusterstate.json, has occurred - updating... (live nodes size: 4)
[junit4:junit4] 2> 9448 T3278 oascc.ZkStateReader$2.process A cluster state change: WatchedEvent state:SyncConnected type:NodeDataChanged path:/clusterstate.json, has occurred - updating... (live nodes size: 4)
[junit4:junit4] 2> 10436 T3329 oasc.CoreContainer.registerCore registering core: collection1
[junit4:junit4] 2> 10436 T3329 oasc.ZkController.register Register replica - core:collection1 address:http://127.0.0.1:29236 collection:collection1 shard:shard1
[junit4:junit4] 2> 10440 T3329 oasc.ZkController.register We are http://127.0.0.1:29236/collection1/ and leader is http://127.0.0.1:29228/collection1/
[junit4:junit4] 2> 10440 T3329 oasc.ZkController.register No LogReplay needed for core=collection1 baseURL=http://127.0.0.1:29236
[junit4:junit4] 2> 10440 T3329 oasc.ZkController.checkRecovery Core needs to recover:collection1
[junit4:junit4] 2> 10441 T3329 oasu.DefaultSolrCoreState.doRecovery Running recovery - first canceling any ongoing recovery
[junit4:junit4] 2> ASYNC NEW_CORE C181 name=collection1 org.apache.solr.core.SolrCore@7c560ff4 url=http://127.0.0.1:29236/collection1 node=127.0.0.1:29236_ C181_STATE=coll:collection1 core:collection1 props:{shard=null, roles=null, state=down, core=collection1, collection=collection1, node_name=127.0.0.1:29236_, base_url=http://127.0.0.1:29236}
[junit4:junit4] 2> 10441 T3331 C181 P29236 oasc.RecoveryStrategy.run Starting recovery process. core=collection1 recoveringAfterStartup=true
[junit4:junit4] 2> 10441 T3329 oascc.ZkStateReader.updateClusterState Updating cloud state from ZooKeeper...
[junit4:junit4] 2> 10442 T3331 C181 P29236 oasc.RecoveryStrategy.doRecovery ###### startupVersions=[]
[junit4:junit4] 2> 10442 T3331 C181 P29236 oasc.ZkController.publish publishing core=collection1 state=recovering
[junit4:junit4] 2> 10443 T3331 C181 P29236 oasc.ZkController.publish numShards not found on descriptor - reading it from system property
[junit4:junit4] 2> 10443 T3256 oass.SolrDispatchFilter.init user.dir=/usr/home/hudson/hudson-slave/workspace/Lucene-Solr-Tests-trunk-Java6/solr/build/solr-core/test/J1
[junit4:junit4] 2> 10443 T3256 oass.SolrDispatchFilter.init SolrDispatchFilter.init() done
[junit4:junit4] 2> 10444 T3256 oascsi.HttpClientUtil.createClient Creating new http client, config:maxConnections=128&maxConnectionsPerHost=32&followRedirects=false
[junit4:junit4] 2> 10444 T3331 C181 P29236 oascsi.HttpClientUtil.createClient Creating new http client, config:maxConnections=128&maxConnectionsPerHost=32&followRedirects=false
[junit4:junit4] 2> 10454 T3279 oascc.ZkStateReader.updateClusterState Updating cloud state from ZooKeeper...
[junit4:junit4] 2> 10454 T3279 oasc.Overseer$ClusterStateUpdater.updateState Update state numShards=1 message={
[junit4:junit4] 2> "operation":"state",
[junit4:junit4] 2> "numShards":"1",
[junit4:junit4] 2> "shard":"shard1",
[junit4:junit4] 2> "roles":null,
[junit4:junit4] 2> "state":"recovering",
[junit4:junit4] 2> "core":"collection1",
[junit4:junit4] 2> "collection":"collection1",
[junit4:junit4] 2> "node_name":"127.0.0.1:29236_",
[junit4:junit4] 2> "base_url":"http://127.0.0.1:29236"}
[junit4:junit4] 2> 10458 T3328 oascc.ZkStateReader$2.process A cluster state change: WatchedEvent state:SyncConnected type:NodeDataChanged path:/clusterstate.json, has occurred - updating... (live nodes size: 4)
[junit4:junit4] 2> 10458 T3312 oascc.ZkStateReader$2.process A cluster state change: WatchedEvent state:SyncConnected type:NodeDataChanged path:/clusterstate.json, has occurred - updating... (live nodes size: 4)
[junit4:junit4] 2> 10458 T3284 oascc.ZkStateReader$2.process A cluster state change: WatchedEvent state:SyncConnected type:NodeDataChanged path:/clusterstate.json, has occurred - updating... (live nodes size: 4)
[junit4:junit4] 2> 10458 T3278 oascc.ZkStateReader$2.process A cluster state change: WatchedEvent state:SyncConnected type:NodeDataChanged path:/clusterstate.json, has occurred - updating... (live nodes size: 4)
[junit4:junit4] 2> 10458 T3297 oascc.ZkStateReader$2.process A cluster state change: WatchedEvent state:SyncConnected type:NodeDataChanged path:/clusterstate.json, has occurred - updating... (live nodes size: 4)
[junit4:junit4] 2> 10560 T3256 oejs.Server.doStart jetty-8.1.8.v20121106
[junit4:junit4] 2> 10562 T3256 oejs.AbstractConnector.doStart Started SocketConnector@127.0.0.1:29244
[junit4:junit4] 2> 10563 T3256 oasc.SolrResourceLoader.locateSolrHome JNDI not configured for solr (NoInitialContextEx)
[junit4:junit4] 2> 10563 T3256 oasc.SolrResourceLoader.locateSolrHome using system property solr.solr.home: /usr/home/hudson/hudson-slave/workspace/Lucene-Solr-Tests-trunk-Java6/solr/build/solr-core/test/J1/./org.apache.solr.cloud.SyncSliceTest-jetty4-1356663002860
[junit4:junit4] 2> 10563 T3256 oasc.SolrResourceLoader.<init> new SolrResourceLoader for deduced Solr Home: '/usr/home/hudson/hudson-slave/workspace/Lucene-Solr-Tests-trunk-Java6/solr/build/solr-core/test/J1/./org.apache.solr.cloud.SyncSliceTest-jetty4-1356663002860/'
[junit4:junit4] 2> 10591 T3256 oass.SolrDispatchFilter.init SolrDispatchFilter.init()
[junit4:junit4] 2> 10592 T3256 oasc.SolrResourceLoader.locateSolrHome JNDI not configured for solr (NoInitialContextEx)
[junit4:junit4] 2> 10592 T3256 oasc.SolrResourceLoader.locateSolrHome using system property solr.solr.home: /usr/home/hudson/hudson-slave/workspace/Lucene-Solr-Tests-trunk-Java6/solr/build/solr-core/test/J1/./org.apache.solr.cloud.SyncSliceTest-jetty4-1356663002860
[junit4:junit4] 2> 10592 T3256 oasc.CoreContainer$Initializer.initialize looking for solr.xml: /usr/home/hudson/hudson-slave/workspace/Lucene-Solr-Tests-trunk-Java6/solr/build/solr-core/test/J1/./org.apache.solr.cloud.SyncSliceTest-jetty4-1356663002860/solr.xml
[junit4:junit4] 2> 10593 T3256 oasc.CoreContainer.<init> New CoreContainer 959801440
[junit4:junit4] 2> 10593 T3256 oasc.CoreContainer.load Loading CoreContainer using Solr Home: '/usr/home/hudson/hudson-slave/workspace/Lucene-Solr-Tests-trunk-Java6/solr/build/solr-core/test/J1/./org.apache.solr.cloud.SyncSliceTest-jetty4-1356663002860/'
[junit4:junit4] 2> 10593 T3256 oasc.SolrResourceLoader.<init> new SolrResourceLoader for directory: '/usr/home/hudson/hudson-slave/workspace/Lucene-Solr-Tests-trunk-Java6/solr/build/solr-core/test/J1/./org.apache.solr.cloud.SyncSliceTest-jetty4-1356663002860/'
[junit4:junit4] 2> 10609 T3256 oashc.HttpShardHandlerFactory.getParameter Setting socketTimeout to: 30000
[junit4:junit4] 2> 10610 T3256 oashc.HttpShardHandlerFactory.getParameter Setting urlScheme to: http://
[junit4:junit4] 2> 10610 T3256 oashc.HttpShardHandlerFactory.getParameter Setting connTimeout to: 15000
[junit4:junit4] 2> 10610 T3256 oashc.HttpShardHandlerFactory.getParameter Setting maxConnectionsPerHost to: 20
[junit4:junit4] 2> 10611 T3256 oashc.HttpShardHandlerFactory.getParameter Setting corePoolSize to: 0
[junit4:junit4] 2> 10611 T3256 oashc.HttpShardHandlerFactory.getParameter Setting maximumPoolSize to: 2147483647
[junit4:junit4] 2> 10612 T3256 oashc.HttpShardHandlerFactory.getParameter Setting maxThreadIdleTime to: 5
[junit4:junit4] 2> 10612 T3256 oashc.HttpShardHandlerFactory.getParameter Setting sizeOfQueue to: -1
[junit4:junit4] 2> 10612 T3256 oashc.HttpShardHandlerFactory.getParameter Setting fairnessPolicy to: false
[junit4:junit4] 2> 10613 T3256 oascsi.HttpClientUtil.createClient Creating new http client, config:maxConnectionsPerHost=20&maxConnections=10000&socketTimeout=30000&connTimeout=15000&retry=false
[junit4:junit4] 2> 10632 T3256 oasc.CoreContainer.load Registering Log Listener
[junit4:junit4] 2> 10645 T3256 oasc.CoreContainer.initZooKeeper Zookeeper client=127.0.0.1:29221/solr
[junit4:junit4] 2> 10645 T3256 oasc.ZkController.checkChrootPath zkHost includes chroot
[junit4:junit4] 2> 10646 T3256 oaz.ZooKeeper.<init> Initiating client connection, connectString=127.0.0.1:29221 sessionTimeout=60000 watcher=org.apache.solr.common.cloud.ConnectionManager@40983a17
[junit4:junit4] 2> 10646 T3256 oascc.ConnectionManager.waitForConnected Waiting for client to connect to ZooKeeper
[junit4:junit4] 2> 10647 T3341 oaz.ClientCnxn$SendThread.logStartConnect Opening socket connection to server localhost/127.0.0.1:29221. Will not attempt to authenticate using SASL (access denied (javax.security.auth.AuthPermission getLoginConfiguration))
[junit4:junit4] 2> 10647 T3341 oaz.ClientCnxn$SendThread.primeConnection Socket connection established to localhost/127.0.0.1:29221, initiating session
[junit4:junit4] 2> 10648 T3258 oazs.NIOServerCnxnFactory.run Accepted socket connection from /140.211.11.196:29245
[junit4:junit4] 2> 10648 T3258 oazs.ZooKeeperServer.processConnectRequest Client attempting to establish new session at /140.211.11.196:29245
[junit4:junit4] 2> 10650 T3260 oazs.ZooKeeperServer.finishSessionInit Established session 0x13bdf6a6e1f000b with negotiated timeout 20000 for client /140.211.11.196:29245
[junit4:junit4] 2> 10650 T3341 oaz.ClientCnxn$SendThread.onConnected Session establishment complete on server localhost/127.0.0.1:29221, sessionid = 0x13bdf6a6e1f000b, negotiated timeout = 20000
[junit4:junit4] 2> 10650 T3342 oascc.ConnectionManager.process Watcher org.apache.solr.common.cloud.ConnectionManager@40983a17 name:ZooKeeperConnection Watcher:127.0.0.1:29221 got event WatchedEvent state:SyncConnected type:None path:null path:null type:None
[junit4:junit4] 2> 10651 T3256 oascc.ConnectionManager.waitForConnected Client is connected to ZooKeeper
[junit4:junit4] 2> 10652 T3261 oazs.PrepRequestProcessor.pRequest2Txn Processed session termination for sessionid: 0x13bdf6a6e1f000b
[junit4:junit4] 2> 10664 T3342 oaz.ClientCnxn$EventThread.run EventThread shut down
[junit4:junit4] 2> 10664 T3256 oaz.ZooKeeper.close Session: 0x13bdf6a6e1f000b closed
[junit4:junit4] 2> 10664 T3258 oazs.NIOServerCnxn.closeSock Closed socket connection for client /140.211.11.196:29245 which had sessionid 0x13bdf6a6e1f000b
[junit4:junit4] 2> 10665 T3256 oascsi.HttpClientUtil.createClient Creating new http client, config:maxConnections=500&maxConnectionsPerHost=16&socketTimeout=15000&connTimeout=30000
[junit4:junit4] 2> 10672 T3256 oaz.ZooKeeper.<init> Initiating client connection, connectString=127.0.0.1:29221/solr sessionTimeout=30000 watcher=org.apache.solr.common.cloud.ConnectionManager@4d814e3c
[junit4:junit4] 2> 10672 T3256 oascc.ConnectionManager.waitForConnected Waiting for client to connect to ZooKeeper
[junit4:junit4] 2> 10673 T3343 oaz.ClientCnxn$SendThread.logStartConnect Opening socket connection to server localhost/127.0.0.1:29221. Will not attempt to authenticate using SASL (access denied (javax.security.auth.AuthPermission getLoginConfiguration))
[junit4:junit4] 2> 10673 T3343 oaz.ClientCnxn$SendThread.primeConnection Socket connection established to localhost/127.0.0.1:29221, initiating session
[junit4:junit4] 2> 10673 T3258 oazs.NIOServerCnxnFactory.run Accepted socket connection from /140.211.11.196:29246
[junit4:junit4] 2> 10674 T3258 oazs.ZooKeeperServer.processConnectRequest Client attempting to establish new session at /140.211.11.196:29246
[junit4:junit4] 2> 10675 T3260 oazs.ZooKeeperServer.finishSessionInit Established session 0x13bdf6a6e1f000c with negotiated timeout 20000 for client /140.211.11.196:29246
[junit4:junit4] 2> 10675 T3343 oaz.ClientCnxn$SendThread.onConnected Session establishment complete on server localhost/127.0.0.1:29221, sessionid = 0x13bdf6a6e1f000c, negotiated timeout = 20000
[junit4:junit4] 2> 10675 T3344 oascc.ConnectionManager.process Watcher org.apache.solr.common.cloud.ConnectionManager@4d814e3c name:ZooKeeperConnection Watcher:127.0.0.1:29221/solr got event WatchedEvent state:SyncConnected type:None path:null path:null type:None
[junit4:junit4] 2> 10676 T3256 oascc.ConnectionManager.waitForConnected Client is connected to ZooKeeper
[junit4:junit4] 2> 10676 T3261 oazs.PrepRequestProcessor.pRequest Got user-level KeeperException when processing sessionid:0x13bdf6a6e1f000c type:create cxid:0x1 zxid:0x97 txntype:-1 reqpath:n/a Error Path:/solr/overseer Error:KeeperErrorCode = NodeExists for /solr/overseer
[junit4:junit4] 2> 10678 T3261 oazs.PrepRequestProcessor.pRequest Got user-level KeeperException when processing sessionid:0x13bdf6a6e1f000c type:create cxid:0x2 zxid:0x98 txntype:-1 reqpath:n/a Error Path:/solr/overseer Error:KeeperErrorCode = NodeExists for /solr/overseer
[junit4:junit4] 2> 10685 T3256 oasc.ZkController.createEphemeralLiveNode Register node as live in ZooKeeper:/live_nodes/127.0.0.1:29244_
[junit4:junit4] 2> 10686 T3261 oazs.PrepRequestProcessor.pRequest Got user-level KeeperException when processing sessionid:0x13bdf6a6e1f000c type:delete cxid:0x4 zxid:0x99 txntype:-1 reqpath:n/a Error Path:/solr/live_nodes/127.0.0.1:29244_ Error:KeeperErrorCode = NoNode for /solr/live_nodes/127.0.0.1:29244_
[junit4:junit4] 2> 10687 T3256 oascc.SolrZkClient.makePath makePath: /live_nodes/127.0.0.1:29244_
[junit4:junit4] 2> 10689 T3328 oascc.ZkStateReader$2.process A cluster state change: WatchedEvent state:SyncConnected type:NodeChildrenChanged path:/live_nodes, has occurred - updating... (live nodes size: 4)
[junit4:junit4] 2> 10689 T3284 oascc.ZkStateReader$2.process A cluster state change: WatchedEvent state:SyncConnected type:NodeChildrenChanged path:/live_nodes, has occurred - updating... (live nodes size: 4)
[junit4:junit4] 2> 10689 T3312 oascc.ZkStateReader$2.process A cluster state change: WatchedEvent state:SyncConnected type:NodeChildrenChanged path:/live_nodes, has occurred - updating... (live nodes size: 4)
[junit4:junit4] 2> 10689 T3278 oascc.ZkStateReader$3.process Updating live nodes... (5)
[junit4:junit4] 2> 10689 T3297 oascc.ZkStateReader$3.process Updating live nodes... (5)
[junit4:junit4] 2> 10690 T3278 oascc.ZkStateReader$2.process A cluster state change: WatchedEvent state:SyncConnected type:NodeChildrenChanged path:/live_nodes, has occurred - updating... (live nodes size: 5)
[junit4:junit4] 2> 10690 T3297 oascc.ZkStateReader$2.process A cluster state change: WatchedEvent state:SyncConnected type:NodeChildrenChanged path:/live_nodes, has occurred - updating... (live nodes size: 5)
[junit4:junit4] 2> 10691 T3284 oascc.ZkStateReader$3.process Updating live nodes... (5)
[junit4:junit4] 2> 10691 T3328 oascc.ZkStateReader$3.process Updating live nodes... (5)
[junit4:junit4] 2> 10691 T3312 oascc.ZkStateReader$3.process Updating live nodes... (5)
[junit4:junit4] 2> 10697 T3256 oascc.ZkStateReader.createClusterStateWatchersAndUpdate Updating cluster state from ZooKeeper...
[junit4:junit4] 2> 10702 T3345 oasc.CoreContainer.create Creating SolrCore 'collection1' using instanceDir: /usr/home/hudson/hudson-slave/workspace/Lucene-Solr-Tests-trunk-Java6/solr/build/solr-core/test/J1/./org.apache.solr.cloud.SyncSliceTest-jetty4-1356663002860/collection1
[junit4:junit4] 2> 10702 T3345 oasc.ZkController.createCollectionZkNode Check for collection zkNode:collection1
[junit4:junit4] 2> 10703 T3345 oasc.ZkController.createCollectionZkNode Collection zkNode exists
[junit4:junit4] 2> 10703 T3345 oasc.ZkController.readConfigName Load collection config from:/collections/collection1
[junit4:junit4] 2> 10705 T3345 oasc.SolrResourceLoader.<init> new SolrResourceLoader for directory: '/usr/home/hudson/hudson-slave/workspace/Lucene-Solr-Tests-trunk-Java6/solr/build/solr-core/test/J1/./org.apache.solr.cloud.SyncSliceTest-jetty4-1356663002860/collection1/'
[junit4:junit4] 2> 10706 T3345 oasc.SolrResourceLoader.replaceClassLoader Adding 'file:/usr/home/hudson/hudson-slave/workspace/Lucene-Solr-Tests-trunk-Java6/solr/build/solr-core/test/J1/org.apache.solr.cloud.SyncSliceTest-jetty4-1356663002860/collection1/lib/classes/' to classloader
[junit4:junit4] 2> 10706 T3345 oasc.SolrResourceLoader.replaceClassLoader Adding 'file:/usr/home/hudson/hudson-slave/workspace/Lucene-Solr-Tests-trunk-Java6/solr/build/solr-core/test/J1/org.apache.solr.cloud.SyncSliceTest-jetty4-1356663002860/collection1/lib/README' to classloader
[junit4:junit4] 2> 10760 T3345 oasc.SolrConfig.<init> Using Lucene MatchVersion: LUCENE_50
[junit4:junit4] 2> 10835 T3345 oasc.SolrConfig.<init> Loaded SolrConfig: solrconfig.xml
[junit4:junit4] 2> 10935 T3345 oass.IndexSchema.readSchema Reading Solr Schema
[junit4:junit4] 2> 10942 T3345 oass.IndexSchema.readSchema Schema name=test
[junit4:junit4] 2> C180_STATE=coll:collection1 core:collection1 props:{shard=shard1, roles=null, state=recovering, core=collection1, collection=collection1, node_name=127.0.0.1:29231_, base_url=http://127.0.0.1:29231}
[junit4:junit4] 2> 11258 T3315 C180 P29231 oasc.RecoveryStrategy.doRecovery Attempting to PeerSync from http://127.0.0.1:29228/collection1/ core=collection1 - recoveringAfterStartup=true
[junit4:junit4] 2> 11258 T3315 C180 P29231 oasu.PeerSync.sync PeerSync: core=collection1 url=http://127.0.0.1:29231 START replicas=[http://127.0.0.1:29228/collection1/] nUpdates=100
[junit4:junit4] 2> 11259 T3315 C180 P29231 oasu.PeerSync.sync WARNING no frame of reference to tell of we've missed updates
[junit4:junit4] 2> 11259 T3315 C180 P29231 oasc.RecoveryStrategy.doRecovery PeerSync Recovery was not successful - trying replication. core=collection1
[junit4:junit4] 2> 11259 T3315 C180 P29231 oasc.RecoveryStrategy.doRecovery Starting Replication Recovery. core=collection1
[junit4:junit4] 2> 11259 T3315 C180 P29231 oasc.RecoveryStrategy.doRecovery Begin buffering updates. core=collection1
[junit4:junit4] 2> 11260 T3315 C180 P29231 oasu.UpdateLog.bufferUpdates Starting to buffer updates. FSUpdateLog{state=ACTIVE, tlog=null}
[junit4:junit4] 2> 11260 T3315 C180 P29231 oasc.RecoveryStrategy.replicate Attempting to replicate from http://127.0.0.1:29228/collection1/. core=collection1
[junit4:junit4] 2> 11260 T3315 C180 P29231 oascsi.HttpClientUtil.createClient Creating new http client, config:maxConnections=128&maxConnectionsPerHost=32&followRedirects=false
[junit4:junit4] 2> ASYNC NEW_CORE C182 name=collection1 org.apache.solr.core.SolrCore@20fc9a06 url=http://127.0.0.1:29228/collection1 node=127.0.0.1:29228_ C182_STATE=coll:collection1 core:collection1 props:{shard=shard1, roles=null, state=active, core=collection1, collection=collection1, node_name=127.0.0.1:29228_, base_url=http://127.0.0.1:29228, leader=true}
[junit4:junit4] 2> 11266 T3289 C182 P29228 REQ /get {distrib=false&qt=/get&wt=javabin&version=2&getVersions=100} status=0 QTime=0
[junit4:junit4] 2> 11289 T3290 C182 P29228 oasu.DirectUpdateHandler2.commit start commit{flags=0,_version_=0,optimize=false,openSearcher=false,waitSearcher=true,expungeDeletes=false,softCommit=false}
[junit4:junit4] 2> 11291 T3290 C182 P29228 oasc.CachingDirectoryFactory.close Releasing directory:/usr/home/hudson/hudson-slave/workspace/Lucene-Solr-Tests-trunk-Java6/solr/build/solr-core/test/J1/./org.apache.solr.cloud.SyncSliceTest-1356662992407/jetty1
[junit4:junit4] 2> 11295 T3290 C182 P29228 oasc.SolrDeletionPolicy.onInit SolrDeletionPolicy.onInit: commits:num=1
[junit4:junit4] 2> commit{dir=RateLimitedDirectoryWrapper(org.apache.lucene.store.NIOFSDirectory@/usr/home/hudson/hudson-slave/workspace/Lucene-Solr-Tests-trunk-Java6/solr/build/solr-core/test/J1/org.apache.solr.cloud.SyncSliceTest-1356662992407/jetty1/index lockFactory=org.apache.lucene.store.NativeFSLockFactory@20d1604a),segFN=segments_1,generation=1,filenames=[segments_1]
[junit4:junit4] 2> 11296 T3290 C182 P29228 oasc.SolrDeletionPolicy.updateCommits newest commit = 1[segments_1]
[junit4:junit4] 2> 11301 T3290 C182 P29228 oasc.SolrDeletionPolicy.onCommit SolrDeletionPolicy.onCommit: commits:num=2
[junit4:junit4] 2> commit{dir=RateLimitedDirectoryWrapper(org.apache.lucene.store.NIOFSDirectory@/usr/home/hudson/hudson-slave/workspace/Lucene-Solr-Tests-trunk-Java6/solr/build/solr-core/test/J1/org.apache.solr.cloud.SyncSliceTest-1356662992407/jetty1/index lockFactory=org.apache.lucene.store.NativeFSLockFactory@20d1604a),segFN=segments_1,generation=1,filenames=[segments_1]
[junit4:junit4] 2> commit{dir=RateLimitedDirectoryWrapper(org.apache.lucene.store.NIOFSDirectory@/usr/home/hudson/hudson-slave/workspace/Lucene-Solr-Tests-trunk-Java6/solr/build/solr-core/test/J1/org.apache.solr.cloud.SyncSliceTest-1356662992407/jetty1/index lockFactory=org.apache.lucene.store.NativeFSLockFactory@20d1604a),segFN=segments_2,generation=2,filenames=[segments_2]
[junit4:junit4] 2> 11301 T3290 C182 P29228 oasc.SolrDeletionPolicy.updateCommits newest commit = 2[segments_2]
[junit4:junit4] 2> 11303 T3290 C182 P29228 oasc.CachingDirectoryFactory.close Releasing directory:/usr/home/hudson/hudson-slave/workspace/Lucene-Solr-Tests-trunk-Java6/solr/build/solr-core/test/J1/./org.apache.solr.cloud.SyncSliceTest-1356662992407/jetty1
[junit4:junit4] 2> 11303 T3290 C182 P29228 oass.SolrIndexSearcher.<init> Opening Searcher@7fad8844 realtime
[junit4:junit4] 2> 11304 T3290 C182 P29228 oasu.DirectUpdateHandler2.commit end_commit_flush
[junit4:junit4] 2> 11304 T3290 C182 P29228 /update {waitSearcher=true&openSearcher=false&commit=true&commit_end_point=true&wt=javabin&softCommit=false&version=2} {commit=} 0 15
[junit4:junit4] 2> 11305 T3315 C180 P29231 oash.ReplicationHandler.inform Commits will be reserved for 10000
[junit4:junit4] 2> 11305 T3315 C180 P29231 oash.SnapPuller.<init> No value set for 'pollInterval'. Timer Task not started.
[junit4:junit4] 2> 11307 T3291 C182 P29228 oash.ReplicationHandler.inform Commits will be reserved for 10000
[junit4:junit4] 2> 11308 T3291 C182 P29228 REQ /replication {command=indexversion&wt=javabin&qt=/replication&version=2} status=0 QTime=1
[junit4:junit4] 2> 11309 T3315 C180 P29231 oash.SnapPuller.fetchLatestIndex Master's generation: 2
[junit4:junit4] 2> 11309 T3315 C180 P29231 oash.SnapPuller.fetchLatestIndex Slave's generation: 1
[junit4:junit4] 2> 11309 T3315 C180 P29231 oash.SnapPuller.fetchLatestIndex Starting replication process
[junit4:junit4] 2> 11311 T3291 C182 P29228 oasc.CachingDirectoryFactory.close Releasing directory:/usr/home/hudson/hudson-slave/workspace/Lucene-Solr-Tests-trunk-Java6/solr/build/solr-core/test/J1/./org.apache.solr.cloud.SyncSliceTest-1356662992407/jetty1
[junit4:junit4] 2> 11313 T3291 C182 P29228 oasc.CachingDirectoryFactory.close Releasing directory:/usr/home/hudson/hudson-slave/workspace/Lucene-Solr-Tests-trunk-Java6/solr/build/solr-core/test/J1/./org.apache.solr.cloud.SyncSliceTest-1356662992407/jetty1/index
[junit4:junit4] 2> 11313 T3291 C182 P29228 REQ /replication {command=filelist&generation=2&wt=javabin&qt=/replication&version=2} status=0 QTime=2
[junit4:junit4] 2> 11314 T3315 C180 P29231 oash.SnapPuller.fetchLatestIndex Number of files in latest index in master: 1
[junit4:junit4] 2> 11315 T3315 C180 P29231 oasc.CachingDirectoryFactory.get return new directory for /usr/home/hudson/hudson-slave/workspace/Lucene-Solr-Tests-trunk-Java6/solr/build/solr-core/test/J1/./org.apache.solr.cloud.SyncSliceTest-1356662992407/jetty2/index.20121228125003717 forceNew:false
[junit4:junit4] 2> 11316 T3315 C180 P29231 oasc.CachingDirectoryFactory.close Releasing directory:/usr/home/hudson/hudson-slave/workspace/Lucene-Solr-Tests-trunk-Java6/solr/build/solr-core/test/J1/./org.apache.solr.cloud.SyncSliceTest-1356662992407/jetty2
[junit4:junit4] 2> 11317 T3315 C180 P29231 oash.SnapPuller.fetchLatestIndex Starting download to RateLimitedDirectoryWrapper(org.apache.lucene.store.NIOFSDirectory@/usr/home/hudson/hudson-slave/workspace/Lucene-Solr-Tests-trunk-Java6/solr/build/solr-core/test/J1/org.apache.solr.cloud.SyncSliceTest-1356662992407/jetty2/index.20121228125003717 lockFactory=org.apache.lucene.store.NativeFSLockFactory@43565f06) fullCopy=true
[junit4:junit4] 2> 11320 T3291 C182 P29228 REQ /replication {file=segments_2&command=filecontent&checksum=true&generation=2&qt=/replication&wt=filestream} status=0 QTime=0
[junit4:junit4] 2> 11322 T3315 C180 P29231 oasc.CachingDirectoryFactory.close Releasing directory:/usr/home/hudson/hudson-slave/workspace/Lucene-Solr-Tests-trunk-Java6/solr/build/solr-core/test/J1/./org.apache.solr.cloud.SyncSliceTest-1356662992407/jetty2/index
[junit4:junit4] 2> 11323 T3315 C180 P29231 oash.SnapPuller.fetchLatestIndex Total time taken for download : 0 secs
[junit4:junit4] 2> 11323 T3315 C180 P29231 oash.SnapPuller.modifyIndexProps New index installed. Updating index properties... index=index.20121228125003717
[junit4:junit4] 2> 11324 T3315 C180 P29231 oasc.CachingDirectoryFactory.close Releasing directory:/usr/home/hudson/hudson-slave/workspace/Lucene-Solr-Tests-trunk-Java6/solr/build/solr-core/test/J1/./org.apache.solr.cloud.SyncSliceTest-1356662992407/jetty2
[junit4:junit4] 2> 11325 T3315 C180 P29231 oasc.CachingDirectoryFactory.close Releasing directory:/usr/home/hudson/hudson-slave/workspace/Lucene-Solr-Tests-trunk-Java6/solr/build/solr-core/test/J1/./org.apache.solr.cloud.SyncSliceTest-1356662992407/jetty2
[junit4:junit4] 2> 11325 T3315 C180 P29231 oasc.SolrCore.getNewIndexDir New index directory detected: old=./org.apache.solr.cloud.SyncSliceTest-1356662992407/jetty2/index/ new=./org.apache.solr.cloud.SyncSliceTest-1356662992407/jetty2/index.20121228125003717
[junit4:junit4] 2> 11329 T3315 C180 P29231 oasc.SolrDeletionPolicy.onInit SolrDeletionPolicy.onInit: commits:num=1
[junit4:junit4] 2> commit{dir=RateLimitedDirectoryWrapper(org.apache.lucene.store.NIOFSDirectory@/usr/home/hudson/hudson-slave/workspace/Lucene-Solr-Tests-trunk-Java6/solr/build/solr-core/test/J1/org.apache.solr.cloud.SyncSliceTest-1356662992407/jetty2/index.20121228125003717 lockFactory=org.apache.lucene.store.NativeFSLockFactory@43565f06),segFN=segments_2,generation=2,filenames=[segments_2]
[junit4:junit4] 2> 11329 T3315 C180 P29231 oasc.SolrDeletionPolicy.updateCommits newest commit = 2[segments_2]
[junit4:junit4] 2> 11331 T3315 C180 P29231 oasc.CachingDirectoryFactory.close Releasing directory:/usr/home/hudson/hudson-slave/workspace/Lucene-Solr-Tests-trunk-Java6/solr/build/solr-core/test/J1/./org.apache.solr.cloud.SyncSliceTest-1356662992407/jetty2
[junit4:junit4] 2> 11331 T3315 C180 P29231 oasu.DefaultSolrCoreState.newIndexWriter Creating new IndexWriter...
[junit4:junit4] 2> 11331 T3315 C180 P29231 oasu.DefaultSolrCoreState.newIndexWriter Waiting until IndexWriter is unused... core=collection1
[junit4:junit4] 2> 11331 T3315 C180 P29231 oasu.DefaultSolrCoreState.newIndexWriter Rollback old IndexWriter... core=collection1
[junit4:junit4] 2> 11332 T3315 C180 P29231 oasc.CachingDirectoryFactory.close Releasing directory:/usr/home/hudson/hudson-slave/workspace/Lucene-Solr-Tests-trunk-Java6/solr/build/solr-core/test/J1/./org.apache.solr.cloud.SyncSliceTest-1356662992407/jetty2/index.20121228125003717
[junit4:junit4] 2> 11333 T3315 C180 P29231 oasc.CachingDirectoryFactory.close Releasing directory:/usr/home/hudson/hudson-slave/workspace/Lucene-Solr-Tests-trunk-Java6/solr/build/solr-core/test/J1/./org.apache.solr.cloud.SyncSliceTest-1356662992407/jetty2
[junit4:junit4] 2> 11336 T3315 C180 P29231 oasc.SolrDeletionPolicy.onInit SolrDeletionPolicy.onInit: commits:num=1
[junit4:junit4] 2> commit{dir=RateLimitedDirectoryWrapper(org.apache.lucene.store.NIOFSDirectory@/usr/home/hudson/hudson-slave/workspace/Lucene-Solr-Tests-trunk-Java6/solr/build/solr-core/test/J1/org.apache.solr.cloud.SyncSliceTest-1356662992407/jetty2/index.20121228125003717 lockFactory=org.apache.lucene.store.NativeFSLockFactory@43565f06),segFN=segments_2,generation=2,filenames=[segments_2]
[junit4:junit4] 2> 11337 T3315 C180 P29231 oasc.SolrDeletionPolicy.updateCommits newest commit = 2[segments_2]
[junit4:junit4] 2> 11337 T3315 C180 P29231 oasu.DefaultSolrCoreState.newIndexWriter New IndexWriter is ready to be used.
[junit4:junit4] 2> 11337 T3315 C180 P29231 oasc.CachingDirectoryFactory.close Releasing directory:/usr/home/hudson/hudson-slave/workspace/Lucene-Solr-Tests-trunk-Java6/solr/build/solr-core/test/J1/./org.apache.solr.cloud.SyncSliceTest-1356662992407/jetty2
[junit4:junit4] 2> 11338 T3315 C180 P29231 oass.SolrIndexSearcher.<init> Opening Searcher@3bde7a09 main
[junit4:junit4] 2> 11339 T3314 oasc.SolrCore.registerSearcher [collection1] Registered new searcher Searcher@3bde7a09 main{StandardDirectoryReader(segments_2:1:nrt)}
[junit4:junit4] 2> 11340 T3314 oasc.CachingDirectoryFactory.close Releasing directory:/usr/home/hudson/hudson-slave/workspace/Lucene-Solr-Tests-trunk-Java6/solr/build/solr-core/test/J1/./org.apache.solr.cloud.SyncSliceTest-1356662992407/jetty2/index
[junit4:junit4] 2> 11340 T3315 C180 P29231 oasu.DirectUpdateHandler2.commit start commit{flags=0,_version_=0,optimize=false,openSearcher=false,waitSearcher=false,expungeDeletes=false,softCommit=false}
[junit4:junit4] 2> 11343 T3315 C180 P29231 oasc.SolrDeletionPolicy.onCommit SolrDeletionPolicy.onCommit: commits:num=2
[junit4:junit4] 2> commit{dir=RateLimitedDirectoryWrapper(org.apache.lucene.store.NIOFSDirectory@/usr/home/hudson/hudson-slave/workspace/Lucene-Solr-Tests-trunk-Java6/solr/build/solr-core/test/J1/org.apache.solr.cloud.SyncSliceTest-1356662992407/jetty2/index.20121228125003717 lockFactory=org.apache.lucene.store.NativeFSLockFactory@43565f06),segFN=segments_2,generation=2,filenames=[segments_2]
[junit4:junit4] 2> commit{dir=RateLimitedDirectoryWrapper(org.apache.lucene.store.NIOFSDirectory@/usr/home/hudson/hudson-slave/workspace/Lucene-Solr-Tests-trunk-Java6/solr/build/solr-core/test/J1/org.apache.solr.cloud.SyncSliceTest-1356662992407/jetty2/index.20121228125003717 lockFactory=org.apache.lucene.store.NativeFSLockFactory@43565f06),segFN=segments_3,generation=3,filenames=[segments_3]
[junit4:junit4] 2> 11343 T3315 C180 P29231 oasc.SolrDeletionPolicy.updateCommits newest commit = 3[segments_3]
[junit4:junit4] 2> 11344 T3315 C180 P29231 oasc.CachingDirectoryFactory.close Releasing directory:/usr/home/hudson/hudson-slave/workspace/Lucene-Solr-Tests-trunk-Java6/solr/build/solr-core/test/J1/./org.apache.solr.cloud.SyncSliceTest-1356662992407/jetty2
[junit4:junit4] 2> 11345 T3315 C180 P29231 oasu.DirectUpdateHandler2.commit end_commit_flush
[junit4:junit4] 2> 11345 T3315 C180 P29231 oasc.CachingDirectoryFactory.close Releasing directory:/usr/home/hudson/hudson-slave/workspace/Lucene-Solr-Tests-trunk-Java6/solr/build/solr-core/test/J1/./org.apache.solr.cloud.SyncSliceTest-1356662992407/jetty2/index.20121228125003717
[junit4:junit4] 2> 11345 T3315 C180 P29231 oasc.CachingDirectoryFactory.close Releasing directory:/usr/home/hudson/hudson-slave/workspace/Lucene-Solr-Tests-trunk-Java6/solr/build/solr-core/test/J1/./org.apache.solr.cloud.SyncSliceTest-1356662992407/jetty2/index
[junit4:junit4] 2> 11345 T3315 C180 P29231 oasc.RecoveryStrategy.replay No replay needed. core=collection1
[junit4:junit4] 2> 11345 T3315 C180 P29231 oasc.RecoveryStrategy.doRecovery Replication Recovery was successful - registering as Active. core=collection1
[junit4:junit4] 2> 11346 T3315 C180 P29231 oasc.ZkController.publish publishing core=collection1 state=active
[junit4:junit4] 2> 11346 T3315 C180 P29231 oasc.ZkController.publish numShards not found on descriptor - reading it from system property
[junit4:junit4] 2> 11348 T3315 C180 P29231 oasc.RecoveryStrategy.doRecovery Finished recovery process. core=collection1
[junit4:junit4] 2> 11475 T3279 oascc.ZkStateReader.updateClusterState Updating cloud state from ZooKeeper...
[junit4:junit4] 2> 11476 T3279 oasc.Overseer$ClusterStateUpdater.updateState Update state numShards=1 message={
[junit4:junit4] 2> "operation":"state",
[junit4:junit4] 2> "numShards":"1",
[junit4:junit4] 2> "shard":"shard1",
[junit4:junit4] 2> "roles":null,
[junit4:junit4] 2> "state":"active",
[junit4:junit4] 2> "core":"collection1",
[junit4:junit4] 2> "collection":"collection1",
[junit4:junit4] 2> "node_name":"127.0.0.1:29231_",
[junit4:junit4] 2> "base_url":"http://127.0.0.1:29231"}
[junit4:junit4] 2> 11481 T3278 oascc.ZkStateReader$2.process A cluster state change: WatchedEvent state:SyncConnected type:NodeDataChanged path:/clusterstate.json, has occurred - updating... (live nodes size: 5)
[junit4:junit4] 2> 11481 T3284 oascc.ZkStateReader$2.process A cluster state change: WatchedEvent state:SyncConnected type:NodeDataChanged path:/clusterstate.json, has occurred - updating... (live nodes size: 5)
[junit4:junit4] 2> 11481 T3328 oascc.ZkStateReader$2.process A cluster state change: WatchedEvent state:SyncConnected type:NodeDataChanged path:/clusterstate.json, has occurred - updating... (live nodes size: 5)
[junit4:junit4] 2> 11481 T3312 oascc.ZkStateReader$2.process A cluster state change: WatchedEvent state:SyncConnected type:NodeDataChanged path:/clusterstate.json, has occurred - updating... (live nodes size: 5)
[junit4:junit4] 2> 11481 T3344 oascc.ZkStateReader$2.process A cluster state change: WatchedEvent state:SyncConnected type:NodeDataChanged path:/clusterstate.json, has occurred - updating... (live nodes size: 5)
[junit4:junit4] 2> 11481 T3297 oascc.ZkStateReader$2.process A cluster state change: WatchedEvent state:SyncConnected type:NodeDataChanged path:/clusterstate.json, has occurred - updating... (live nodes size: 5)
[junit4:junit4] 2> 11574 T3345 oass.OpenExchangeRatesOrgProvider.init Initialized with rates=open-exchange-rates.json, refreshInterval=1440.
[junit4:junit4] 2> 11583 T3345 oass.IndexSchema.readSchema default search field in schema is text
[junit4:junit4] 2> 11586 T3345 oass.IndexSchema.readSchema unique key field: id
[junit4:junit4] 2> 11594 T3345 oass.FileExchangeRateProvider.reload Reloading exchange rates from file currency.xml
[junit4:junit4] 2> 11602 T3345 oass.FileExchangeRateProvider.reload Reloading exchange rates from file currency.xml
[junit4:junit4] 2> 11605 T3345 oass.OpenExchangeRatesOrgProvider.reload Reloading exchange rates from open-exchange-rates.json
[junit4:junit4] 2> 11605 T3345 oass.OpenExchangeRatesOrgProvider.reload Reloading exchange rates from open-exchange-rates.json
[junit4:junit4] 2> 11606 T3345 oasc.SolrCore.<init> [collection1] Opening new SolrCore at /usr/home/hudson/hudson-slave/workspace/Lucene-Solr-Tests-trunk-Java6/solr/build/solr-core/test/J1/./org.apache.solr.cloud.SyncSliceTest-jetty4-1356663002860/collection1/, dataDir=./org.apache.solr.cloud.SyncSliceTest-1356662992407/jetty4/
[junit4:junit4] 2> 11607 T3345 oasc.JmxMonitoredMap.<init> JMX monitoring is enabled. Adding Solr mbeans to JMX Server: com.sun.jmx.mbeanserver.JmxMBeanServer@4513e9fd
[junit4:junit4] 2> 11607 T3345 oasc.SolrCore.initDirectoryFactory solr.StandardDirectoryFactory
[junit4:junit4] 2> 11607 T3345 oasc.CachingDirectoryFactory.get return new directory for /usr/home/hudson/hudson-slave/workspace/Lucene-Solr-Tests-trunk-Java6/solr/build/solr-core/test/J1/./org.apache.solr.cloud.SyncSliceTest-1356662992407/jetty4 forceNew:false
[junit4:junit4] 2> 11608 T3345 oasc.CachingDirectoryFactory.close Releasing directory:/usr/home/hudson/hudson-slave/workspace/Lucene-Solr-Tests-trunk-Java6/solr/build/solr-core/test/J1/./org.apache.solr.cloud.SyncSliceTest-1356662992407/jetty4
[junit4:junit4] 2> 11608 T3345 oasc.SolrCore.getNewIndexDir New index directory detected: old=null new=./org.apache.solr.cloud.SyncSliceTest-1356662992407/jetty4/index/
[junit4:junit4] 2> 11609 T3345 oasc.SolrCore.initIndex WARNING [collection1] Solr index directory './org.apache.solr.cloud.SyncSliceTest-1356662992407/jetty4/index' doesn't exist. Creating new index...
[junit4:junit4] 2> 11609 T3345 oasc.CachingDirectoryFactory.get return new directory for /usr/home/hudson/hudson-slave/workspace/Lucene-Solr-Tests-trunk-Java6/solr/build/solr-core/test/J1/./org.apache.solr.cloud.SyncSliceTest-1356662992407/jetty4/index forceNew:false
[junit4:junit4] 2> 11613 T3345 oasc.SolrDeletionPolicy.onCommit SolrDeletionPolicy.onCommit: commits:num=1
[junit4:junit4] 2> commit{dir=RateLimitedDirectoryWrapper(org.apache.lucene.store.NIOFSDirectory@/usr/home/hudson/hudson-slave/workspace/Lucene-Solr-Tests-trunk-Java6/solr/build/solr-core/test/J1/org.apache.solr.cloud.SyncSliceTest-1356662992407/jetty4/index lockFactory=org.apache.lucene.store.NativeFSLockFactory@665fcd1),segFN=segments_1,generation=1,filenames=[segments_1]
[junit4:junit4] 2> 11613 T3345 oasc.SolrDeletionPolicy.updateCommits newest commit = 1[segments_1]
[junit4:junit4] 2> 11613 T3345 oasc.CachingDirectoryFactory.close Releasing directory:/usr/home/hudson/hudson-slave/workspace/Lucene-Solr-Tests-trunk-Java6/solr/build/solr-core/test/J1/./org.apache.solr.cloud.SyncSliceTest-1356662992407/jetty4/index
[junit4:junit4] 2> 11614 T3345 oasc.SolrCore.initWriters created xml: solr.XMLResponseWriter
[junit4:junit4] 2> 11615 T3345 oasup.UpdateRequestProcessorChain.init inserting DistributedUpdateProcessorFactory into updateRequestProcessorChain "dedupe"
[junit4:junit4] 2> 11615 T3345 oasup.UpdateRequestProcessorChain.init inserting DistributedUpdateProcessorFactory into updateRequestProcessorChain "dedupe-allfields"
[junit4:junit4] 2> 11616 T3345 oasup.UpdateRequestProcessorChain.init inserting DistributedUpdateProcessorFactory into updateRequestProcessorChain "stored_sig"
[junit4:junit4] 2> 11616 T3345 oasup.UpdateRequestProcessorChain.init inserting DistributedUpdateProcessorFactory into updateRequestProcessorChain "uniq-fields"
[junit4:junit4] 2> 11616 T3345 oasup.UpdateRequestProcessorChain.init inserting DistributedUpdateProcessorFactory into updateRequestProcessorChain "distrib-dup-test-chain-implicit"
[junit4:junit4] 2> 11616 T3345 oasc.RequestHandlers.initHandlersFromConfig adding lazy requestHandler: solr.ReplicationHandler
[junit4:junit4] 2> 11617 T3345 oasc.RequestHandlers.initHandlersFromConfig created /replication: solr.ReplicationHandler
[junit4:junit4] 2> 11617 T3345 oasc.RequestHandlers.initHandlersFromConfig created standard: solr.StandardRequestHandler
[junit4:junit4] 2> 11617 T3345 oasc.RequestHandlers.initHandlersFromConfig created /get: solr.RealTimeGetHandler
[junit4:junit4] 2> 11618 T3345 oasc.RequestHandlers.initHandlersFromConfig created dismax: solr.SearchHandler
[junit4:junit4] 2> 11618 T3345 oasc.RequestHandlers.initHandlersFromConfig created mock: org.apache.solr.core.MockQuerySenderListenerReqHandler
[junit4:junit4] 2> 11618 T3345 oasc.RequestHandlers.initHandlersFromConfig created /admin/: org.apache.solr.handler.admin.AdminHandlers
[junit4:junit4] 2> 11619 T3345 oasc.RequestHandlers.initHandlersFromConfig created defaults: solr.StandardRequestHandler
[junit4:junit4] 2> 11619 T3345 oasc.RequestHandlers.initHandlersFromConfig adding lazy requestHandler: solr.StandardRequestHandler
[junit4:junit4] 2> 11619 T3345 oasc.RequestHandlers.initHandlersFromConfig created lazy: solr.StandardRequestHandler
[junit4:junit4] 2> 11620 T3345 oasc.RequestHandlers.initHandlersFromConfig created /update: solr.UpdateRequestHandler
[junit4:junit4] 2> 11620 T3345 oasc.RequestHandlers.initHandlersFromConfig created /terms: org.apache.solr.handler.component.SearchHandler
[junit4:junit4] 2> 11620 T3345 oasc.RequestHandlers.initHandlersFromConfig created spellCheckCompRH: org.apache.solr.handler.component.SearchHandler
[junit4:junit4] 2> 11620 T3345 oasc.RequestHandlers.initHandlersFromConfig created spellCheckCompRH_Direct: org.apache.solr.handler.component.SearchHandler
[junit4:junit4] 2> 11621 T3345 oasc.RequestHandlers.initHandlersFromConfig created spellCheckWithWordbreak: org.apache.solr.handler.component.SearchHandler
[junit4:junit4] 2> 11621 T3345 oasc.RequestHandlers.initHandlersFromConfig created spellCheckWithWordbreak_Direct: org.apache.solr.handler.component.SearchHandler
[junit4:junit4] 2> 11621 T3345 oasc.RequestHandlers.initHandlersFromConfig created spellCheckCompRH1: org.apache.solr.handler.component.SearchHandler
[junit4:junit4] 2> 11622 T3345 oasc.RequestHandlers.initHandlersFromConfig created mltrh: org.apache.solr.handler.component.SearchHandler
[junit4:junit4] 2> 11622 T3345 oasc.RequestHandlers.initHandlersFromConfig created tvrh: org.apache.solr.handler.component.SearchHandler
[junit4:junit4] 2> 11622 T3345 oasc.RequestHandlers.initHandlersFromConfig created /mlt: solr.MoreLikeThisHandler
[junit4:junit4] 2> 11623 T3345 oasc.RequestHandlers.initHandlersFromConfig created /debug/dump: solr.DumpRequestHandler
[junit4:junit4] 2> 11628 T3345 oashl.XMLLoader.init xsltCacheLifetimeSeconds=60
[junit4:junit4] 2> 11631 T3345 oasc.SolrCore.initDeprecatedSupport WARNING solrconfig.xml uses deprecated <admin/gettableFiles>, Please update your config to use the ShowFileRequestHandler.
[junit4:junit4] 2> 11632 T3345 oasc.SolrCore.initDeprecatedSupport WARNING adding ShowFileRequestHandler with hidden files: [SCHEMA.XML, OLD_SYNONYMS.TXT, STOPWORDS.TXT, PROTWORDS.TXT, OPEN-EXCHANGE-RATES.JSON, SYNONYMS.TXT, CURRENCY.XML, MAPPING-ISOLATIN1ACCENT.TXT]
[junit4:junit4] 2> 11634 T3345 oasc.CachingDirectoryFactory.close Releasing directory:/usr/home/hudson/hudson-slave/workspace/Lucene-Solr-Tests-trunk-Java6/solr/build/solr-core/test/J1/./org.apache.solr.cloud.SyncSliceTest-1356662992407/jetty4
[junit4:junit4] 2> 11635 T3345 oass.SolrIndexSearcher.<init> Opening Searcher@5458bc9e main
[junit4:junit4] 2> 11636 T3345 oasu.CommitTracker.<init> Hard AutoCommit: disabled
[junit4:junit4] 2> 11636 T3345 oasu.CommitTracker.<init> Soft AutoCommit: disabled
[junit4:junit4] 2> 11636 T3345 oashc.SpellCheckComponent.inform Initializing spell checkers
[junit4:junit4] 2> 11641 T3345 oass.DirectSolrSpellChecker.init init: {name=direct,classname=DirectSolrSpellChecker,field=lowerfilt,minQueryLength=3}
[junit4:junit4] 2> 11678 T3348 oasc.SolrCore.registerSearcher [collection1] Registered new searcher Searcher@5458bc9e main{StandardDirectoryReader(segments_1:1)}
[junit4:junit4] 2> 11680 T3345 oasc.ZkController.publish publishing core=collection1 state=down
[junit4:junit4] 2> 11681 T3345 oasc.ZkController.publish numShards not found on descriptor - reading it from system property
[junit4:junit4] 2> 11985 T3279 oascc.ZkStateReader.updateClusterState Updating cloud state from ZooKeeper...
[junit4:junit4] 2> 11986 T3279 oasc.Overseer$ClusterStateUpdater.updateState Update state numShards=1 message={
[junit4:junit4] 2> "operation":"state",
[junit4:junit4] 2> "numShards":"1",
[junit4:junit4] 2> "shard":null,
[junit4:junit4] 2> "roles":null,
[junit4:junit4] 2> "state":"down",
[junit4:junit4] 2> "core":"collection1",
[junit4:junit4] 2> "collection":"collection1",
[junit4:junit4] 2> "node_name":"127.0.0.1:29244_",
[junit4:junit4] 2> "base_url":"http://127.0.0.1:29244"}
[junit4:junit4] 2> 11986 T3279 oasc.Overseer$ClusterStateUpdater.updateState Collection already exists with numShards=1
[junit4:junit4] 2> 11986 T3279 oasc.Overseer$ClusterStateUpdater.updateState Assigning new node to shard shard=shard1
[junit4:junit4] 2> 11999 T3284 oascc.ZkStateReader$2.process A cluster state change: WatchedEvent state:SyncConnected type:NodeDataChanged path:/clusterstate.json, has occurred - updating... (live nodes size: 5)
[junit4:junit4] 2> 11999 T3344 oascc.ZkStateReader$2.process A cluster state change: WatchedEvent state:SyncConnected type:NodeDataChanged path:/clusterstate.json, has occurred - updating... (live nodes size: 5)
[junit4:junit4] 2> 11999 T3312 oascc.ZkStateReader$2.process A cluster state change: WatchedEvent state:SyncConnected type:NodeDataChanged path:/clusterstate.json, has occurred - updating... (live nodes size: 5)
[junit4:junit4] 2> 11999 T3297 oascc.ZkStateReader$2.process A cluster state change: WatchedEvent state:SyncConnected type:NodeDataChanged path:/clusterstate.json, has occurred - updating... (live nodes size: 5)
[junit4:junit4] 2> 11999 T3278 oascc.ZkStateReader$2.process A cluster state change: WatchedEvent state:SyncConnected type:NodeDataChanged path:/clusterstate.json, has occurred - updating... (live nodes size: 5)
[junit4:junit4] 2> 11999 T3328 oascc.ZkStateReader$2.process A cluster state change: WatchedEvent state:SyncConnected type:NodeDataChanged path:/clusterstate.json, has occurred - updating... (live nodes size: 5)
[junit4:junit4] 2> 12683 T3345 oasc.CoreContainer.registerCore registering core: collection1
[junit4:junit4] 2> 12683 T3345 oasc.ZkController.register Register replica - core:collection1 address:http://127.0.0.1:29244 collection:collection1 shard:shard1
[junit4:junit4] 2> 12711 T3345 oasc.ZkController.register We are http://127.0.0.1:29244/collection1/ and leader is http://127.0.0.1:29228/collection1/
[junit4:junit4] 2> 12711 T3345 oasc.ZkController.register No LogReplay needed for core=collection1 baseURL=http://127.0.0.1:29244
[junit4:junit4] 2> 12712 T3345 oasc.ZkController.checkRecovery Core needs to recover:collection1
[junit4:junit4] 2> 12712 T3345 oasu.DefaultSolrCoreState.doRecovery Running recovery - first canceling any ongoing recovery
[junit4:junit4] 2> ASYNC NEW_CORE C183 name=collection1 org.apache.solr.core.SolrCore@2e0aef0f url=http://127.0.0.1:29244/collection1 node=127.0.0.1:29244_ C183_STATE=coll:collection1 core:collection1 props:{shard=null, roles=null, state=down, core=collection1, collection=collection1, node_name=127.0.0.1:29244_, base_url=http://127.0.0.1:29244}
[junit4:junit4] 2> 12712 T3349 C183 P29244 oasc.RecoveryStrategy.run Starting recovery process. core=collection1 recoveringAfterStartup=true
[junit4:junit4] 2> 12713 T3345 oascc.ZkStateReader.updateClusterState Updating cloud state from ZooKeeper...
[junit4:junit4] 2> 12713 T3349 C183 P29244 oasc.RecoveryStrategy.doRecovery ###### startupVersions=[]
[junit4:junit4] 2> 12714 T3349 C183 P29244 oasc.ZkController.publish publishing core=collection1 state=recovering
[junit4:junit4] 2> 12714 T3349 C183 P29244 oasc.ZkController.publish numShards not found on descriptor - reading it from system property
[junit4:junit4] 2> 12714 T3256 oass.SolrDispatchFilter.init user.dir=/usr/home/hudson/hudson-slave/workspace/Lucene-Solr-Tests-trunk-Java6/solr/build/solr-core/test/J1
[junit4:junit4] 2> 12715 T3256 oass.SolrDispatchFilter.init SolrDispatchFilter.init() done
[junit4:junit4] 2> 12715 T3349 C183 P29244 oascsi.HttpClientUtil.createClient Creating new http client, config:maxConnections=128&maxConnectionsPerHost=32&followRedirects=false
[junit4:junit4] 2> 12715 T3256 oascsi.HttpClientUtil.createClient Creating new http client, config:maxConnections=128&maxConnectionsPerHost=32&followRedirects=false
[junit4:junit4] 2> 12729 T3256 oascc.ZkStateReader.updateClusterState Updating cloud state from ZooKeeper...
[junit4:junit4] 2> 12730 T3256 oasc.AbstractFullDistribZkTestBase.waitForThingsToLevelOut Wait for recoveries to finish - wait 15 for each attempt
[junit4:junit4] 2> 12730 T3256 oasc.AbstractDistribZkTestBase.waitForRecoveriesToFinish Wait for recoveries to finish - collection: collection1 failOnTimeout:true timeout (sec):15
[junit4:junit4] 2> 12731 T3256 oascc.ZkStateReader.updateClusterState Updating cloud state from ZooKeeper...
[junit4:junit4] 2> 13005 T3279 oascc.ZkStateReader.updateClusterState Updating cloud state from ZooKeeper...
[junit4:junit4] 2> 13006 T3279 oasc.Overseer$ClusterStateUpdater.updateState Update state numShards=1 message={
[junit4:junit4] 2> "operation":"state",
[junit4:junit4] 2> "numShards":"1",
[junit4:junit4] 2> "shard":"shard1",
[junit4:junit4] 2> "roles":null,
[junit4:junit4] 2> "state":"recovering",
[junit4:junit4] 2> "core":"collection1",
[junit4:junit4] 2> "collection":"collection1",
[junit4:junit4] 2> "node_name":"127.0.0.1:29244_",
[junit4:junit4] 2> "base_url":"http://127.0.0.1:29244"}
[junit4:junit4] 2> 13046 T3284 oascc.ZkStateReader$2.process A cluster state change: WatchedEvent state:SyncConnected type:NodeDataChanged path:/clusterstate.json, has occurred - updating... (live nodes size: 5)
[junit4:junit4] 2> 13046 T3344 oascc.ZkStateReader$2.process A cluster state change: WatchedEvent state:SyncConnected type:NodeDataChanged path:/clusterstate.json, has occurred - updating... (live nodes size: 5)
[junit4:junit4] 2> 13046 T3278 oascc.ZkStateReader$2.process A cluster state change: WatchedEvent state:SyncConnected type:NodeDataChanged path:/clusterstate.json, has occurred - updating... (live nodes size: 5)
[junit4:junit4] 2> 13046 T3297 oascc.ZkStateReader$2.process A cluster state change: WatchedEvent state:SyncConnected type:NodeDataChanged path:/clusterstate.json, has occurred - updating... (live nodes size: 5)
[junit4:junit4] 2> 13046 T3328 oascc.ZkStateReader$2.process A cluster state change: WatchedEvent state:SyncConnected type:NodeDataChanged path:/clusterstate.json, has occurred - updating... (live nodes size: 5)
[junit4:junit4] 2> 13046 T3312 oascc.ZkStateReader$2.process A cluster state change: WatchedEvent state:SyncConnected type:NodeDataChanged path:/clusterstate.json, has occurred - updating... (live nodes size: 5)
[junit4:junit4] 2> C181_STATE=coll:collection1 core:collection1 props:{shard=shard1, roles=null, state=recovering, core=collection1, collection=collection1, node_name=127.0.0.1:29236_, base_url=http://127.0.0.1:29236}
[junit4:junit4] 2> 13462 T3331 C181 P29236 oasc.RecoveryStrategy.doRecovery Attempting to PeerSync from http://127.0.0.1:29228/collection1/ core=collection1 - recoveringAfterStartup=true
[junit4:junit4] 2> 13462 T3331 C181 P29236 oasu.PeerSync.sync PeerSync: core=collection1 url=http://127.0.0.1:29236 START replicas=[http://127.0.0.1:29228/collection1/] nUpdates=100
[junit4:junit4] 2> 13463 T3331 C181 P29236 oasu.PeerSync.sync WARNING no frame of reference to tell of we've missed updates
[junit4:junit4] 2> 13463 T3331 C181 P29236 oasc.RecoveryStrategy.doRecovery PeerSync Recovery was not successful - trying replication. core=collection1
[junit4:junit4] 2> 13463 T3331 C181 P29236 oasc.RecoveryStrategy.doRecovery Starting Replication Recovery. core=collection1
[junit4:junit4] 2> 13463 T3331 C181 P29236 oasc.RecoveryStrategy.doRecovery Begin buffering updates. core=collection1
[junit4:junit4] 2> 13464 T3331 C181 P29236 oasu.UpdateLog.bufferUpdates Starting to buffer updates. FSUpdateLog{state=ACTIVE, tlog=null}
[junit4:junit4] 2> 13464 T3331 C181 P29236 oasc.RecoveryStrategy.replicate Attempting to replicate from http://127.0.0.1:29228/collection1/. core=collection1
[junit4:junit4] 2> 13464 T3331 C181 P29236 oascsi.HttpClientUtil.createClient Creating new http client, config:maxConnections=128&maxConnectionsPerHost=32&followRedirects=false
[junit4:junit4] 2> 13465 T3289 C182 P29228 REQ /get {distrib=false&qt=/get&wt=javabin&version=2&getVersions=100} status=0 QTime=0
[junit4:junit4] 2> 13474 T3293 C182 P29228 oasu.DirectUpdateHandler2.commit start commit{flags=0,_version_=0,optimize=false,openSearcher=false,waitSearcher=true,expungeDeletes=false,softCommit=false}
[junit4:junit4] 2> 13481 T3293 C182 P29228 oasc.SolrDeletionPolicy.onCommit SolrDeletionPolicy.onCommit: commits:num=2
[junit4:junit4] 2> commit{dir=RateLimitedDirectoryWrapper(org.apache.lucene.store.NIOFSDirectory@/usr/home/hudson/hudson-slave/workspace/Lucene-Solr-Tests-trunk-Java6/solr/build/solr-core/test/J1/org.apache.solr.cloud.SyncSliceTest-1356662992407/jetty1/index lockFactory=org.apache.lucene.store.NativeFSLockFactory@20d1604a),segFN=segments_2,generation=2,filenames=[segments_2]
[junit4:junit4] 2> commit{dir=RateLimitedDirectoryWrapper(org.apache.lucene.store.NIOFSDirectory@/usr/home/hudson/hudson-slave/workspace/Lucene-Solr-Tests-trunk-Java6/solr/build/solr-core/test/J1/org.apache.solr.cloud.SyncSliceTest-1356662992407/jetty1/index lockFactory=org.apache.lucene.store.NativeFSLockFactory@20d1604a),segFN=segments_3,generation=3,filenames=[segments_3]
[junit4:junit4] 2> 13481 T3293 C182 P29228 oasc.SolrDeletionPolicy.updateCommits newest commit = 3[segments_3]
[junit4:junit4] 2> 13482 T3293 C182 P29228 oasc.CachingDirectoryFactory.close Releasing directory:/usr/home/hudson/hudson-slave/workspace/Lucene-Solr-Tests-trunk-Java6/solr/build/solr-core/test/J1/./org.apache.solr.cloud.SyncSliceTest-1356662992407/jetty1
[junit4:junit4] 2> 13482 T3293 C182 P29228 oasu.DirectUpdateHandler2.commit end_commit_flush
[junit4:junit4] 2> 13482 T3293 C182 P29228 /update {waitSearcher=true&openSearcher=false&commit=true&commit_end_point=true&wt=javabin&softCommit=false&version=2} {commit=} 0 8
[junit4:junit4] 2> 13483 T3331 C181 P29236 oash.ReplicationHandler.inform Commits will be reserved for 10000
[junit4:junit4] 2> 13483 T3331 C181 P29236 oash.SnapPuller.<init> No value set for 'pollInterval'. Timer Task not started.
[junit4:junit4] 2> 13485 T3291 C182 P29228 REQ /replication {command=indexversion&wt=javabin&qt=/replication&version=2} status=0 QTime=0
[junit4:junit4] 2> 13485 T3331 C181 P29236 oash.SnapPuller.fetchLatestIndex Master's generation: 3
[junit4:junit4] 2> 13486 T3331 C181 P29236 oash.SnapPuller.fetchLatestIndex Slave's generation: 1
[junit4:junit4] 2> 13486 T3331 C181 P29236 oash.SnapPuller.fetchLatestIndex Starting replication process
[junit4:junit4] 2> 13488 T3291 C182 P29228 oasc.CachingDirectoryFactory.close Releasing directory:/usr/home/hudson/hudson-slave/workspace/Lucene-Solr-Tests-trunk-Java6/solr/build/solr-core/test/J1/./org.apache.solr.cloud.SyncSliceTest-1356662992407/jetty1
[junit4:junit4] 2> 13488 T3291 C182 P29228 oasc.CachingDirectoryFactory.close Releasing directory:/usr/home/hudson/hudson-slave/workspace/Lucene-Solr-Tests-trunk-Java6/solr/build/solr-core/test/J1/./org.apache.solr.cloud.SyncSliceTest-1356662992407/jetty1/index
[junit4:junit4] 2> 13489 T3291 C182 P29228 REQ /replication {command=filelist&generation=3&wt=javabin&qt=/replication&version=2} status=0 QTime=1
[junit4:junit4] 2> 13489 T3331 C181 P29236 oash.SnapPuller.fetchLatestIndex Number of files in latest index in master: 1
[junit4:junit4] 2> 13490 T3331 C181 P29236 oasc.CachingDirectoryFactory.get return new directory for /usr/home/hudson/hudson-slave/workspace/Lucene-Solr-Tests-trunk-Java6/solr/build/solr-core/test/J1/./org.apache.solr.cloud.SyncSliceTest-1356662992407/jetty3/index.20121228125005893 forceNew:false
[junit4:junit4] 2> 13491 T3331 C181 P29236 oasc.CachingDirectoryFactory.close Releasing directory:/usr/home/hudson/hudson-slave/workspace/Lucene-Solr-Tests-trunk-Java6/solr/build/solr-core/test/J1/./org.apache.solr.cloud.SyncSliceTest-1356662992407/jetty3
[junit4:junit4] 2> 13491 T3331 C181 P29236 oash.SnapPuller.fetchLatestIndex Starting download to RateLimitedDirectoryWrapper(org.apache.lucene.store.NIOFSDirectory@/usr/home/hudson/hudson-slave/workspace/Lucene-Solr-Tests-trunk-Java6/solr/build/solr-core/test/J1/org.apache.solr.cloud.SyncSliceTest-1356662992407/jetty3/index.20121228125005893 lockFactory=org.apache.lucene.store.NativeFSLockFactory@2fe257e2) fullCopy=true
[junit4:junit4] 2> 13495 T3291 C182 P29228 REQ /replication {file=segments_3&command=filecontent&checksum=true&generation=3&qt=/replication&wt=filestream} status=0 QTime=0
[junit4:junit4] 2> 13496 T3331 C181 P29236 oasc.CachingDirectoryFactory.close Releasing directory:/usr/home/hudson/hudson-slave/workspace/Lucene-Solr-Tests-trunk-Java6/solr/build/solr-core/test/J1/./org.apache.solr.cloud.SyncSliceTest-1356662992407/jetty3/index
[junit4:junit4] 2> 13496 T3331 C181 P29236 oash.SnapPuller.fetchLatestIndex Total time taken for download : 0 secs
[junit4:junit4] 2> 13497 T3331 C181 P29236 oash.SnapPuller.modifyIndexProps New index installed. Updating index properties... index=index.20121228125005893
[junit4:junit4] 2> 13497 T3331 C181 P29236 oasc.CachingDirectoryFactory.close Releasing directory:/usr/home/hudson/hudson-slave/workspace/Lucene-Solr-Tests-trunk-Java6/solr/build/solr-core/test/J1/./org.apache.solr.cloud.SyncSliceTest-1356662992407/jetty3
[junit4:junit4] 2> 13498 T3331 C181 P29236 oasc.CachingDirectoryFactory.close Releasing directory:/usr/home/hudson/hudson-slave/workspace/Lucene-Solr-Tests-trunk-Java6/solr/build/solr-core/test/J1/./org.apache.solr.cloud.SyncSliceTest-1356662992407/jetty3
[junit4:junit4] 2> 13498 T3331 C181 P29236 oasc.SolrCore.getNewIndexDir New index directory detected: old=./org.apache.solr.cloud.SyncSliceTest-1356662992407/jetty3/index/ new=./org.apache.solr.cloud.SyncSliceTest-1356662992407/jetty3/index.20121228125005893
[junit4:junit4] 2> 13500 T3331 C181 P29236 oasc.SolrDeletionPolicy.onInit SolrDeletionPolicy.onInit: commits:num=1
[junit4:junit4] 2> commit{dir=RateLimitedDirectoryWrapper(org.apache.lucene.store.NIOFSDirectory@/usr/home/hudson/hudson-slave/workspace/Lucene-Solr-Tests-trunk-Java6/solr/build/solr-core/test/J1/org.apache.solr.cloud.SyncSliceTest-1356662992407/jetty3/index.20121228125005893 lockFactory=org.apache.lucene.store.NativeFSLockFactory@2fe257e2),segFN=segments_3,generation=3,filenames=[segments_3]
[junit4:junit4] 2> 13501 T3331 C181 P29236 oasc.SolrDeletionPolicy.updateCommits newest commit = 3[segments_3]
[junit4:junit4] 2> 13502 T3331 C181 P29236 oasc.CachingDirectoryFactory.close Releasing directory:/usr/home/hudson/hudson-slave/workspace/Lucene-Solr-Tests-trunk-Java6/solr/build/solr-core/test/J1/./org.apache.solr.cloud.SyncSliceTest-1356662992407/jetty3
[junit4:junit4] 2> 13502 T3331 C181 P29236 oasu.DefaultSolrCoreState.newIndexWriter Creating new IndexWriter...
[junit4:junit4] 2> 13502 T3331 C181 P29236 oasu.DefaultSolrCoreState.newIndexWriter Waiting until IndexWriter is unused... core=collection1
[junit4:junit4] 2> 13502 T3331 C181 P29236 oasu.DefaultSolrCoreState.newIndexWriter Rollback old IndexWriter... core=collection1
[junit4:junit4] 2> 13503 T3331 C181 P29236 oasc.CachingDirectoryFactory.close Releasing directory:/usr/home/hudson/hudson-slave/workspace/Lucene-Solr-Tests-trunk-Java6/solr/build/solr-core/test/J1/./org.apache.solr.cloud.SyncSliceTest-1356662992407/jetty3/index.20121228125005893
[junit4:junit4] 2> 13503 T3331 C181 P29236 oasc.CachingDirectoryFactory.close Releasing directory:/usr/home/hudson/hudson-slave/workspace/Lucene-Solr-Tests-trunk-Java6/solr/build/solr-core/test/J1/./org.apache.solr.cloud.SyncSliceTest-1356662992407/jetty3
[junit4:junit4] 2> 13505 T3331 C181 P29236 oasc.SolrDeletionPolicy.onInit SolrDeletionPolicy.onInit: commits:num=1
[junit4:junit4] 2> commit{dir=RateLimitedDirectoryWrapper(org.apache.lucene.store.NIOFSDirectory@/usr/home/hudson/hudson-slave/workspace/Lucene-Solr-Tests-trunk-Java6/solr/build/solr-core/test/J1/org.apache.solr.cloud.SyncSliceTest-1356662992407/jetty3/index.20121228125005893 lockFactory=org.apache.lucene.store.NativeFSLockFactory@2fe257e2),segFN=segments_3,generation=3,filenames=[segments_3]
[junit4:junit4] 2> 13505 T3331 C181 P29236 oasc.SolrDeletionPolicy.updateCommits newest commit = 3[segments_3]
[junit4:junit4] 2> 13505 T3331 C181 P29236 oasu.DefaultSolrCoreState.newIndexWriter New IndexWriter is ready to be used.
[junit4:junit4] 2> 13506 T3331 C181 P29236 oasc.CachingDirectoryFactory.close Releasing directory:/usr/home/hudson/hudson-slave/workspace/Lucene-Solr-Tests-trunk-Java6/solr/build/solr-core/test/J1/./org.apache.solr.cloud.SyncSliceTest-1356662992407/jetty3
[junit4:junit4] 2> 13506 T3331 C181 P29236 oass.SolrIndexSearcher.<init> Opening Searcher@118806c0 main
[junit4:junit4] 2> 13507 T3330 oasc.SolrCore.registerSearcher [collection1] Registered new searcher Searcher@118806c0 main{StandardDirectoryReader(segments_3:1:nrt)}
[junit4:junit4] 2> 13508 T3330 oasc.CachingDirectoryFactory.close Releasing directory:/usr/home/hudson/hudson-slave/workspace/Lucene-Solr-Tests-trunk-Java6/solr/build/solr-core/test/J1/./org.apache.solr.cloud.SyncSliceTest-1356662992407/jetty3/index
[junit4:junit4] 2> 13508 T3331 C181 P29236 oasu.DirectUpdateHandler2.commit start commit{flags=0,_version_=0,optimize=false,openSearcher=false,waitSearcher=false,expungeDeletes=false,softCommit=false}
[junit4:junit4] 2> 13510 T3331 C181 P29236 oasc.SolrDeletionPolicy.onCommit SolrDeletionPolicy.onCommit: commits:num=2
[junit4:junit4] 2> commit{dir=RateLimitedDirectoryWrapper(org.apache.lucene.store.NIOFSDirectory@/usr/home/hudson/hudson-slave/workspace/Lucene-Solr-Tests-trunk-Java6/solr/build/solr-core/test/J1/org.apache.solr.cloud.SyncSliceTest-1356662992407/jetty3/index.20121228125005893 lockFactory=org.apache.lucene.store.NativeFSLockFactory@2fe257e2),segFN=segments_3,generation=3,filenames=[segments_3]
[junit4:junit4] 2> commit{dir=RateLimitedDirectoryWrapper(org.apache.lucene.store.NIOFSDirectory@/usr/home/hudson/hudson-slave/workspace/Lucene-Solr-Tests-trunk-Java6/solr/build/solr-core/test/J1/org.apache.solr.cloud.SyncSliceTest-1356662992407/jetty3/index.20121228125005893 lockFactory=org.apache.lucene.store.NativeFSLockFactory@2fe257e2),segFN=segments_4,generation=4,filenames=[segments_4]
[junit4:junit4] 2> 13510 T3331 C181 P29236 oasc.SolrDeletionPolicy.updateCommits newest commit = 4[segments_4]
[junit4:junit4] 2> 13511 T3331 C181 P29236 oasc.CachingDirectoryFactory.close Releasing directory:/usr/home/hudson/hudson-slave/workspace/Lucene-Solr-Tests-trunk-Java6/solr/build/solr-core/test/J1/./org.apache.solr.cloud.SyncSliceTest-1356662992407/jetty3
[junit4:junit4] 2> 13511 T3331 C181 P29236 oasu.DirectUpdateHandler2.commit end_commit_flush
[junit4:junit4] 2> 13511 T3331 C181 P29236 oasc.CachingDirectoryFactory.close Releasing directory:/usr/home/hudson/hudson-slave/workspace/Lucene-Solr-Tests-trunk-Java6/solr/build/solr-core/test/J1/./org.apache.solr.cloud.SyncSliceTest-1356662992407/jetty3/index.20121228125005893
[junit4:junit4] 2> 13511 T3331 C181 P29236 oasc.CachingDirectoryFactory.close Releasing directory:/usr/home/hudson/hudson-slave/workspace/Lucene-Solr-Tests-trunk-Java6/solr/build/solr-core/test/J1/./org.apache.solr.cloud.SyncSliceTest-1356662992407/jetty3/index
[junit4:junit4] 2> 13512 T3331 C181 P29236 oasc.RecoveryStrategy.replay No replay needed. core=collection1
[junit4:junit4] 2> 13512 T3331 C181 P29236 oasc.RecoveryStrategy.doRecovery Replication Recovery was successful - registering as Active. core=collection1
[junit4:junit4] 2> 13512 T3331 C181 P29236 oasc.ZkController.publish publishing core=collection1 state=active
[junit4:junit4] 2> 13512 T3331 C181 P29236 oasc.ZkController.publish numShards not found on descriptor - reading it from system property
[junit4:junit4] 2> 13521 T3331 C181 P29236 oasc.RecoveryStrategy.doRecovery Finished recovery process. core=collection1
[junit4:junit4] 2> 13549 T3279 oascc.ZkStateReader.updateClusterState Updating cloud state from ZooKeeper...
[junit4:junit4] 2> 13549 T3279 oasc.Overseer$ClusterStateUpdater.updateState Update state numShards=1 message={
[junit4:junit4] 2> "operation":"state",
[junit4:junit4] 2> "numShards":"1",
[junit4:junit4] 2> "shard":"shard1",
[junit4:junit4] 2> "roles":null,
[junit4:junit4] 2> "state":"active",
[junit4:junit4] 2> "core":"collection1",
[junit4:junit4] 2> "collection":"collection1",
[junit4:junit4] 2> "node_name":"127.0.0.1:29236_",
[junit4:junit4] 2> "base_url":"http://127.0.0.1:29236"}
[junit4:junit4] 2> 13561 T3278 oascc.ZkStateReader$2.process A cluster state change: WatchedEvent state:SyncConnected type:NodeDataChanged path:/clusterstate.json, has occurred - updating... (live nodes size: 5)
[junit4:junit4] 2> 13561 T3297 oascc.ZkStateReader$2.process A cluster state change: WatchedEvent state:SyncConnected type:NodeDataChanged path:/clusterstate.json, has occurred - updating... (live nodes size: 5)
[junit4:junit4] 2> 13561 T3312 oascc.ZkStateReader$2.process A cluster state change: WatchedEvent state:SyncConnected type:NodeDataChanged path:/clusterstate.json, has occurred - updating... (live nodes size: 5)
[junit4:junit4] 2> 13561 T3284 oascc.ZkStateReader$2.process A cluster state change: WatchedEvent state:SyncConnected type:NodeDataChanged path:/clusterstate.json, has occurred - updating... (live nodes size: 5)
[junit4:junit4] 2> 13561 T3344 oascc.ZkStateReader$2.process A cluster state change: WatchedEvent state:SyncConnected type:NodeDataChanged path:/clusterstate.json, has occurred - updating... (live nodes size: 5)
[junit4:junit4] 2> 13561 T3328 oascc.ZkStateReader$2.process A cluster state change: WatchedEvent state:SyncConnected type:NodeDataChanged path:/clusterstate.json, has occurred - updating... (live nodes size: 5)
[junit4:junit4] 2> 13732 T3256 oascc.ZkStateReader.updateClusterState Updating cloud state from ZooKeeper...
[junit4:junit4] 2> 14734 T3256 oascc.ZkStateReader.updateClusterState Updating cloud state from ZooKeeper...
[junit4:junit4] 2> C183_STATE=coll:collection1 core:collection1 props:{shard=shard1, roles=null, state=recovering, core=collection1, collection=collection1, node_name=127.0.0.1:29244_, base_url=http://127.0.0.1:29244}
[junit4:junit4] 2> 15732 T3349 C183 P29244 oasc.RecoveryStrategy.doRecovery Attempting to PeerSync from http://127.0.0.1:29228/collection1/ core=collection1 - recoveringAfterStartup=true
[junit4:junit4] 2> 15732 T3349 C183 P29244 oasu.PeerSync.sync PeerSync: core=collection1 url=http://127.0.0.1:29244 START replicas=[http://127.0.0.1:29228/collection1/] nUpdates=100
[junit4:junit4] 2> 15732 T3349 C183 P29244 oasu.PeerSync.sync WARNING no frame of reference to tell of we've missed updates
[junit4:junit4] 2> 15733 T3349 C183 P29244 oasc.RecoveryStrategy.doRecovery PeerSync Recovery was not successful - trying replication. core=collection1
[junit4:junit4] 2> 15733 T3349 C183 P29244 oasc.RecoveryStrategy.doRecovery Starting Replication Recovery. core=collection1
[junit4:junit4] 2> 15733 T3349 C183 P29244 oasc.RecoveryStrategy.doRecovery Begin buffering updates. core=collection1
[junit4:junit4] 2> 15733 T3349 C183 P29244 oasu.UpdateLog.bufferUpdates Starting to buffer updates. FSUpdateLog{state=ACTIVE, tlog=null}
[junit4:junit4] 2> 15733 T3349 C183 P29244 oasc.RecoveryStrategy.replicate Attempting to replicate from http://127.0.0.1:29228/collection1/. core=collection1
[junit4:junit4] 2> 15733 T3349 C183 P29244 oascsi.HttpClientUtil.createClient Creating new http client, config:maxConnections=128&maxConnectionsPerHost=32&followRedirects=false
[junit4:junit4] 2> 15735 T3289 C182 P29228 REQ /get {distrib=false&qt=/get&wt=javabin&version=2&getVersions=100} status=0 QTime=0
[junit4:junit4] 2> 15736 T3256 oascc.ZkStateReader.updateClusterState Updating cloud state from ZooKeeper...
[junit4:junit4] 2> 15744 T3287 C182 P29228 oasu.DirectUpdateHandler2.commit start commit{flags=0,_version_=0,optimize=false,openSearcher=false,waitSearcher=true,expungeDeletes=false,softCommit=false}
[junit4:junit4] 2> 15747 T3287 C182 P29228 oasc.SolrDeletionPolicy.onCommit SolrDeletionPolicy.onCommit: commits:num=3
[junit4:junit4] 2> commit{dir=RateLimitedDirectoryWrapper(org.apache.lucene.store.NIOFSDirectory@/usr/home/hudson/hudson-slave/workspace/Lucene-Solr-Tests-trunk-Java6/solr/build/solr-core/test/J1/org.apache.solr.cloud.SyncSliceTest-1356662992407/jetty1/index lockFactory=org.apache.lucene.store.NativeFSLockFactory@20d1604a),segFN=segments_2,generation=2,filenames=[segments_2]
[junit4:junit4] 2> commit{dir=RateLimitedDirectoryWrapper(org.apache.lucene.store.NIOFSDirectory@/usr/home/hudson/hudson-slave/workspace/Lucene-Solr-Tests-trunk-Java6/solr/build/solr-core/test/J1/org.apache.solr.cloud.SyncSliceTest-1356662992407/jetty1/index lockFactory=org.apache.lucene.store.NativeFSLockFactory@20d1604a),segFN=segments_3,generation=3,filenames=[segments_3]
[junit4:junit4] 2> commit{dir=RateLimitedDirectoryWrapper(org.apache.lucene.store.NIOFSDirectory@/usr/home/hudson/hudson-slave/workspace/Lucene-Solr-Tests-trunk-Java6/solr/build/solr-core/test/J1/org.apache.solr.cloud.SyncSliceTest-1356662992407/jetty1/index lockFactory=org.apache.lucene.store.NativeFSLockFactory@20d1604a),segFN=segments_4,generation=4,filenames=[segments_4]
[junit4:junit4] 2> 15747 T3287 C182 P29228 oasc.SolrDeletionPolicy.updateCommits newest commit = 4[segments_4]
[junit4:junit4] 2> 15748 T3287 C182 P29228 oasc.CachingDirectoryFactory.close Releasing directory:/usr/home/hudson/hudson-slave/workspace/Lucene-Solr-Tests-trunk-Java6/solr/build/solr-core/test/J1/./org.apache.solr.cloud.SyncSliceTest-1356662992407/jetty1
[junit4:junit4] 2> 15748 T3287 C182 P29228 oasu.DirectUpdateHandler2.commit end_commit_flush
[junit4:junit4] 2> 15748 T3287 C182 P29228 /update {waitSearcher=true&openSearcher=false&commit=true&commit_end_point=true&wt=javabin&softCommit=false&version=2} {commit=} 0 4
[junit4:junit4] 2> 15749 T3349 C183 P29244 oash.ReplicationHandler.inform Commits will be reserved for 10000
[junit4:junit4] 2> 15749 T3349 C183 P29244 oash.SnapPuller.<init> No value set for 'pollInterval'. Timer Task not started.
[junit4:junit4] 2> 15751 T3291 C182 P29228 REQ /replication {command=indexversion&wt=javabin&qt=/replication&version=2} status=0 QTime=0
[junit4:junit4] 2> 15752 T3349 C183 P29244 oash.SnapPuller.fetchLatestIndex Master's generation: 4
[junit4:junit4] 2> 15752 T3349 C183 P29244 oash.SnapPuller.fetchLatestIndex Slave's generation: 1
[junit4:junit4] 2> 15752 T3349 C183 P29244 oash.SnapPuller.fetchLatestIndex Starting replication process
[junit4:junit4] 2> 15755 T3291 C182 P29228 oasc.CachingDirectoryFactory.close Releasing directory:/usr/home/hudson/hudson-slave/workspace/Lucen
[...truncated too long message...]
solr.BaseDistributedSearchTestCase.testDistribSearch(BaseDistributedSearchTestCase.java:794)
[junit4:junit4] > at sun.reflect.NativeMethodAccessorImpl.invoke0(Native Method)
[junit4:junit4] > at sun.reflect.NativeMethodAccessorImpl.invoke(NativeMethodAccessorImpl.java:57)
[junit4:junit4] > at sun.reflect.DelegatingMethodAccessorImpl.invoke(DelegatingMethodAccessorImpl.java:43)
[junit4:junit4] > at java.lang.reflect.Method.invoke(Method.java:616)
[junit4:junit4] > at com.carrotsearch.randomizedtesting.RandomizedRunner.invoke(RandomizedRunner.java:1559)
[junit4:junit4] > at com.carrotsearch.randomizedtesting.RandomizedRunner.access$600(RandomizedRunner.java:79)
[junit4:junit4] > at com.carrotsearch.randomizedtesting.RandomizedRunner$6.evaluate(RandomizedRunner.java:737)
[junit4:junit4] > at com.carrotsearch.randomizedtesting.RandomizedRunner$7.evaluate(RandomizedRunner.java:773)
[junit4:junit4] > at com.carrotsearch.randomizedtesting.RandomizedRunner$8.evaluate(RandomizedRunner.java:787)
[junit4:junit4] > at com.carrotsearch.randomizedtesting.rules.SystemPropertiesRestoreRule$1.evaluate(SystemPropertiesRestoreRule.java:53)
[junit4:junit4] > at org.apache.lucene.util.TestRuleSetupTeardownChained$1.evaluate(TestRuleSetupTeardownChained.java:50)
[junit4:junit4] > at org.apache.lucene.util.TestRuleFieldCacheSanity$1.evaluate(TestRuleFieldCacheSanity.java:51)
[junit4:junit4] > at org.apache.lucene.util.AbstractBeforeAfterRule$1.evaluate(AbstractBeforeAfterRule.java:46)
[junit4:junit4] > at com.carrotsearch.randomizedtesting.rules.SystemPropertiesInvariantRule$1.evaluate(SystemPropertiesInvariantRule.java:55)
[junit4:junit4] > at org.apache.lucene.util.TestRuleThreadAndTestName$1.evaluate(TestRuleThreadAndTestName.java:49)
[junit4:junit4] > at org.apache.lucene.util.TestRuleIgnoreAfterMaxFailures$1.evaluate(TestRuleIgnoreAfterMaxFailures.java:70)
[junit4:junit4] > at org.apache.lucene.util.TestRuleMarkFailure$1.evaluate(TestRuleMarkFailure.java:48)
[junit4:junit4] > at com.carrotsearch.randomizedtesting.rules.StatementAdapter.evaluate(StatementAdapter.java:36)
[junit4:junit4] > at com.carrotsearch.randomizedtesting.ThreadLeakControl$StatementRunner.run(ThreadLeakControl.java:358)
[junit4:junit4] > at com.carrotsearch.randomizedtesting.ThreadLeakControl.forkTimeoutingTask(ThreadLeakControl.java:782)
[junit4:junit4] > at com.carrotsearch.randomizedtesting.ThreadLeakControl$3.evaluate(ThreadLeakControl.java:442)
[junit4:junit4] > at com.carrotsearch.randomizedtesting.RandomizedRunner.runSingleTest(RandomizedRunner.java:746)
[junit4:junit4] > at com.carrotsearch.randomizedtesting.RandomizedRunner$3.evaluate(RandomizedRunner.java:648)
[junit4:junit4] > at com.carrotsearch.randomizedtesting.RandomizedRunner$4.evaluate(RandomizedRunner.java:682)
[junit4:junit4] > at com.carrotsearch.randomizedtesting.RandomizedRunner$5.evaluate(RandomizedRunner.java:693)
[junit4:junit4] > at com.carrotsearch.randomizedtesting.rules.StatementAdapter.evaluate(StatementAdapter.java:36)
[junit4:junit4] > at com.carrotsearch.randomizedtesting.rules.SystemPropertiesRestoreRule$1.evaluate(SystemPropertiesRestoreRule.java:53)
[junit4:junit4] > at org.apache.lucene.util.AbstractBeforeAfterRule$1.evaluate(AbstractBeforeAfterRule.java:46)
[junit4:junit4] > at org.apache.lucene.util.TestRuleStoreClassName$1.evaluate(TestRuleStoreClassName.java:42)
[junit4:junit4] > at com.carrotsearch.randomizedtesting.rules.SystemPropertiesInvariantRule$1.evaluate(SystemPropertiesInvariantRule.java:55)
[junit4:junit4] > at com.carrotsearch.randomizedtesting.rules.NoShadowingOrOverridesOnMethodsRule$1.evaluate(NoShadowingOrOverridesOnMethodsRule.java:39)
[junit4:junit4] > at com.carrotsearch.randomizedtesting.rules.NoShadowingOrOverridesOnMethodsRule$1.evaluate(NoShadowingOrOverridesOnMethodsRule.java:39)
[junit4:junit4] > at com.carrotsearch.randomizedtesting.rules.StatementAdapter.evaluate(StatementAdapter.java:36)
[junit4:junit4] > at org.apache.lucene.util.TestRuleAssertionsRequired$1.evaluate(TestRuleAssertionsRequired.java:43)
[junit4:junit4] > at org.apache.lucene.util.TestRuleMarkFailure$1.evaluate(TestRuleMarkFailure.java:48)
[junit4:junit4] > at org.apache.lucene.util.TestRuleIgnoreAfterMaxFailures$1.evaluate(TestRuleIgnoreAfterMaxFailures.java:70)
[junit4:junit4] > at org.apache.lucene.util.TestRuleIgnoreTestSuites$1.evaluate(TestRuleIgnoreTestSuites.java:55)
[junit4:junit4] > at com.carrotsearch.randomizedtesting.rules.StatementAdapter.evaluate(StatementAdapter.java:36)
[junit4:junit4] > at com.carrotsearch.randomizedtesting.ThreadLeakControl$StatementRunner.run(ThreadLeakControl.java:358)
[junit4:junit4] > at java.lang.Thread.run(Thread.java:679)
[junit4:junit4] 2> 138180 T3256 oas.SolrTestCaseJ4.deleteCore ###deleteCore
[junit4:junit4] 2> NOTE: test params are: codec=Lucene40, sim=RandomSimilarityProvider(queryNorm=false,coord=no): {}, locale=ga_IE, timezone=Pacific/Truk
[junit4:junit4] 2> NOTE: FreeBSD 9.0-RELEASE amd64/Sun Microsystems Inc. 1.6.0_32 (64-bit)/cpus=16,threads=2,free=161551896,total=387579904
[junit4:junit4] 2> NOTE: All tests run in this JVM: [UpdateParamsTest, IndexSchemaRuntimeFieldTest, TestBinaryField, TestFunctionQuery, PrimUtilsTest, TestCodecSupport, TestPropInjectDefaults, HighlighterTest, TermVectorComponentTest, ZkCLITest, SolrInfoMBeanTest, StatsComponentTest, OpenExchangeRatesOrgProviderTest, BadIndexSchemaTest, RecoveryZkTest, LeaderElectionTest, TestStressReorder, TestSolrDeletionPolicy1, DocumentBuilderTest, TestPluginEnable, ShowFileRequestHandlerTest, SuggesterTSTTest, DirectUpdateHandlerTest, SchemaVersionSpecificBehaviorTest, ReturnFieldsTest, TestSolrDeletionPolicy2, LegacyHTMLStripCharFilterTest, EchoParamsTest, XmlUpdateRequestHandlerTest, TestMergePolicyConfig, QueryEqualityTest, ScriptEngineTest, DOMUtilTest, SignatureUpdateProcessorFactoryTest, TestHashPartitioner, TestUtils, SpellingQueryConverterTest, XsltUpdateRequestHandlerTest, TestJmxIntegration, SuggesterTest, TestWriterPerf, TestPhraseSuggestions, TestArbitraryIndexDir, FieldMutatingUpdateProcessorTest, TestStressVersions, TestSolrCoreProperties, TestSolrIndexConfig, IndexSchemaTest, TestReplicationHandler, TestLazyCores, TestZkChroot, ExternalFileFieldSortTest, LukeRequestHandlerTest, BasicFunctionalityTest, SolrIndexConfigTest, TestAtomicUpdateErrorCases, RequiredFieldsTest, DocumentAnalysisRequestHandlerTest, OverseerTest, FullSolrCloudDistribCmdsTest, LeaderElectionIntegrationTest, DistributedSpellCheckComponentTest, TestRealTimeGet, TestDistributedGrouping, TestDistributedSearch, SoftAutoCommitTest, BasicZkTest, ZkSolrClientTest, TestRecovery, SolrCoreTest, TestRangeQuery, TestMultiCoreConfBootstrap, SimpleFacetsTest, TestSort, TestGroupingSearch, DirectSolrSpellCheckerTest, ConvertedLegacyTest, PeerSyncTest, SortByFunctionTest, TestBinaryResponseWriter, SampleTest, TestIndexSearcher, CoreAdminHandlerTest, TestTrie, TestRemoteStreaming, CacheHeaderTest, TestWordDelimiterFilterFactory, TestCSVLoader, PolyFieldTest, TestCSVResponseWriter, MBeansHandlerTest, DistributedQueryElevationComponentTest, TestPseudoReturnFields, DisMaxRequestHandlerTest, BinaryUpdateRequestHandlerTest, QueryParsingTest, TermsComponentTest, MinimalSchemaTest, StandardRequestHandlerTest, TestQueryTypes, PingRequestHandlerTest, SuggesterWFSTTest, TestSurroundQueryParser, DirectUpdateHandlerOptimizeTest, TestSolrQueryParser, TestValueSourceCache, FastVectorHighlighterTest, TestReversedWildcardFilterFactory, DebugComponentTest, RequestHandlersTest, SearchHandlerTest, TestOmitPositions, TestQueryUtils, SolrCmdDistributorTest, UniqFieldsUpdateProcessorFactoryTest, CSVRequestHandlerTest, NotRequiredUniqueKeyTest, TestFoldingMultitermQuery, SolrCoreCheckLockOnStartupTest, TestLuceneMatchVersion, TestPropInject, TestIndexingPerformance, PrimitiveFieldTypeTest, TestUpdate, HighlighterConfigTest, SOLR749Test, TestXIncludeConfig, TestDocSet, TestLFUCache, TestQuerySenderListener, TestCollationField, IndexReaderFactoryTest, OutputWriterTest, TestNumberUtils, MultiTermTest, SpellPossibilityIteratorTest, TestBM25SimilarityFactory, TestLMDirichletSimilarityFactory, TestPerFieldSimilarity, TestDFRSimilarityFactory, TestIBSimilarityFactory, TestDefaultSimilarityFactory, TimeZoneUtilsTest, DateMathParserTest, URLClassifyProcessorTest, PluginInfoTest, FileUtilsTest, TestSystemIdResolver, TestSolrXMLSerializer, DateFieldTest, TestLRUCache, ChaosMonkeySafeLeaderTest, UUIDFieldTest, RAMDirectoryFactoryTest, ZkNodePropsTest, CircularListTest, AnalysisAfterCoreReloadTest, TestCharFilters, BasicDistributedZk2Test, SyncSliceTest]
[junit4:junit4] Completed on J1 in 138.21s, 1 test, 1 failure <<< FAILURES!
[...truncated 10 lines...]
BUILD FAILED
/usr/home/hudson/hudson-slave/workspace/Lucene-Solr-Tests-trunk-Java6/build.xml:353: The following error occurred while executing this line:
/usr/home/hudson/hudson-slave/workspace/Lucene-Solr-Tests-trunk-Java6/build.xml:39: The following error occurred while executing this line:
/usr/home/hudson/hudson-slave/workspace/Lucene-Solr-Tests-trunk-Java6/solr/build.xml:178: The following error occurred while executing this line:
/usr/home/hudson/hudson-slave/workspace/Lucene-Solr-Tests-trunk-Java6/solr/common-build.xml:438: The following error occurred while executing this line:
/usr/home/hudson/hudson-slave/workspace/Lucene-Solr-Tests-trunk-Java6/lucene/common-build.xml:1176: The following error occurred while executing this line:
/usr/home/hudson/hudson-slave/workspace/Lucene-Solr-Tests-trunk-Java6/lucene/common-build.xml:841: There were test failures: 243 suites, 1009 tests, 1 failure, 22 ignored (4 assumptions)
Total time: 33 minutes 30 seconds
Build step 'Invoke Ant' marked build as failure
Archiving artifacts
Recording test results
Email was triggered for: Failure
Sending email for trigger: Failure