You are viewing a plain text version of this content. The canonical link for it is here.
Posted to builds@solr.apache.org by Policeman Jenkins Server <je...@thetaphi.de> on 2024/02/24 08:53:55 UTC

[JENKINS] Solr-main-Linux (64bit/hotspot/jdk-20) - Build # 16954 - Still Unstable!

Build: https://jenkins.thetaphi.de/job/Solr-main-Linux/16954/
Java: 64bit/hotspot/jdk-20 -XX:+UseCompressedOops -XX:+UseParallelGC

1 tests failed.
FAILED:  org.apache.solr.cloud.TestPrepRecovery.testLeaderNotResponding

Error Message:
org.apache.solr.client.solrj.impl.BaseHttpSolrClient$RemoteSolrException: Error from server at https://127.0.0.1:38695/solr: Underlying core creation failed while creating collection: testLeaderNotResponding

Stack Trace:
org.apache.solr.client.solrj.impl.BaseHttpSolrClient$RemoteSolrException: Error from server at https://127.0.0.1:38695/solr: Underlying core creation failed while creating collection: testLeaderNotResponding
	at __randomizedtesting.SeedInfo.seed([1CA6A19884BE955F:45FA89FFC3C955E0]:0)
	at app//org.apache.solr.client.solrj.impl.HttpSolrClient.executeMethod(HttpSolrClient.java:738)
	at app//org.apache.solr.client.solrj.impl.HttpSolrClient.request(HttpSolrClient.java:257)
	at app//org.apache.solr.client.solrj.impl.HttpSolrClient.request(HttpSolrClient.java:236)
	at app//org.apache.solr.client.solrj.impl.LBSolrClient.doRequest(LBSolrClient.java:390)
	at app//org.apache.solr.client.solrj.impl.LBSolrClient.request(LBSolrClient.java:353)
	at app//org.apache.solr.client.solrj.impl.CloudSolrClient.sendRequest(CloudSolrClient.java:1130)
	at app//org.apache.solr.client.solrj.impl.CloudSolrClient.requestWithRetryOnStaleState(CloudSolrClient.java:829)
	at app//org.apache.solr.client.solrj.impl.CloudSolrClient.request(CloudSolrClient.java:760)
	at app//org.apache.solr.client.solrj.SolrRequest.process(SolrRequest.java:229)
	at app//org.apache.solr.client.solrj.SolrRequest.process(SolrRequest.java:244)
	at app//org.apache.solr.cloud.TestPrepRecovery.testLeaderNotResponding(TestPrepRecovery.java:97)
	at java.base@20/jdk.internal.reflect.DirectMethodHandleAccessor.invoke(DirectMethodHandleAccessor.java:104)
	at java.base@20/java.lang.reflect.Method.invoke(Method.java:578)
	at app//com.carrotsearch.randomizedtesting.RandomizedRunner.invoke(RandomizedRunner.java:1758)
	at app//com.carrotsearch.randomizedtesting.RandomizedRunner$8.evaluate(RandomizedRunner.java:946)
	at app//com.carrotsearch.randomizedtesting.RandomizedRunner$9.evaluate(RandomizedRunner.java:982)
	at app//com.carrotsearch.randomizedtesting.RandomizedRunner$10.evaluate(RandomizedRunner.java:996)
	at app//com.carrotsearch.randomizedtesting.rules.SystemPropertiesRestoreRule$1.evaluate(SystemPropertiesRestoreRule.java:80)
	at app//org.junit.rules.RunRules.evaluate(RunRules.java:20)
	at app//org.apache.lucene.tests.util.TestRuleSetupTeardownChained$1.evaluate(TestRuleSetupTeardownChained.java:48)
	at app//org.apache.lucene.tests.util.AbstractBeforeAfterRule$1.evaluate(AbstractBeforeAfterRule.java:43)
	at app//org.apache.lucene.tests.util.TestRuleThreadAndTestName$1.evaluate(TestRuleThreadAndTestName.java:45)
	at app//org.apache.lucene.tests.util.TestRuleIgnoreAfterMaxFailures$1.evaluate(TestRuleIgnoreAfterMaxFailures.java:60)
	at app//org.apache.lucene.tests.util.TestRuleMarkFailure$1.evaluate(TestRuleMarkFailure.java:44)
	at app//org.junit.rules.RunRules.evaluate(RunRules.java:20)
	at app//com.carrotsearch.randomizedtesting.rules.StatementAdapter.evaluate(StatementAdapter.java:36)
	at app//com.carrotsearch.randomizedtesting.ThreadLeakControl$StatementRunner.run(ThreadLeakControl.java:390)
	at app//com.carrotsearch.randomizedtesting.ThreadLeakControl.forkTimeoutingTask(ThreadLeakControl.java:843)
	at app//com.carrotsearch.randomizedtesting.ThreadLeakControl$3.evaluate(ThreadLeakControl.java:490)
	at app//com.carrotsearch.randomizedtesting.RandomizedRunner.runSingleTest(RandomizedRunner.java:955)
	at app//com.carrotsearch.randomizedtesting.RandomizedRunner$5.evaluate(RandomizedRunner.java:840)
	at app//com.carrotsearch.randomizedtesting.RandomizedRunner$6.evaluate(RandomizedRunner.java:891)
	at app//com.carrotsearch.randomizedtesting.RandomizedRunner$7.evaluate(RandomizedRunner.java:902)
	at app//com.carrotsearch.randomizedtesting.rules.StatementAdapter.evaluate(StatementAdapter.java:36)
	at app//com.carrotsearch.randomizedtesting.rules.StatementAdapter.evaluate(StatementAdapter.java:36)
	at app//org.apache.lucene.tests.util.AbstractBeforeAfterRule$1.evaluate(AbstractBeforeAfterRule.java:43)
	at app//com.carrotsearch.randomizedtesting.rules.SystemPropertiesRestoreRule$1.evaluate(SystemPropertiesRestoreRule.java:80)
	at app//org.junit.rules.RunRules.evaluate(RunRules.java:20)
	at app//org.apache.lucene.tests.util.AbstractBeforeAfterRule$1.evaluate(AbstractBeforeAfterRule.java:43)
	at app//com.carrotsearch.randomizedtesting.rules.StatementAdapter.evaluate(StatementAdapter.java:36)
	at app//org.apache.lucene.tests.util.TestRuleStoreClassName$1.evaluate(TestRuleStoreClassName.java:38)
	at app//com.carrotsearch.randomizedtesting.rules.NoShadowingOrOverridesOnMethodsRule$1.evaluate(NoShadowingOrOverridesOnMethodsRule.java:40)
	at app//com.carrotsearch.randomizedtesting.rules.NoShadowingOrOverridesOnMethodsRule$1.evaluate(NoShadowingOrOverridesOnMethodsRule.java:40)
	at app//com.carrotsearch.randomizedtesting.rules.StatementAdapter.evaluate(StatementAdapter.java:36)
	at app//com.carrotsearch.randomizedtesting.rules.StatementAdapter.evaluate(StatementAdapter.java:36)
	at app//org.apache.lucene.tests.util.TestRuleAssertionsRequired$1.evaluate(TestRuleAssertionsRequired.java:53)
	at app//org.apache.lucene.tests.util.AbstractBeforeAfterRule$1.evaluate(AbstractBeforeAfterRule.java:43)
	at app//org.apache.lucene.tests.util.TestRuleMarkFailure$1.evaluate(TestRuleMarkFailure.java:44)
	at app//org.apache.lucene.tests.util.TestRuleIgnoreAfterMaxFailures$1.evaluate(TestRuleIgnoreAfterMaxFailures.java:60)
	at app//org.apache.lucene.tests.util.TestRuleIgnoreTestSuites$1.evaluate(TestRuleIgnoreTestSuites.java:47)
	at app//org.junit.rules.RunRules.evaluate(RunRules.java:20)
	at app//com.carrotsearch.randomizedtesting.rules.StatementAdapter.evaluate(StatementAdapter.java:36)
	at app//com.carrotsearch.randomizedtesting.ThreadLeakControl$StatementRunner.run(ThreadLeakControl.java:390)
	at app//com.carrotsearch.randomizedtesting.ThreadLeakControl.lambda$forkTimeoutingTask$0(ThreadLeakControl.java:850)
	at java.base@20/java.lang.Thread.run(Thread.java:1623)

[JENKINS] Solr-main-Linux (64bit/hotspot/jdk-17.0.9) - Build # 16957 - Still Unstable!

Posted by Policeman Jenkins Server <je...@thetaphi.de>.
Build: https://jenkins.thetaphi.de/job/Solr-main-Linux/16957/
Java: 64bit/hotspot/jdk-17.0.9 -XX:+UseCompressedOops -XX:+UseShenandoahGC

2 tests failed.
FAILED:  org.apache.solr.cloud.api.collections.CollectionsAPIAsyncDistributedZkTest.testAsyncRequests

Error Message:
java.lang.AssertionError: DeleteAlias did not complete expected same:<COMPLETED> was not:<FAILED>

Stack Trace:
java.lang.AssertionError: DeleteAlias did not complete expected same:<COMPLETED> was not:<FAILED>
	at __randomizedtesting.SeedInfo.seed([2CDD96CC67AE8DD6:C899AA7BC106C309]:0)
	at org.junit.Assert.fail(Assert.java:89)
	at org.junit.Assert.failNotSame(Assert.java:829)
	at org.junit.Assert.assertSame(Assert.java:772)
	at org.apache.solr.cloud.api.collections.CollectionsAPIAsyncDistributedZkTest.testAsyncRequests(CollectionsAPIAsyncDistributedZkTest.java:200)
	at java.base/jdk.internal.reflect.NativeMethodAccessorImpl.invoke0(Native Method)
	at java.base/jdk.internal.reflect.NativeMethodAccessorImpl.invoke(NativeMethodAccessorImpl.java:77)
	at java.base/jdk.internal.reflect.DelegatingMethodAccessorImpl.invoke(DelegatingMethodAccessorImpl.java:43)
	at java.base/java.lang.reflect.Method.invoke(Method.java:568)
	at com.carrotsearch.randomizedtesting.RandomizedRunner.invoke(RandomizedRunner.java:1758)
	at com.carrotsearch.randomizedtesting.RandomizedRunner$8.evaluate(RandomizedRunner.java:946)
	at com.carrotsearch.randomizedtesting.RandomizedRunner$9.evaluate(RandomizedRunner.java:982)
	at com.carrotsearch.randomizedtesting.RandomizedRunner$10.evaluate(RandomizedRunner.java:996)
	at com.carrotsearch.randomizedtesting.rules.SystemPropertiesRestoreRule$1.evaluate(SystemPropertiesRestoreRule.java:80)
	at org.junit.rules.RunRules.evaluate(RunRules.java:20)
	at org.apache.lucene.tests.util.TestRuleSetupTeardownChained$1.evaluate(TestRuleSetupTeardownChained.java:48)
	at org.apache.lucene.tests.util.AbstractBeforeAfterRule$1.evaluate(AbstractBeforeAfterRule.java:43)
	at org.apache.lucene.tests.util.TestRuleThreadAndTestName$1.evaluate(TestRuleThreadAndTestName.java:45)
	at org.apache.lucene.tests.util.TestRuleIgnoreAfterMaxFailures$1.evaluate(TestRuleIgnoreAfterMaxFailures.java:60)
	at org.apache.lucene.tests.util.TestRuleMarkFailure$1.evaluate(TestRuleMarkFailure.java:44)
	at org.junit.rules.RunRules.evaluate(RunRules.java:20)
	at com.carrotsearch.randomizedtesting.rules.StatementAdapter.evaluate(StatementAdapter.java:36)
	at com.carrotsearch.randomizedtesting.ThreadLeakControl$StatementRunner.run(ThreadLeakControl.java:390)
	at com.carrotsearch.randomizedtesting.ThreadLeakControl.forkTimeoutingTask(ThreadLeakControl.java:843)
	at com.carrotsearch.randomizedtesting.ThreadLeakControl$3.evaluate(ThreadLeakControl.java:490)
	at com.carrotsearch.randomizedtesting.RandomizedRunner.runSingleTest(RandomizedRunner.java:955)
	at com.carrotsearch.randomizedtesting.RandomizedRunner$5.evaluate(RandomizedRunner.java:840)
	at com.carrotsearch.randomizedtesting.RandomizedRunner$6.evaluate(RandomizedRunner.java:891)
	at com.carrotsearch.randomizedtesting.RandomizedRunner$7.evaluate(RandomizedRunner.java:902)
	at com.carrotsearch.randomizedtesting.rules.StatementAdapter.evaluate(StatementAdapter.java:36)
	at com.carrotsearch.randomizedtesting.rules.StatementAdapter.evaluate(StatementAdapter.java:36)
	at org.apache.lucene.tests.util.AbstractBeforeAfterRule$1.evaluate(AbstractBeforeAfterRule.java:43)
	at com.carrotsearch.randomizedtesting.rules.SystemPropertiesRestoreRule$1.evaluate(SystemPropertiesRestoreRule.java:80)
	at org.junit.rules.RunRules.evaluate(RunRules.java:20)
	at org.apache.lucene.tests.util.AbstractBeforeAfterRule$1.evaluate(AbstractBeforeAfterRule.java:43)
	at com.carrotsearch.randomizedtesting.rules.StatementAdapter.evaluate(StatementAdapter.java:36)
	at org.apache.lucene.tests.util.TestRuleStoreClassName$1.evaluate(TestRuleStoreClassName.java:38)
	at com.carrotsearch.randomizedtesting.rules.NoShadowingOrOverridesOnMethodsRule$1.evaluate(NoShadowingOrOverridesOnMethodsRule.java:40)
	at com.carrotsearch.randomizedtesting.rules.NoShadowingOrOverridesOnMethodsRule$1.evaluate(NoShadowingOrOverridesOnMethodsRule.java:40)
	at com.carrotsearch.randomizedtesting.rules.StatementAdapter.evaluate(StatementAdapter.java:36)
	at com.carrotsearch.randomizedtesting.rules.StatementAdapter.evaluate(StatementAdapter.java:36)
	at org.apache.lucene.tests.util.TestRuleAssertionsRequired$1.evaluate(TestRuleAssertionsRequired.java:53)
	at org.apache.lucene.tests.util.AbstractBeforeAfterRule$1.evaluate(AbstractBeforeAfterRule.java:43)
	at org.apache.lucene.tests.util.TestRuleMarkFailure$1.evaluate(TestRuleMarkFailure.java:44)
	at org.apache.lucene.tests.util.TestRuleIgnoreAfterMaxFailures$1.evaluate(TestRuleIgnoreAfterMaxFailures.java:60)
	at org.apache.lucene.tests.util.TestRuleIgnoreTestSuites$1.evaluate(TestRuleIgnoreTestSuites.java:47)
	at org.junit.rules.RunRules.evaluate(RunRules.java:20)
	at com.carrotsearch.randomizedtesting.rules.StatementAdapter.evaluate(StatementAdapter.java:36)
	at com.carrotsearch.randomizedtesting.ThreadLeakControl$StatementRunner.run(ThreadLeakControl.java:390)
	at com.carrotsearch.randomizedtesting.ThreadLeakControl.lambda$forkTimeoutingTask$0(ThreadLeakControl.java:850)
	at java.base/java.lang.Thread.run(Thread.java:840)


FAILED:  org.apache.solr.search.stats.TestDistribIDF.testDisableDistribStats

Error Message:
java.lang.AssertionError: stats cache hit

Stack Trace:
java.lang.AssertionError: stats cache hit
	at __randomizedtesting.SeedInfo.seed([2CDD96CC67AE8DD6:53E84E1DF251EB]:0)
	at org.junit.Assert.fail(Assert.java:89)
	at org.junit.Assert.assertTrue(Assert.java:42)
	at org.junit.Assert.assertNotNull(Assert.java:713)
	at org.apache.solr.search.stats.TestDistribIDF.testDisableDistribStats(TestDistribIDF.java:317)
	at java.base/jdk.internal.reflect.NativeMethodAccessorImpl.invoke0(Native Method)
	at java.base/jdk.internal.reflect.NativeMethodAccessorImpl.invoke(NativeMethodAccessorImpl.java:77)
	at java.base/jdk.internal.reflect.DelegatingMethodAccessorImpl.invoke(DelegatingMethodAccessorImpl.java:43)
	at java.base/java.lang.reflect.Method.invoke(Method.java:568)
	at com.carrotsearch.randomizedtesting.RandomizedRunner.invoke(RandomizedRunner.java:1758)
	at com.carrotsearch.randomizedtesting.RandomizedRunner$8.evaluate(RandomizedRunner.java:946)
	at com.carrotsearch.randomizedtesting.RandomizedRunner$9.evaluate(RandomizedRunner.java:982)
	at com.carrotsearch.randomizedtesting.RandomizedRunner$10.evaluate(RandomizedRunner.java:996)
	at com.carrotsearch.randomizedtesting.rules.SystemPropertiesRestoreRule$1.evaluate(SystemPropertiesRestoreRule.java:80)
	at org.junit.rules.RunRules.evaluate(RunRules.java:20)
	at org.apache.lucene.tests.util.TestRuleSetupTeardownChained$1.evaluate(TestRuleSetupTeardownChained.java:48)
	at org.apache.lucene.tests.util.AbstractBeforeAfterRule$1.evaluate(AbstractBeforeAfterRule.java:43)
	at org.apache.lucene.tests.util.TestRuleThreadAndTestName$1.evaluate(TestRuleThreadAndTestName.java:45)
	at org.apache.lucene.tests.util.TestRuleIgnoreAfterMaxFailures$1.evaluate(TestRuleIgnoreAfterMaxFailures.java:60)
	at org.apache.lucene.tests.util.TestRuleMarkFailure$1.evaluate(TestRuleMarkFailure.java:44)
	at org.junit.rules.RunRules.evaluate(RunRules.java:20)
	at com.carrotsearch.randomizedtesting.rules.StatementAdapter.evaluate(StatementAdapter.java:36)
	at com.carrotsearch.randomizedtesting.ThreadLeakControl$StatementRunner.run(ThreadLeakControl.java:390)
	at com.carrotsearch.randomizedtesting.ThreadLeakControl.forkTimeoutingTask(ThreadLeakControl.java:843)
	at com.carrotsearch.randomizedtesting.ThreadLeakControl$3.evaluate(ThreadLeakControl.java:490)
	at com.carrotsearch.randomizedtesting.RandomizedRunner.runSingleTest(RandomizedRunner.java:955)
	at com.carrotsearch.randomizedtesting.RandomizedRunner$5.evaluate(RandomizedRunner.java:840)
	at com.carrotsearch.randomizedtesting.RandomizedRunner$6.evaluate(RandomizedRunner.java:891)
	at com.carrotsearch.randomizedtesting.RandomizedRunner$7.evaluate(RandomizedRunner.java:902)
	at com.carrotsearch.randomizedtesting.rules.StatementAdapter.evaluate(StatementAdapter.java:36)
	at com.carrotsearch.randomizedtesting.rules.StatementAdapter.evaluate(StatementAdapter.java:36)
	at org.apache.lucene.tests.util.AbstractBeforeAfterRule$1.evaluate(AbstractBeforeAfterRule.java:43)
	at com.carrotsearch.randomizedtesting.rules.SystemPropertiesRestoreRule$1.evaluate(SystemPropertiesRestoreRule.java:80)
	at org.junit.rules.RunRules.evaluate(RunRules.java:20)
	at org.apache.lucene.tests.util.AbstractBeforeAfterRule$1.evaluate(AbstractBeforeAfterRule.java:43)
	at com.carrotsearch.randomizedtesting.rules.StatementAdapter.evaluate(StatementAdapter.java:36)
	at org.apache.lucene.tests.util.TestRuleStoreClassName$1.evaluate(TestRuleStoreClassName.java:38)
	at com.carrotsearch.randomizedtesting.rules.NoShadowingOrOverridesOnMethodsRule$1.evaluate(NoShadowingOrOverridesOnMethodsRule.java:40)
	at com.carrotsearch.randomizedtesting.rules.NoShadowingOrOverridesOnMethodsRule$1.evaluate(NoShadowingOrOverridesOnMethodsRule.java:40)
	at com.carrotsearch.randomizedtesting.rules.StatementAdapter.evaluate(StatementAdapter.java:36)
	at com.carrotsearch.randomizedtesting.rules.StatementAdapter.evaluate(StatementAdapter.java:36)
	at org.apache.lucene.tests.util.TestRuleAssertionsRequired$1.evaluate(TestRuleAssertionsRequired.java:53)
	at org.apache.lucene.tests.util.AbstractBeforeAfterRule$1.evaluate(AbstractBeforeAfterRule.java:43)
	at org.apache.lucene.tests.util.TestRuleMarkFailure$1.evaluate(TestRuleMarkFailure.java:44)
	at org.apache.lucene.tests.util.TestRuleIgnoreAfterMaxFailures$1.evaluate(TestRuleIgnoreAfterMaxFailures.java:60)
	at org.apache.lucene.tests.util.TestRuleIgnoreTestSuites$1.evaluate(TestRuleIgnoreTestSuites.java:47)
	at org.junit.rules.RunRules.evaluate(RunRules.java:20)
	at com.carrotsearch.randomizedtesting.rules.StatementAdapter.evaluate(StatementAdapter.java:36)
	at com.carrotsearch.randomizedtesting.ThreadLeakControl$StatementRunner.run(ThreadLeakControl.java:390)
	at com.carrotsearch.randomizedtesting.ThreadLeakControl.lambda$forkTimeoutingTask$0(ThreadLeakControl.java:850)
	at java.base/java.lang.Thread.run(Thread.java:840)

[JENKINS] Solr-main-Linux (64bit/openj9/jdk-20.0.2) - Build # 16956 - Still Unstable!

Posted by Policeman Jenkins Server <je...@thetaphi.de>.
Build: https://jenkins.thetaphi.de/job/Solr-main-Linux/16956/
Java: 64bit/openj9/jdk-20.0.2 -XX:-UseCompressedOops -Xgcpolicy:optthruput

1 tests failed.
FAILED:  org.apache.solr.cloud.SplitShardWithNodeRoleTest.testSolrClusterWithNodeRoleWithPull

Error Message:
java.lang.AssertionError: Timed out waiting for sub shards to be active. Number of active shards=1
Timeout waiting to see state for collection=coll_NRT_PULL :DocCollection(coll_NRT_PULL//collections/coll_NRT_PULL/state.json/16 {/collections/coll_NRT_PULL/state.json/[28]: [core_node10:2:A, core_node4:1:A, core_node2:2:A:L, core_node8:2:A:L, core_node9:2:A, core_node7:2:A:L]})={
  "pullReplicas":1,
  "configName":"conf",
  "replicationFactor":1,
  "router":{"name":"compositeId"},
  "nrtReplicas":1,
  "tlogReplicas":0,
  "perReplicaState":true,
  "shards":{
    "shard1":{
      "range":"80000000-7fffffff",
      "replicas":{
        "core_node2":{
          "core":"coll_NRT_PULL_shard1_replica_n1",
          "node_name":"127.0.0.1:39581_solr",
          "type":"NRT",
          "state":"active",
          "leader":"true",
          "force_set_state":"false",
          "base_url":"https://127.0.0.1:39581/solr"},
        "core_node4":{
          "core":"coll_NRT_PULL_shard1_replica_p3",
          "node_name":"127.0.0.1:33243_solr",
          "type":"PULL",
          "state":"active",
          "force_set_state":"false",
          "base_url":"https://127.0.0.1:33243/solr"}},
      "state":"active"},
    "shard1_0":{
      "parent":"shard1",
      "stateTimestamp":"1708771480919306693",
      "shard_parent_node":"127.0.0.1:39581_solr",
      "replicas":{
        "core_node7":{
          "core":"coll_NRT_PULL_shard1_0_replica_n5",
          "node_name":"127.0.0.1:39581_solr",
          "type":"NRT",
          "state":"active",
          "leader":"true",
          "force_set_state":"false",
          "base_url":"https://127.0.0.1:39581/solr"},
        "core_node9":{
          "core":"coll_NRT_PULL_shard1_0_replica_p0",
          "node_name":"127.0.0.1:33243_solr",
          "type":"PULL",
          "state":"active",
          "force_set_state":"false",
          "base_url":"https://127.0.0.1:33243/solr"}},
      "range":"80000000-ffffffff",
      "state":"recovery",
      "shard_parent_zk_session":"72177031074349063"},
    "shard1_1":{
      "parent":"shard1",
      "stateTimestamp":"1708771480919281255",
      "shard_parent_node":"127.0.0.1:39581_solr",
      "replicas":{
        "core_node8":{
          "core":"coll_NRT_PULL_shard1_1_replica_n6",
          "node_name":"127.0.0.1:39581_solr",
          "type":"NRT",
          "state":"active",
          "leader":"true",
          "force_set_state":"false",
          "base_url":"https://127.0.0.1:39581/solr"},
        "core_node10":{
          "core":"coll_NRT_PULL_shard1_1_replica_p1",
          "node_name":"127.0.0.1:33243_solr",
          "type":"PULL",
          "state":"active",
          "force_set_state":"false",
          "base_url":"https://127.0.0.1:33243/solr"}},
      "range":"0-7fffffff",
      "state":"recovery",
      "shard_parent_zk_session":"72177031074349063"}}}
Live Nodes: [127.0.0.1:33229_solr, 127.0.0.1:33243_solr, 127.0.0.1:39581_solr, 127.0.0.1:40705_solr, 127.0.0.1:42677_solr, 127.0.0.1:45595_solr]
Last available state: DocCollection(coll_NRT_PULL//collections/coll_NRT_PULL/state.json/16 {/collections/coll_NRT_PULL/state.json/[28]: [core_node10:2:A, core_node4:1:A, core_node2:2:A:L, core_node8:2:A:L, core_node9:2:A, core_node7:2:A:L]})={
  "pullReplicas":1,
  "configName":"conf",
  "replicationFactor":1,
  "router":{"name":"compositeId"},
  "nrtReplicas":1,
  "tlogReplicas":0,
  "perReplicaState":true,
  "shards":{
    "shard1":{
      "range":"80000000-7fffffff",
      "replicas":{
        "core_node2":{
          "core":"coll_NRT_PULL_shard1_replica_n1",
          "node_name":"127.0.0.1:39581_solr",
          "type":"NRT",
          "state":"active",
          "leader":"true",
          "force_set_state":"false",
          "base_url":"https://127.0.0.1:39581/solr"},
        "core_node4":{
          "core":"coll_NRT_PULL_shard1_replica_p3",
          "node_name":"127.0.0.1:33243_solr",
          "type":"PULL",
          "state":"active",
          "force_set_state":"false",
          "base_url":"https://127.0.0.1:33243/solr"}},
      "state":"active"},
    "shard1_0":{
      "parent":"shard1",
      "stateTimestamp":"1708771480919306693",
      "shard_parent_node":"127.0.0.1:39581_solr",
      "replicas":{
        "core_node7":{
          "core":"coll_NRT_PULL_shard1_0_replica_n5",
          "node_name":"127.0.0.1:39581_solr",
          "type":"NRT",
          "state":"active",
          "leader":"true",
          "force_set_state":"false",
          "base_url":"https://127.0.0.1:39581/solr"},
        "core_node9":{
          "core":"coll_NRT_PULL_shard1_0_replica_p0",
          "node_name":"127.0.0.1:33243_solr",
          "type":"PULL",
          "state":"active",
          "force_set_state":"false",
          "base_url":"https://127.0.0.1:33243/solr"}},
      "range":"80000000-ffffffff",
      "state":"recovery",
      "shard_parent_zk_session":"72177031074349063"},
    "shard1_1":{
      "parent":"shard1",
      "stateTimestamp":"1708771480919281255",
      "shard_parent_node":"127.0.0.1:39581_solr",
      "replicas":{
        "core_node8":{
          "core":"coll_NRT_PULL_shard1_1_replica_n6",
          "node_name":"127.0.0.1:39581_solr",
          "type":"NRT",
          "state":"active",
          "leader":"true",
          "force_set_state":"false",
          "base_url":"https://127.0.0.1:39581/solr"},
        "core_node10":{
          "core":"coll_NRT_PULL_shard1_1_replica_p1",
          "node_name":"127.0.0.1:33243_solr",
          "type":"PULL",
          "state":"active",
          "force_set_state":"false",
          "base_url":"https://127.0.0.1:33243/solr"}},
      "range":"0-7fffffff",
      "state":"recovery",
      "shard_parent_zk_session":"72177031074349063"}}}

Stack Trace:
java.lang.AssertionError: Timed out waiting for sub shards to be active. Number of active shards=1
Timeout waiting to see state for collection=coll_NRT_PULL :DocCollection(coll_NRT_PULL//collections/coll_NRT_PULL/state.json/16 {/collections/coll_NRT_PULL/state.json/[28]: [core_node10:2:A, core_node4:1:A, core_node2:2:A:L, core_node8:2:A:L, core_node9:2:A, core_node7:2:A:L]})={
  "pullReplicas":1,
  "configName":"conf",
  "replicationFactor":1,
  "router":{"name":"compositeId"},
  "nrtReplicas":1,
  "tlogReplicas":0,
  "perReplicaState":true,
  "shards":{
    "shard1":{
      "range":"80000000-7fffffff",
      "replicas":{
        "core_node2":{
          "core":"coll_NRT_PULL_shard1_replica_n1",
          "node_name":"127.0.0.1:39581_solr",
          "type":"NRT",
          "state":"active",
          "leader":"true",
          "force_set_state":"false",
          "base_url":"https://127.0.0.1:39581/solr"},
        "core_node4":{
          "core":"coll_NRT_PULL_shard1_replica_p3",
          "node_name":"127.0.0.1:33243_solr",
          "type":"PULL",
          "state":"active",
          "force_set_state":"false",
          "base_url":"https://127.0.0.1:33243/solr"}},
      "state":"active"},
    "shard1_0":{
      "parent":"shard1",
      "stateTimestamp":"1708771480919306693",
      "shard_parent_node":"127.0.0.1:39581_solr",
      "replicas":{
        "core_node7":{
          "core":"coll_NRT_PULL_shard1_0_replica_n5",
          "node_name":"127.0.0.1:39581_solr",
          "type":"NRT",
          "state":"active",
          "leader":"true",
          "force_set_state":"false",
          "base_url":"https://127.0.0.1:39581/solr"},
        "core_node9":{
          "core":"coll_NRT_PULL_shard1_0_replica_p0",
          "node_name":"127.0.0.1:33243_solr",
          "type":"PULL",
          "state":"active",
          "force_set_state":"false",
          "base_url":"https://127.0.0.1:33243/solr"}},
      "range":"80000000-ffffffff",
      "state":"recovery",
      "shard_parent_zk_session":"72177031074349063"},
    "shard1_1":{
      "parent":"shard1",
      "stateTimestamp":"1708771480919281255",
      "shard_parent_node":"127.0.0.1:39581_solr",
      "replicas":{
        "core_node8":{
          "core":"coll_NRT_PULL_shard1_1_replica_n6",
          "node_name":"127.0.0.1:39581_solr",
          "type":"NRT",
          "state":"active",
          "leader":"true",
          "force_set_state":"false",
          "base_url":"https://127.0.0.1:39581/solr"},
        "core_node10":{
          "core":"coll_NRT_PULL_shard1_1_replica_p1",
          "node_name":"127.0.0.1:33243_solr",
          "type":"PULL",
          "state":"active",
          "force_set_state":"false",
          "base_url":"https://127.0.0.1:33243/solr"}},
      "range":"0-7fffffff",
      "state":"recovery",
      "shard_parent_zk_session":"72177031074349063"}}}
Live Nodes: [127.0.0.1:33229_solr, 127.0.0.1:33243_solr, 127.0.0.1:39581_solr, 127.0.0.1:40705_solr, 127.0.0.1:42677_solr, 127.0.0.1:45595_solr]
Last available state: DocCollection(coll_NRT_PULL//collections/coll_NRT_PULL/state.json/16 {/collections/coll_NRT_PULL/state.json/[28]: [core_node10:2:A, core_node4:1:A, core_node2:2:A:L, core_node8:2:A:L, core_node9:2:A, core_node7:2:A:L]})={
  "pullReplicas":1,
  "configName":"conf",
  "replicationFactor":1,
  "router":{"name":"compositeId"},
  "nrtReplicas":1,
  "tlogReplicas":0,
  "perReplicaState":true,
  "shards":{
    "shard1":{
      "range":"80000000-7fffffff",
      "replicas":{
        "core_node2":{
          "core":"coll_NRT_PULL_shard1_replica_n1",
          "node_name":"127.0.0.1:39581_solr",
          "type":"NRT",
          "state":"active",
          "leader":"true",
          "force_set_state":"false",
          "base_url":"https://127.0.0.1:39581/solr"},
        "core_node4":{
          "core":"coll_NRT_PULL_shard1_replica_p3",
          "node_name":"127.0.0.1:33243_solr",
          "type":"PULL",
          "state":"active",
          "force_set_state":"false",
          "base_url":"https://127.0.0.1:33243/solr"}},
      "state":"active"},
    "shard1_0":{
      "parent":"shard1",
      "stateTimestamp":"1708771480919306693",
      "shard_parent_node":"127.0.0.1:39581_solr",
      "replicas":{
        "core_node7":{
          "core":"coll_NRT_PULL_shard1_0_replica_n5",
          "node_name":"127.0.0.1:39581_solr",
          "type":"NRT",
          "state":"active",
          "leader":"true",
          "force_set_state":"false",
          "base_url":"https://127.0.0.1:39581/solr"},
        "core_node9":{
          "core":"coll_NRT_PULL_shard1_0_replica_p0",
          "node_name":"127.0.0.1:33243_solr",
          "type":"PULL",
          "state":"active",
          "force_set_state":"false",
          "base_url":"https://127.0.0.1:33243/solr"}},
      "range":"80000000-ffffffff",
      "state":"recovery",
      "shard_parent_zk_session":"72177031074349063"},
    "shard1_1":{
      "parent":"shard1",
      "stateTimestamp":"1708771480919281255",
      "shard_parent_node":"127.0.0.1:39581_solr",
      "replicas":{
        "core_node8":{
          "core":"coll_NRT_PULL_shard1_1_replica_n6",
          "node_name":"127.0.0.1:39581_solr",
          "type":"NRT",
          "state":"active",
          "leader":"true",
          "force_set_state":"false",
          "base_url":"https://127.0.0.1:39581/solr"},
        "core_node10":{
          "core":"coll_NRT_PULL_shard1_1_replica_p1",
          "node_name":"127.0.0.1:33243_solr",
          "type":"PULL",
          "state":"active",
          "force_set_state":"false",
          "base_url":"https://127.0.0.1:33243/solr"}},
      "range":"0-7fffffff",
      "state":"recovery",
      "shard_parent_zk_session":"72177031074349063"}}}
	at __randomizedtesting.SeedInfo.seed([3843199A8471397C:E2E58BBE20BF7401]:0)
	at app//org.junit.Assert.fail(Assert.java:89)
	at app//org.apache.solr.cloud.SolrCloudTestCase.waitForState(SolrCloudTestCase.java:205)
	at app//org.apache.solr.cloud.SolrCloudTestCase.waitForState(SolrCloudTestCase.java:171)
	at app//org.apache.solr.cloud.SplitShardWithNodeRoleTest.doSplit(SplitShardWithNodeRoleTest.java:94)
	at app//org.apache.solr.cloud.SplitShardWithNodeRoleTest.testSolrClusterWithNodeRoleWithPull(SplitShardWithNodeRoleTest.java:68)
	at java.base@20.0.2/jdk.internal.reflect.DirectMethodHandleAccessor.invoke(DirectMethodHandleAccessor.java:104)
	at java.base@20.0.2/java.lang.reflect.Method.invoke(Method.java:578)
	at app//com.carrotsearch.randomizedtesting.RandomizedRunner.invoke(RandomizedRunner.java:1758)
	at app//com.carrotsearch.randomizedtesting.RandomizedRunner$8.evaluate(RandomizedRunner.java:946)
	at app//com.carrotsearch.randomizedtesting.RandomizedRunner$9.evaluate(RandomizedRunner.java:982)
	at app//com.carrotsearch.randomizedtesting.RandomizedRunner$10.evaluate(RandomizedRunner.java:996)
	at app//com.carrotsearch.randomizedtesting.rules.SystemPropertiesRestoreRule$1.evaluate(SystemPropertiesRestoreRule.java:80)
	at app//org.junit.rules.RunRules.evaluate(RunRules.java:20)
	at app//org.apache.lucene.tests.util.TestRuleSetupTeardownChained$1.evaluate(TestRuleSetupTeardownChained.java:48)
	at app//org.apache.lucene.tests.util.AbstractBeforeAfterRule$1.evaluate(AbstractBeforeAfterRule.java:43)
	at app//org.apache.lucene.tests.util.TestRuleThreadAndTestName$1.evaluate(TestRuleThreadAndTestName.java:45)
	at app//org.apache.lucene.tests.util.TestRuleIgnoreAfterMaxFailures$1.evaluate(TestRuleIgnoreAfterMaxFailures.java:60)
	at app//org.apache.lucene.tests.util.TestRuleMarkFailure$1.evaluate(TestRuleMarkFailure.java:44)
	at app//org.junit.rules.RunRules.evaluate(RunRules.java:20)
	at app//com.carrotsearch.randomizedtesting.rules.StatementAdapter.evaluate(StatementAdapter.java:36)
	at app//com.carrotsearch.randomizedtesting.ThreadLeakControl$StatementRunner.run(ThreadLeakControl.java:390)
	at app//com.carrotsearch.randomizedtesting.ThreadLeakControl.forkTimeoutingTask(ThreadLeakControl.java:843)
	at app//com.carrotsearch.randomizedtesting.ThreadLeakControl$3.evaluate(ThreadLeakControl.java:490)
	at app//com.carrotsearch.randomizedtesting.RandomizedRunner.runSingleTest(RandomizedRunner.java:955)
	at app//com.carrotsearch.randomizedtesting.RandomizedRunner$5.evaluate(RandomizedRunner.java:840)
	at app//com.carrotsearch.randomizedtesting.RandomizedRunner$6.evaluate(RandomizedRunner.java:891)
	at app//com.carrotsearch.randomizedtesting.RandomizedRunner$7.evaluate(RandomizedRunner.java:902)
	at app//com.carrotsearch.randomizedtesting.rules.StatementAdapter.evaluate(StatementAdapter.java:36)
	at app//com.carrotsearch.randomizedtesting.rules.StatementAdapter.evaluate(StatementAdapter.java:36)
	at app//org.apache.lucene.tests.util.AbstractBeforeAfterRule$1.evaluate(AbstractBeforeAfterRule.java:43)
	at app//com.carrotsearch.randomizedtesting.rules.SystemPropertiesRestoreRule$1.evaluate(SystemPropertiesRestoreRule.java:80)
	at app//org.junit.rules.RunRules.evaluate(RunRules.java:20)
	at app//org.apache.lucene.tests.util.AbstractBeforeAfterRule$1.evaluate(AbstractBeforeAfterRule.java:43)
	at app//com.carrotsearch.randomizedtesting.rules.StatementAdapter.evaluate(StatementAdapter.java:36)
	at app//org.apache.lucene.tests.util.TestRuleStoreClassName$1.evaluate(TestRuleStoreClassName.java:38)
	at app//com.carrotsearch.randomizedtesting.rules.NoShadowingOrOverridesOnMethodsRule$1.evaluate(NoShadowingOrOverridesOnMethodsRule.java:40)
	at app//com.carrotsearch.randomizedtesting.rules.NoShadowingOrOverridesOnMethodsRule$1.evaluate(NoShadowingOrOverridesOnMethodsRule.java:40)
	at app//com.carrotsearch.randomizedtesting.rules.StatementAdapter.evaluate(StatementAdapter.java:36)
	at app//com.carrotsearch.randomizedtesting.rules.StatementAdapter.evaluate(StatementAdapter.java:36)
	at app//org.apache.lucene.tests.util.TestRuleAssertionsRequired$1.evaluate(TestRuleAssertionsRequired.java:53)
	at app//org.apache.lucene.tests.util.AbstractBeforeAfterRule$1.evaluate(AbstractBeforeAfterRule.java:43)
	at app//org.apache.lucene.tests.util.TestRuleMarkFailure$1.evaluate(TestRuleMarkFailure.java:44)
	at app//org.apache.lucene.tests.util.TestRuleIgnoreAfterMaxFailures$1.evaluate(TestRuleIgnoreAfterMaxFailures.java:60)
	at app//org.apache.lucene.tests.util.TestRuleIgnoreTestSuites$1.evaluate(TestRuleIgnoreTestSuites.java:47)
	at app//org.junit.rules.RunRules.evaluate(RunRules.java:20)
	at app//com.carrotsearch.randomizedtesting.rules.StatementAdapter.evaluate(StatementAdapter.java:36)
	at app//com.carrotsearch.randomizedtesting.ThreadLeakControl$StatementRunner.run(ThreadLeakControl.java:390)
	at app//com.carrotsearch.randomizedtesting.ThreadLeakControl.lambda$forkTimeoutingTask$0(ThreadLeakControl.java:850)
	at java.base@20.0.2/java.lang.Thread.run(Thread.java:1639)

[JENKINS] Solr-main-Linux (64bit/hotspot/jdk-19) - Build # 16955 - Still Unstable!

Posted by Policeman Jenkins Server <je...@thetaphi.de>.
Build: https://jenkins.thetaphi.de/job/Solr-main-Linux/16955/
Java: 64bit/hotspot/jdk-19 -XX:+UseCompressedOops -XX:+UseParallelGC

1 tests failed.
FAILED:  org.apache.solr.search.stats.TestDistribIDF.testDisableDistribStats

Error Message:
java.lang.AssertionError: stats cache hit

Stack Trace:
java.lang.AssertionError: stats cache hit
	at __randomizedtesting.SeedInfo.seed([77B7BBC2EF98A7E9:5B39C54095C47BD4]:0)
	at org.junit.Assert.fail(Assert.java:89)
	at org.junit.Assert.assertTrue(Assert.java:42)
	at org.junit.Assert.assertNotNull(Assert.java:713)
	at org.apache.solr.search.stats.TestDistribIDF.testDisableDistribStats(TestDistribIDF.java:317)
	at java.base/jdk.internal.reflect.DirectMethodHandleAccessor.invoke(DirectMethodHandleAccessor.java:104)
	at java.base/java.lang.reflect.Method.invoke(Method.java:578)
	at com.carrotsearch.randomizedtesting.RandomizedRunner.invoke(RandomizedRunner.java:1758)
	at com.carrotsearch.randomizedtesting.RandomizedRunner$8.evaluate(RandomizedRunner.java:946)
	at com.carrotsearch.randomizedtesting.RandomizedRunner$9.evaluate(RandomizedRunner.java:982)
	at com.carrotsearch.randomizedtesting.RandomizedRunner$10.evaluate(RandomizedRunner.java:996)
	at com.carrotsearch.randomizedtesting.rules.SystemPropertiesRestoreRule$1.evaluate(SystemPropertiesRestoreRule.java:80)
	at org.junit.rules.RunRules.evaluate(RunRules.java:20)
	at org.apache.lucene.tests.util.TestRuleSetupTeardownChained$1.evaluate(TestRuleSetupTeardownChained.java:48)
	at org.apache.lucene.tests.util.AbstractBeforeAfterRule$1.evaluate(AbstractBeforeAfterRule.java:43)
	at org.apache.lucene.tests.util.TestRuleThreadAndTestName$1.evaluate(TestRuleThreadAndTestName.java:45)
	at org.apache.lucene.tests.util.TestRuleIgnoreAfterMaxFailures$1.evaluate(TestRuleIgnoreAfterMaxFailures.java:60)
	at org.apache.lucene.tests.util.TestRuleMarkFailure$1.evaluate(TestRuleMarkFailure.java:44)
	at org.junit.rules.RunRules.evaluate(RunRules.java:20)
	at com.carrotsearch.randomizedtesting.rules.StatementAdapter.evaluate(StatementAdapter.java:36)
	at com.carrotsearch.randomizedtesting.ThreadLeakControl$StatementRunner.run(ThreadLeakControl.java:390)
	at com.carrotsearch.randomizedtesting.ThreadLeakControl.forkTimeoutingTask(ThreadLeakControl.java:843)
	at com.carrotsearch.randomizedtesting.ThreadLeakControl$3.evaluate(ThreadLeakControl.java:490)
	at com.carrotsearch.randomizedtesting.RandomizedRunner.runSingleTest(RandomizedRunner.java:955)
	at com.carrotsearch.randomizedtesting.RandomizedRunner$5.evaluate(RandomizedRunner.java:840)
	at com.carrotsearch.randomizedtesting.RandomizedRunner$6.evaluate(RandomizedRunner.java:891)
	at com.carrotsearch.randomizedtesting.RandomizedRunner$7.evaluate(RandomizedRunner.java:902)
	at com.carrotsearch.randomizedtesting.rules.StatementAdapter.evaluate(StatementAdapter.java:36)
	at com.carrotsearch.randomizedtesting.rules.StatementAdapter.evaluate(StatementAdapter.java:36)
	at org.apache.lucene.tests.util.AbstractBeforeAfterRule$1.evaluate(AbstractBeforeAfterRule.java:43)
	at com.carrotsearch.randomizedtesting.rules.SystemPropertiesRestoreRule$1.evaluate(SystemPropertiesRestoreRule.java:80)
	at org.junit.rules.RunRules.evaluate(RunRules.java:20)
	at org.apache.lucene.tests.util.AbstractBeforeAfterRule$1.evaluate(AbstractBeforeAfterRule.java:43)
	at com.carrotsearch.randomizedtesting.rules.StatementAdapter.evaluate(StatementAdapter.java:36)
	at org.apache.lucene.tests.util.TestRuleStoreClassName$1.evaluate(TestRuleStoreClassName.java:38)
	at com.carrotsearch.randomizedtesting.rules.NoShadowingOrOverridesOnMethodsRule$1.evaluate(NoShadowingOrOverridesOnMethodsRule.java:40)
	at com.carrotsearch.randomizedtesting.rules.NoShadowingOrOverridesOnMethodsRule$1.evaluate(NoShadowingOrOverridesOnMethodsRule.java:40)
	at com.carrotsearch.randomizedtesting.rules.StatementAdapter.evaluate(StatementAdapter.java:36)
	at com.carrotsearch.randomizedtesting.rules.StatementAdapter.evaluate(StatementAdapter.java:36)
	at org.apache.lucene.tests.util.TestRuleAssertionsRequired$1.evaluate(TestRuleAssertionsRequired.java:53)
	at org.apache.lucene.tests.util.AbstractBeforeAfterRule$1.evaluate(AbstractBeforeAfterRule.java:43)
	at org.apache.lucene.tests.util.TestRuleMarkFailure$1.evaluate(TestRuleMarkFailure.java:44)
	at org.apache.lucene.tests.util.TestRuleIgnoreAfterMaxFailures$1.evaluate(TestRuleIgnoreAfterMaxFailures.java:60)
	at org.apache.lucene.tests.util.TestRuleIgnoreTestSuites$1.evaluate(TestRuleIgnoreTestSuites.java:47)
	at org.junit.rules.RunRules.evaluate(RunRules.java:20)
	at com.carrotsearch.randomizedtesting.rules.StatementAdapter.evaluate(StatementAdapter.java:36)
	at com.carrotsearch.randomizedtesting.ThreadLeakControl$StatementRunner.run(ThreadLeakControl.java:390)
	at com.carrotsearch.randomizedtesting.ThreadLeakControl.lambda$forkTimeoutingTask$0(ThreadLeakControl.java:850)
	at java.base/java.lang.Thread.run(Thread.java:1589)