You are viewing a plain text version of this content. The canonical link for it is here.
Posted to dev@lucene.apache.org by Policeman Jenkins Server <je...@thetaphi.de> on 2013/12/16 00:58:11 UTC
[JENKINS] Lucene-Solr-4.x-Windows (32bit/jdk1.6.0_45) - Build #
3494 - Failure!
Build: http://jenkins.thetaphi.de/job/Lucene-Solr-4.x-Windows/3494/
Java: 32bit/jdk1.6.0_45 -client -XX:+UseConcMarkSweepGC
1 tests failed.
REGRESSION: org.apache.solr.cloud.CollectionsAPIDistributedZkTest.testDistribSearch
Error Message:
Captured an uncaught exception in thread: Thread[id=4976, name=Thread-2016, state=RUNNABLE, group=TGRP-CollectionsAPIDistributedZkTest]
Stack Trace:
com.carrotsearch.randomizedtesting.UncaughtExceptionError: Captured an uncaught exception in thread: Thread[id=4976, name=Thread-2016, state=RUNNABLE, group=TGRP-CollectionsAPIDistributedZkTest]
at __randomizedtesting.SeedInfo.seed([6BC34A766454FBAE:EA25C46E130B9B92]:0)
Caused by: org.apache.solr.client.solrj.impl.HttpSolrServer$RemoteSolrException: collection already exists: awholynewstresscollection_collection0_0
at __randomizedtesting.SeedInfo.seed([6BC34A766454FBAE]:0)
at org.apache.solr.client.solrj.impl.HttpSolrServer.request(HttpSolrServer.java:495)
at org.apache.solr.client.solrj.impl.HttpSolrServer.request(HttpSolrServer.java:199)
at org.apache.solr.client.solrj.impl.LBHttpSolrServer.request(LBHttpSolrServer.java:283)
at org.apache.solr.client.solrj.impl.CloudSolrServer.request(CloudSolrServer.java:640)
at org.apache.solr.cloud.AbstractFullDistribZkTestBase.createCollection(AbstractFullDistribZkTestBase.java:1607)
at org.apache.solr.cloud.AbstractFullDistribZkTestBase.createCollection(AbstractFullDistribZkTestBase.java:1633)
at org.apache.solr.cloud.CollectionsAPIDistributedZkTest$1CollectionThread.run(CollectionsAPIDistributedZkTest.java:916)
Build Log:
[...truncated 9888 lines...]
[junit4] Suite: org.apache.solr.cloud.CollectionsAPIDistributedZkTest
[junit4] 2> 2014205 T4668 oas.BaseDistributedSearchTestCase.initHostContext Setting hostContext system property: /
[junit4] 2> 2014212 T4668 oas.SolrTestCaseJ4.setUp ###Starting testDistribSearch
[junit4] 2> Creating dataDir: C:\Users\JenkinsSlave\workspace\Lucene-Solr-4.x-Windows\solr\build\solr-core\test\J0\.\solrtest-CollectionsAPIDistributedZkTest-1387149268236
[junit4] 2> 2014217 T4668 oasc.ZkTestServer.run STARTING ZK TEST SERVER
[junit4] 2> 2014218 T4669 oasc.ZkTestServer$ZKServerMain.runFromConfig Starting server
[junit4] 2> 2014301 T4668 oasc.ZkTestServer.run start zk server on port:62649
[junit4] 2> 2014302 T4668 oascc.ConnectionManager.waitForConnected Waiting for client to connect to ZooKeeper
[junit4] 2> 2014310 T4675 oascc.ConnectionManager.process Watcher org.apache.solr.common.cloud.ConnectionManager@1a4e5f9 name:ZooKeeperConnection Watcher:127.0.0.1:62649 got event WatchedEvent state:SyncConnected type:None path:null path:null type:None
[junit4] 2> 2014311 T4668 oascc.ConnectionManager.waitForConnected Client is connected to ZooKeeper
[junit4] 2> 2014311 T4668 oascc.SolrZkClient.makePath makePath: /solr
[junit4] 2> 2014321 T4670 oazs.NIOServerCnxn.doIO WARN caught end of stream exception EndOfStreamException: Unable to read additional data from client sessionid 0x142f88a15190000, likely client has closed socket
[junit4] 2> at org.apache.zookeeper.server.NIOServerCnxn.doIO(NIOServerCnxn.java:220)
[junit4] 2> at org.apache.zookeeper.server.NIOServerCnxnFactory.run(NIOServerCnxnFactory.java:208)
[junit4] 2> at java.lang.Thread.run(Thread.java:662)
[junit4] 2>
[junit4] 2> 2014322 T4668 oascc.ConnectionManager.waitForConnected Waiting for client to connect to ZooKeeper
[junit4] 2> 2014327 T4677 oascc.ConnectionManager.process Watcher org.apache.solr.common.cloud.ConnectionManager@1ad7885 name:ZooKeeperConnection Watcher:127.0.0.1:62649/solr got event WatchedEvent state:SyncConnected type:None path:null path:null type:None
[junit4] 2> 2014328 T4668 oascc.ConnectionManager.waitForConnected Client is connected to ZooKeeper
[junit4] 2> 2014328 T4668 oascc.SolrZkClient.makePath makePath: /collections/collection1
[junit4] 2> 2014338 T4668 oascc.SolrZkClient.makePath makePath: /collections/collection1/shards
[junit4] 2> 2014346 T4668 oascc.SolrZkClient.makePath makePath: /collections/control_collection
[junit4] 2> 2014354 T4668 oascc.SolrZkClient.makePath makePath: /collections/control_collection/shards
[junit4] 2> 2014363 T4668 oasc.AbstractZkTestCase.putConfig put C:\Users\JenkinsSlave\workspace\Lucene-Solr-4.x-Windows\solr\build\solr-core\test-files\solr\collection1\conf\solrconfig-tlog.xml to /configs/conf1/solrconfig.xml
[junit4] 2> 2014366 T4668 oascc.SolrZkClient.makePath makePath: /configs/conf1/solrconfig.xml
[junit4] 2> 2014379 T4668 oasc.AbstractZkTestCase.putConfig put C:\Users\JenkinsSlave\workspace\Lucene-Solr-4.x-Windows\solr\build\solr-core\test-files\solr\collection1\conf\schema.xml to /configs/conf1/schema.xml
[junit4] 2> 2014379 T4668 oascc.SolrZkClient.makePath makePath: /configs/conf1/schema.xml
[junit4] 2> 2014391 T4668 oasc.AbstractZkTestCase.putConfig put C:\Users\JenkinsSlave\workspace\Lucene-Solr-4.x-Windows\solr\build\solr-core\test-files\solr\collection1\conf\solrconfig.snippet.randomindexconfig.xml to /configs/conf1/solrconfig.snippet.randomindexconfig.xml
[junit4] 2> 2014391 T4668 oascc.SolrZkClient.makePath makePath: /configs/conf1/solrconfig.snippet.randomindexconfig.xml
[junit4] 2> 2014401 T4668 oasc.AbstractZkTestCase.putConfig put C:\Users\JenkinsSlave\workspace\Lucene-Solr-4.x-Windows\solr\build\solr-core\test-files\solr\collection1\conf\stopwords.txt to /configs/conf1/stopwords.txt
[junit4] 2> 2014401 T4668 oascc.SolrZkClient.makePath makePath: /configs/conf1/stopwords.txt
[junit4] 2> 2014411 T4668 oasc.AbstractZkTestCase.putConfig put C:\Users\JenkinsSlave\workspace\Lucene-Solr-4.x-Windows\solr\build\solr-core\test-files\solr\collection1\conf\protwords.txt to /configs/conf1/protwords.txt
[junit4] 2> 2014411 T4668 oascc.SolrZkClient.makePath makePath: /configs/conf1/protwords.txt
[junit4] 2> 2014421 T4668 oasc.AbstractZkTestCase.putConfig put C:\Users\JenkinsSlave\workspace\Lucene-Solr-4.x-Windows\solr\build\solr-core\test-files\solr\collection1\conf\currency.xml to /configs/conf1/currency.xml
[junit4] 2> 2014421 T4668 oascc.SolrZkClient.makePath makePath: /configs/conf1/currency.xml
[junit4] 2> 2014431 T4668 oasc.AbstractZkTestCase.putConfig put C:\Users\JenkinsSlave\workspace\Lucene-Solr-4.x-Windows\solr\build\solr-core\test-files\solr\collection1\conf\enumsConfig.xml to /configs/conf1/enumsConfig.xml
[junit4] 2> 2014431 T4668 oascc.SolrZkClient.makePath makePath: /configs/conf1/enumsConfig.xml
[junit4] 2> 2014443 T4668 oasc.AbstractZkTestCase.putConfig put C:\Users\JenkinsSlave\workspace\Lucene-Solr-4.x-Windows\solr\build\solr-core\test-files\solr\collection1\conf\open-exchange-rates.json to /configs/conf1/open-exchange-rates.json
[junit4] 2> 2014443 T4668 oascc.SolrZkClient.makePath makePath: /configs/conf1/open-exchange-rates.json
[junit4] 2> 2014454 T4668 oasc.AbstractZkTestCase.putConfig put C:\Users\JenkinsSlave\workspace\Lucene-Solr-4.x-Windows\solr\build\solr-core\test-files\solr\collection1\conf\mapping-ISOLatin1Accent.txt to /configs/conf1/mapping-ISOLatin1Accent.txt
[junit4] 2> 2014454 T4668 oascc.SolrZkClient.makePath makePath: /configs/conf1/mapping-ISOLatin1Accent.txt
[junit4] 2> 2014464 T4668 oasc.AbstractZkTestCase.putConfig put C:\Users\JenkinsSlave\workspace\Lucene-Solr-4.x-Windows\solr\build\solr-core\test-files\solr\collection1\conf\old_synonyms.txt to /configs/conf1/old_synonyms.txt
[junit4] 2> 2014465 T4668 oascc.SolrZkClient.makePath makePath: /configs/conf1/old_synonyms.txt
[junit4] 2> 2014474 T4668 oasc.AbstractZkTestCase.putConfig put C:\Users\JenkinsSlave\workspace\Lucene-Solr-4.x-Windows\solr\build\solr-core\test-files\solr\collection1\conf\synonyms.txt to /configs/conf1/synonyms.txt
[junit4] 2> 2014474 T4668 oascc.SolrZkClient.makePath makePath: /configs/conf1/synonyms.txt
[junit4] 2> Using new style solr.xml
[junit4] 2> 2014488 T4668 oascc.ConnectionManager.waitForConnected Waiting for client to connect to ZooKeeper
[junit4] 2> 2014492 T4679 oascc.ConnectionManager.process Watcher org.apache.solr.common.cloud.ConnectionManager@3b5939 name:ZooKeeperConnection Watcher:127.0.0.1:62649 got event WatchedEvent state:SyncConnected type:None path:null path:null type:None
[junit4] 2> 2014492 T4668 oascc.ConnectionManager.waitForConnected Client is connected to ZooKeeper
[junit4] 2> 2014492 T4668 oascc.SolrZkClient.makePath makePath: /solr
[junit4] 2> 2014505 T4668 oascc.ConnectionManager.waitForConnected Waiting for client to connect to ZooKeeper
[junit4] 2> 2014510 T4681 oascc.ConnectionManager.process Watcher org.apache.solr.common.cloud.ConnectionManager@1ea62c1 name:ZooKeeperConnection Watcher:127.0.0.1:62649/solr got event WatchedEvent state:SyncConnected type:None path:null path:null type:None
[junit4] 2> 2014511 T4668 oascc.ConnectionManager.waitForConnected Client is connected to ZooKeeper
[junit4] 2> 2014514 T4668 oasc.AbstractZkTestCase.putConfig put C:\Users\JenkinsSlave\workspace\Lucene-Solr-4.x-Windows\solr\build\solr-core\test-files\solr\collection1\conf\solrconfig.xml to /configs/conf2/solrconfig.xml
[junit4] 2> 2014515 T4668 oascc.SolrZkClient.makePath makePath: /configs/conf2/solrconfig.xml
[junit4] 2> 2014527 T4668 oasc.AbstractZkTestCase.putConfig put C:\Users\JenkinsSlave\workspace\Lucene-Solr-4.x-Windows\solr\build\solr-core\test-files\solr\collection1\conf\schema.xml to /configs/conf2/schema.xml
[junit4] 2> 2014527 T4668 oascc.SolrZkClient.makePath makePath: /configs/conf2/schema.xml
[junit4] 2> 2014541 T4668 oasc.AbstractZkTestCase.putConfig put C:\Users\JenkinsSlave\workspace\Lucene-Solr-4.x-Windows\solr\build\solr-core\test-files\solr\collection1\conf\solrconfig.snippet.randomindexconfig.xml to /configs/conf2/solrconfig.snippet.randomindexconfig.xml
[junit4] 2> 2014541 T4668 oascc.SolrZkClient.makePath makePath: /configs/conf2/solrconfig.snippet.randomindexconfig.xml
[junit4] 2> 2014564 T4668 oasc.AbstractZkTestCase.putConfig put C:\Users\JenkinsSlave\workspace\Lucene-Solr-4.x-Windows\solr\build\solr-core\test-files\solr\collection1\conf\stopwords.txt to /configs/conf2/stopwords.txt
[junit4] 2> 2014564 T4668 oascc.SolrZkClient.makePath makePath: /configs/conf2/stopwords.txt
[junit4] 2> 2014574 T4668 oasc.AbstractZkTestCase.putConfig put C:\Users\JenkinsSlave\workspace\Lucene-Solr-4.x-Windows\solr\build\solr-core\test-files\solr\collection1\conf\protwords.txt to /configs/conf2/protwords.txt
[junit4] 2> 2014574 T4668 oascc.SolrZkClient.makePath makePath: /configs/conf2/protwords.txt
[junit4] 2> 2014588 T4668 oasc.AbstractZkTestCase.putConfig put C:\Users\JenkinsSlave\workspace\Lucene-Solr-4.x-Windows\solr\build\solr-core\test-files\solr\collection1\conf\currency.xml to /configs/conf2/currency.xml
[junit4] 2> 2014589 T4668 oascc.SolrZkClient.makePath makePath: /configs/conf2/currency.xml
[junit4] 2> 2014598 T4668 oasc.AbstractZkTestCase.putConfig put C:\Users\JenkinsSlave\workspace\Lucene-Solr-4.x-Windows\solr\build\solr-core\test-files\solr\collection1\conf\open-exchange-rates.json to /configs/conf2/open-exchange-rates.json
[junit4] 2> 2014599 T4668 oascc.SolrZkClient.makePath makePath: /configs/conf2/open-exchange-rates.json
[junit4] 2> 2014609 T4668 oasc.AbstractZkTestCase.putConfig put C:\Users\JenkinsSlave\workspace\Lucene-Solr-4.x-Windows\solr\build\solr-core\test-files\solr\collection1\conf\mapping-ISOLatin1Accent.txt to /configs/conf2/mapping-ISOLatin1Accent.txt
[junit4] 2> 2014611 T4668 oascc.SolrZkClient.makePath makePath: /configs/conf2/mapping-ISOLatin1Accent.txt
[junit4] 2> 2014619 T4668 oasc.AbstractZkTestCase.putConfig put C:\Users\JenkinsSlave\workspace\Lucene-Solr-4.x-Windows\solr\build\solr-core\test-files\solr\collection1\conf\old_synonyms.txt to /configs/conf2/old_synonyms.txt
[junit4] 2> 2014619 T4668 oascc.SolrZkClient.makePath makePath: /configs/conf2/old_synonyms.txt
[junit4] 2> 2014629 T4668 oasc.AbstractZkTestCase.putConfig put C:\Users\JenkinsSlave\workspace\Lucene-Solr-4.x-Windows\solr\build\solr-core\test-files\solr\collection1\conf\synonyms.txt to /configs/conf2/synonyms.txt
[junit4] 2> 2014630 T4668 oascc.SolrZkClient.makePath makePath: /configs/conf2/synonyms.txt
[junit4] 2> 2014639 T4668 oasc.AbstractZkTestCase.putConfig put C:\Users\JenkinsSlave\workspace\Lucene-Solr-4.x-Windows\solr\build\solr-core\test-files\solr\collection1\conf\elevate.xml to /configs/conf2/elevate.xml
[junit4] 2> 2014639 T4668 oascc.SolrZkClient.makePath makePath: /configs/conf2/elevate.xml
[junit4] 2> 2015299 T4668 oejs.Server.doStart jetty-8.1.10.v20130312
[junit4] 2> 2015319 T4668 oejs.AbstractConnector.doStart Started SelectChannelConnector@127.0.0.1:62662
[junit4] 2> 2015319 T4668 oass.SolrDispatchFilter.init SolrDispatchFilter.init()
[junit4] 2> 2015319 T4668 oasc.SolrResourceLoader.locateSolrHome JNDI not configured for solr (NoInitialContextEx)
[junit4] 2> 2015322 T4668 oasc.SolrResourceLoader.locateSolrHome using system property solr.solr.home: ..\..\..\..\..\..\..\..\..\Users\JenkinsSlave\workspace\Lucene-Solr-4.x-Windows\solr\build\solr-core\test\J0\.\org.apache.solr.cloud.CollectionsAPIDistributedZkTest-controljetty-1387149268675
[junit4] 2> 2015322 T4668 oasc.SolrResourceLoader.<init> new SolrResourceLoader for directory: '..\..\..\..\..\..\..\..\..\Users\JenkinsSlave\workspace\Lucene-Solr-4.x-Windows\solr\build\solr-core\test\J0\.\org.apache.solr.cloud.CollectionsAPIDistributedZkTest-controljetty-1387149268675\'
[junit4] 2> 2015368 T4668 oasc.ConfigSolr.fromFile Loading container configuration from C:\Users\JenkinsSlave\workspace\Lucene-Solr-4.x-Windows\solr\build\solr-core\test\J0\..\..\..\..\..\..\..\..\..\Users\JenkinsSlave\workspace\Lucene-Solr-4.x-Windows\solr\build\solr-core\test\J0\.\org.apache.solr.cloud.CollectionsAPIDistributedZkTest-controljetty-1387149268675\solr.xml
[junit4] 2> 2015487 T4668 oasc.ConfigSolrXml.<init> Config-defined core root directory:
[junit4] 2> 2015487 T4668 oasc.CoreContainer.<init> New CoreContainer 5460047
[junit4] 2> 2015489 T4668 oasc.CoreContainer.load Loading cores into CoreContainer [instanceDir=..\..\..\..\..\..\..\..\..\Users\JenkinsSlave\workspace\Lucene-Solr-4.x-Windows\solr\build\solr-core\test\J0\.\org.apache.solr.cloud.CollectionsAPIDistributedZkTest-controljetty-1387149268675\]
[junit4] 2> 2015492 T4668 oashc.HttpShardHandlerFactory.getParameter Setting socketTimeout to: 90000
[junit4] 2> 2015492 T4668 oashc.HttpShardHandlerFactory.getParameter Setting urlScheme to: http://
[junit4] 2> 2015492 T4668 oashc.HttpShardHandlerFactory.getParameter Setting connTimeout to: 15000
[junit4] 2> 2015492 T4668 oashc.HttpShardHandlerFactory.getParameter Setting maxConnectionsPerHost to: 20
[junit4] 2> 2015492 T4668 oashc.HttpShardHandlerFactory.getParameter Setting corePoolSize to: 0
[junit4] 2> 2015495 T4668 oashc.HttpShardHandlerFactory.getParameter Setting maximumPoolSize to: 2147483647
[junit4] 2> 2015495 T4668 oashc.HttpShardHandlerFactory.getParameter Setting maxThreadIdleTime to: 5
[junit4] 2> 2015495 T4668 oashc.HttpShardHandlerFactory.getParameter Setting sizeOfQueue to: -1
[junit4] 2> 2015495 T4668 oashc.HttpShardHandlerFactory.getParameter Setting fairnessPolicy to: false
[junit4] 2> 2015503 T4668 oasl.LogWatcher.createWatcher SLF4J impl is org.slf4j.impl.Log4jLoggerFactory
[junit4] 2> 2015503 T4668 oasl.LogWatcher.newRegisteredLogWatcher Registering Log Listener [Log4j (org.slf4j.impl.Log4jLoggerFactory)]
[junit4] 2> 2015503 T4668 oasc.CoreContainer.load Host Name: 127.0.0.1
[junit4] 2> 2015503 T4668 oasc.ZkContainer.initZooKeeper Zookeeper client=127.0.0.1:62649/solr
[junit4] 2> 2015505 T4668 oasc.ZkController.checkChrootPath zkHost includes chroot
[junit4] 2> 2015507 T4668 oascc.ConnectionManager.waitForConnected Waiting for client to connect to ZooKeeper
[junit4] 2> 2015515 T4692 oascc.ConnectionManager.process Watcher org.apache.solr.common.cloud.ConnectionManager@1bd76ce name:ZooKeeperConnection Watcher:127.0.0.1:62649 got event WatchedEvent state:SyncConnected type:None path:null path:null type:None
[junit4] 2> 2015515 T4668 oascc.ConnectionManager.waitForConnected Client is connected to ZooKeeper
[junit4] 2> 2015523 T4668 oascc.ConnectionManager.waitForConnected Waiting for client to connect to ZooKeeper
[junit4] 2> 2015527 T4694 oascc.ConnectionManager.process Watcher org.apache.solr.common.cloud.ConnectionManager@1b48373 name:ZooKeeperConnection Watcher:127.0.0.1:62649/solr got event WatchedEvent state:SyncConnected type:None path:null path:null type:None
[junit4] 2> 2015527 T4668 oascc.ConnectionManager.waitForConnected Client is connected to ZooKeeper
[junit4] 2> 2015531 T4668 oascc.SolrZkClient.makePath makePath: /overseer/queue
[junit4] 2> 2015543 T4668 oascc.SolrZkClient.makePath makePath: /overseer/collection-queue-work
[junit4] 2> 2015552 T4668 oascc.SolrZkClient.makePath makePath: /live_nodes
[junit4] 2> 2015557 T4668 oasc.ZkController.createEphemeralLiveNode Register node as live in ZooKeeper:/live_nodes/127.0.0.1:62662_
[junit4] 2> 2015560 T4668 oascc.SolrZkClient.makePath makePath: /live_nodes/127.0.0.1:62662_
[junit4] 2> 2015568 T4668 oascc.SolrZkClient.makePath makePath: /overseer_elect/election
[junit4] 2> 2015584 T4668 oascc.SolrZkClient.makePath makePath: /overseer_elect/leader
[junit4] 2> 2015591 T4668 oasc.Overseer.start Overseer (id=90908214443966469-127.0.0.1:62662_-n_0000000000) starting
[junit4] 2> 2015601 T4668 oascc.SolrZkClient.makePath makePath: /overseer/queue-work
[junit4] 2> 2015613 T4696 oasc.OverseerCollectionProcessor.run Process current queue of collection creations
[junit4] 2> 2015615 T4668 oascc.SolrZkClient.makePath makePath: /clusterstate.json
[junit4] 2> 2015622 T4668 oascc.SolrZkClient.makePath makePath: /aliases.json
[junit4] 2> 2015627 T4668 oascc.ZkStateReader.createClusterStateWatchersAndUpdate Updating cluster state from ZooKeeper...
[junit4] 2> 2015636 T4695 oasc.Overseer$ClusterStateUpdater.run Starting to work on the main queue
[junit4] 2> 2015638 T4668 oasc.CorePropertiesLocator.discover Looking for core definitions underneath C:\Users\JenkinsSlave\workspace\Lucene-Solr-4.x-Windows\solr\build\solr-core\test\J0\..\..\..\..\..\..\..\..\..\Users\JenkinsSlave\workspace\Lucene-Solr-4.x-Windows\solr\build\solr-core\test\J0\.\org.apache.solr.cloud.CollectionsAPIDistributedZkTest-controljetty-1387149268675
[junit4] 2> 2015975 T4668 oasc.CorePropertiesLocator.discoverUnder Found core conf in C:\Users\JenkinsSlave\workspace\Lucene-Solr-4.x-Windows\solr\build\solr-core\test\J0\..\..\..\..\..\..\..\..\..\Users\JenkinsSlave\workspace\Lucene-Solr-4.x-Windows\solr\build\solr-core\test\J0\.\org.apache.solr.cloud.CollectionsAPIDistributedZkTest-controljetty-1387149268675\conf\
[junit4] 2> 2015988 T4668 oasc.CorePropertiesLocator.discover Found 1 core definitions
[junit4] 2> 2015991 T4668 oass.SolrDispatchFilter.init user.dir=C:\Users\JenkinsSlave\workspace\Lucene-Solr-4.x-Windows\solr\build\solr-core\test\J0
[junit4] 2> 2015991 T4668 oass.SolrDispatchFilter.init SolrDispatchFilter.init() done
[junit4] 2> 2015996 T4668 oascc.ConnectionManager.waitForConnected Waiting for client to connect to ZooKeeper
[junit4] 2> 2016000 T4699 oascc.ConnectionManager.process Watcher org.apache.solr.common.cloud.ConnectionManager@9e1a2f name:ZooKeeperConnection Watcher:127.0.0.1:62649/solr got event WatchedEvent state:SyncConnected type:None path:null path:null type:None
[junit4] 2> 2016000 T4668 oascc.ConnectionManager.waitForConnected Client is connected to ZooKeeper
[junit4] 2> 2016004 T4668 oascc.ZkStateReader.createClusterStateWatchersAndUpdate Updating cluster state from ZooKeeper...
[junit4] 2> 2016013 T4668 oasc.ChaosMonkey.monkeyLog monkey: init - expire sessions:false cause connection loss:false
[junit4] 2> 2016566 T4668 oejs.Server.doStart jetty-8.1.10.v20130312
[junit4] 2> 2016570 T4668 oejs.AbstractConnector.doStart Started SelectChannelConnector@127.0.0.1:62674
[junit4] 2> 2016571 T4668 oass.SolrDispatchFilter.init SolrDispatchFilter.init()
[junit4] 2> 2016572 T4668 oasc.SolrResourceLoader.locateSolrHome JNDI not configured for solr (NoInitialContextEx)
[junit4] 2> 2016572 T4668 oasc.SolrResourceLoader.locateSolrHome using system property solr.solr.home: ..\..\..\..\..\..\..\..\..\Users\JenkinsSlave\workspace\Lucene-Solr-4.x-Windows\solr\build\solr-core\test\J0\.\org.apache.solr.cloud.CollectionsAPIDistributedZkTest-jetty1-1387149270034
[junit4] 2> 2016572 T4668 oasc.SolrResourceLoader.<init> new SolrResourceLoader for directory: '..\..\..\..\..\..\..\..\..\Users\JenkinsSlave\workspace\Lucene-Solr-4.x-Windows\solr\build\solr-core\test\J0\.\org.apache.solr.cloud.CollectionsAPIDistributedZkTest-jetty1-1387149270034\'
[junit4] 2> 2016603 T4668 oasc.ConfigSolr.fromFile Loading container configuration from C:\Users\JenkinsSlave\workspace\Lucene-Solr-4.x-Windows\solr\build\solr-core\test\J0\..\..\..\..\..\..\..\..\..\Users\JenkinsSlave\workspace\Lucene-Solr-4.x-Windows\solr\build\solr-core\test\J0\.\org.apache.solr.cloud.CollectionsAPIDistributedZkTest-jetty1-1387149270034\solr.xml
[junit4] 2> 2016716 T4668 oasc.ConfigSolrXml.<init> Config-defined core root directory:
[junit4] 2> 2016716 T4668 oasc.CoreContainer.<init> New CoreContainer 17244532
[junit4] 2> 2016716 T4668 oasc.CoreContainer.load Loading cores into CoreContainer [instanceDir=..\..\..\..\..\..\..\..\..\Users\JenkinsSlave\workspace\Lucene-Solr-4.x-Windows\solr\build\solr-core\test\J0\.\org.apache.solr.cloud.CollectionsAPIDistributedZkTest-jetty1-1387149270034\]
[junit4] 2> 2016720 T4668 oashc.HttpShardHandlerFactory.getParameter Setting socketTimeout to: 90000
[junit4] 2> 2016720 T4668 oashc.HttpShardHandlerFactory.getParameter Setting urlScheme to: http://
[junit4] 2> 2016720 T4668 oashc.HttpShardHandlerFactory.getParameter Setting connTimeout to: 15000
[junit4] 2> 2016720 T4668 oashc.HttpShardHandlerFactory.getParameter Setting maxConnectionsPerHost to: 20
[junit4] 2> 2016720 T4668 oashc.HttpShardHandlerFactory.getParameter Setting corePoolSize to: 0
[junit4] 2> 2016722 T4668 oashc.HttpShardHandlerFactory.getParameter Setting maximumPoolSize to: 2147483647
[junit4] 2> 2016722 T4668 oashc.HttpShardHandlerFactory.getParameter Setting maxThreadIdleTime to: 5
[junit4] 2> 2016722 T4668 oashc.HttpShardHandlerFactory.getParameter Setting sizeOfQueue to: -1
[junit4] 2> 2016724 T4668 oashc.HttpShardHandlerFactory.getParameter Setting fairnessPolicy to: false
[junit4] 2> 2016736 T4668 oasl.LogWatcher.createWatcher SLF4J impl is org.slf4j.impl.Log4jLoggerFactory
[junit4] 2> 2016736 T4668 oasl.LogWatcher.newRegisteredLogWatcher Registering Log Listener [Log4j (org.slf4j.impl.Log4jLoggerFactory)]
[junit4] 2> 2016737 T4668 oasc.CoreContainer.load Host Name: 127.0.0.1
[junit4] 2> 2016737 T4668 oasc.ZkContainer.initZooKeeper Zookeeper client=127.0.0.1:62649/solr
[junit4] 2> 2016737 T4668 oasc.ZkController.checkChrootPath zkHost includes chroot
[junit4] 2> 2016740 T4668 oascc.ConnectionManager.waitForConnected Waiting for client to connect to ZooKeeper
[junit4] 2> 2016747 T4710 oascc.ConnectionManager.process Watcher org.apache.solr.common.cloud.ConnectionManager@1257c8a name:ZooKeeperConnection Watcher:127.0.0.1:62649 got event WatchedEvent state:SyncConnected type:None path:null path:null type:None
[junit4] 2> 2016748 T4668 oascc.ConnectionManager.waitForConnected Client is connected to ZooKeeper
[junit4] 2> 2016753 T4668 oascc.ConnectionManager.waitForConnected Waiting for client to connect to ZooKeeper
[junit4] 2> 2016757 T4712 oascc.ConnectionManager.process Watcher org.apache.solr.common.cloud.ConnectionManager@2615a8 name:ZooKeeperConnection Watcher:127.0.0.1:62649/solr got event WatchedEvent state:SyncConnected type:None path:null path:null type:None
[junit4] 2> 2016758 T4668 oascc.ConnectionManager.waitForConnected Client is connected to ZooKeeper
[junit4] 2> 2016770 T4668 oascc.ZkStateReader.createClusterStateWatchersAndUpdate Updating cluster state from ZooKeeper...
[junit4] 2> 2017635 T4668 oasc.ZkController.createEphemeralLiveNode Register node as live in ZooKeeper:/live_nodes/127.0.0.1:62674_
[junit4] 2> 2017638 T4668 oascc.SolrZkClient.makePath makePath: /live_nodes/127.0.0.1:62674_
[junit4] 2> 2017650 T4699 oascc.ZkStateReader$3.process Updating live nodes... (2)
[junit4] 2> 2017651 T4694 oascc.ZkStateReader$3.process Updating live nodes... (2)
[junit4] 2> 2017652 T4712 oascc.ZkStateReader$3.process Updating live nodes... (2)
[junit4] 2> 2017665 T4668 oasc.CorePropertiesLocator.discover Looking for core definitions underneath C:\Users\JenkinsSlave\workspace\Lucene-Solr-4.x-Windows\solr\build\solr-core\test\J0\..\..\..\..\..\..\..\..\..\Users\JenkinsSlave\workspace\Lucene-Solr-4.x-Windows\solr\build\solr-core\test\J0\.\org.apache.solr.cloud.CollectionsAPIDistributedZkTest-jetty1-1387149270034
[junit4] 2> 2017980 T4668 oasc.CorePropertiesLocator.discoverUnder Found core conf in C:\Users\JenkinsSlave\workspace\Lucene-Solr-4.x-Windows\solr\build\solr-core\test\J0\..\..\..\..\..\..\..\..\..\Users\JenkinsSlave\workspace\Lucene-Solr-4.x-Windows\solr\build\solr-core\test\J0\.\org.apache.solr.cloud.CollectionsAPIDistributedZkTest-jetty1-1387149270034\conf\
[junit4] 2> 2017994 T4668 oasc.CorePropertiesLocator.discover Found 1 core definitions
[junit4] 2> 2017997 T4668 oass.SolrDispatchFilter.init user.dir=C:\Users\JenkinsSlave\workspace\Lucene-Solr-4.x-Windows\solr\build\solr-core\test\J0
[junit4] 2> 2017997 T4668 oass.SolrDispatchFilter.init SolrDispatchFilter.init() done
[junit4] 2> 2018503 T4668 oejs.Server.doStart jetty-8.1.10.v20130312
[junit4] 2> 2018507 T4668 oejs.AbstractConnector.doStart Started SelectChannelConnector@127.0.0.1:62683
[junit4] 2> 2018509 T4668 oass.SolrDispatchFilter.init SolrDispatchFilter.init()
[junit4] 2> 2018509 T4668 oasc.SolrResourceLoader.locateSolrHome JNDI not configured for solr (NoInitialContextEx)
[junit4] 2> 2018509 T4668 oasc.SolrResourceLoader.locateSolrHome using system property solr.solr.home: .\org.apache.solr.cloud.CollectionsAPIDistributedZkTest-jetty2-1387149272022
[junit4] 2> 2018509 T4668 oasc.SolrResourceLoader.<init> new SolrResourceLoader for directory: '.\org.apache.solr.cloud.CollectionsAPIDistributedZkTest-jetty2-1387149272022\'
[junit4] 2> 2018545 T4668 oasc.ConfigSolr.fromFile Loading container configuration from C:\Users\JenkinsSlave\workspace\Lucene-Solr-4.x-Windows\solr\build\solr-core\test\J0\.\org.apache.solr.cloud.CollectionsAPIDistributedZkTest-jetty2-1387149272022\solr.xml
[junit4] 2> 2018653 T4668 oasc.ConfigSolrXml.<init> Config-defined core root directory:
[junit4] 2> 2018653 T4668 oasc.CoreContainer.<init> New CoreContainer 20655687
[junit4] 2> 2018653 T4668 oasc.CoreContainer.load Loading cores into CoreContainer [instanceDir=.\org.apache.solr.cloud.CollectionsAPIDistributedZkTest-jetty2-1387149272022\]
[junit4] 2> 2018657 T4668 oashc.HttpShardHandlerFactory.getParameter Setting socketTimeout to: 90000
[junit4] 2> 2018657 T4668 oashc.HttpShardHandlerFactory.getParameter Setting urlScheme to: http://
[junit4] 2> 2018657 T4668 oashc.HttpShardHandlerFactory.getParameter Setting connTimeout to: 15000
[junit4] 2> 2018657 T4668 oashc.HttpShardHandlerFactory.getParameter Setting maxConnectionsPerHost to: 20
[junit4] 2> 2018659 T4668 oashc.HttpShardHandlerFactory.getParameter Setting corePoolSize to: 0
[junit4] 2> 2018659 T4668 oashc.HttpShardHandlerFactory.getParameter Setting maximumPoolSize to: 2147483647
[junit4] 2> 2018659 T4668 oashc.HttpShardHandlerFactory.getParameter Setting maxThreadIdleTime to: 5
[junit4] 2> 2018659 T4668 oashc.HttpShardHandlerFactory.getParameter Setting sizeOfQueue to: -1
[junit4] 2> 2018659 T4668 oashc.HttpShardHandlerFactory.getParameter Setting fairnessPolicy to: false
[junit4] 2> 2018669 T4668 oasl.LogWatcher.createWatcher SLF4J impl is org.slf4j.impl.Log4jLoggerFactory
[junit4] 2> 2018670 T4668 oasl.LogWatcher.newRegisteredLogWatcher Registering Log Listener [Log4j (org.slf4j.impl.Log4jLoggerFactory)]
[junit4] 2> 2018670 T4668 oasc.CoreContainer.load Host Name: 127.0.0.1
[junit4] 2> 2018670 T4668 oasc.ZkContainer.initZooKeeper Zookeeper client=127.0.0.1:62649/solr
[junit4] 2> 2018670 T4668 oasc.ZkController.checkChrootPath zkHost includes chroot
[junit4] 2> 2018675 T4668 oascc.ConnectionManager.waitForConnected Waiting for client to connect to ZooKeeper
[junit4] 2> 2018684 T4724 oascc.ConnectionManager.process Watcher org.apache.solr.common.cloud.ConnectionManager@5b7372 name:ZooKeeperConnection Watcher:127.0.0.1:62649 got event WatchedEvent state:SyncConnected type:None path:null path:null type:None
[junit4] 2> 2018686 T4668 oascc.ConnectionManager.waitForConnected Client is connected to ZooKeeper
[junit4] 2> 2018692 T4668 oascc.ConnectionManager.waitForConnected Waiting for client to connect to ZooKeeper
[junit4] 2> 2018697 T4726 oascc.ConnectionManager.process Watcher org.apache.solr.common.cloud.ConnectionManager@1954425 name:ZooKeeperConnection Watcher:127.0.0.1:62649/solr got event WatchedEvent state:SyncConnected type:None path:null path:null type:None
[junit4] 2> 2018698 T4668 oascc.ConnectionManager.waitForConnected Client is connected to ZooKeeper
[junit4] 2> 2018710 T4668 oascc.ZkStateReader.createClusterStateWatchersAndUpdate Updating cluster state from ZooKeeper...
[junit4] 2> 2019624 T4668 oasc.ZkController.createEphemeralLiveNode Register node as live in ZooKeeper:/live_nodes/127.0.0.1:62683_
[junit4] 2> 2019628 T4668 oascc.SolrZkClient.makePath makePath: /live_nodes/127.0.0.1:62683_
[junit4] 2> 2019639 T4694 oascc.ZkStateReader$3.process Updating live nodes... (3)
[junit4] 2> 2019642 T4712 oascc.ZkStateReader$3.process Updating live nodes... (3)
[junit4] 2> 2019642 T4699 oascc.ZkStateReader$3.process Updating live nodes... (3)
[junit4] 2> 2019643 T4726 oascc.ZkStateReader$3.process Updating live nodes... (3)
[junit4] 2> 2019655 T4668 oasc.CorePropertiesLocator.discover Looking for core definitions underneath C:\Users\JenkinsSlave\workspace\Lucene-Solr-4.x-Windows\solr\build\solr-core\test\J0\.\org.apache.solr.cloud.CollectionsAPIDistributedZkTest-jetty2-1387149272022
[junit4] 2> 2019886 T4668 oasc.CorePropertiesLocator.discoverUnder Found core conf in C:\Users\JenkinsSlave\workspace\Lucene-Solr-4.x-Windows\solr\build\solr-core\test\J0\.\org.apache.solr.cloud.CollectionsAPIDistributedZkTest-jetty2-1387149272022\conf\
[junit4] 2> 2019897 T4668 oasc.CorePropertiesLocator.discover Found 1 core definitions
[junit4] 2> 2019900 T4668 oass.SolrDispatchFilter.init user.dir=C:\Users\JenkinsSlave\workspace\Lucene-Solr-4.x-Windows\solr\build\solr-core\test\J0
[junit4] 2> 2019900 T4668 oass.SolrDispatchFilter.init SolrDispatchFilter.init() done
[junit4] 2> 2020486 T4668 oejs.Server.doStart jetty-8.1.10.v20130312
[junit4] 2> 2020492 T4668 oejs.AbstractConnector.doStart Started SelectChannelConnector@127.0.0.1:62692
[junit4] 2> 2020493 T4668 oass.SolrDispatchFilter.init SolrDispatchFilter.init()
[junit4] 2> 2020495 T4668 oasc.SolrResourceLoader.locateSolrHome JNDI not configured for solr (NoInitialContextEx)
[junit4] 2> 2020495 T4668 oasc.SolrResourceLoader.locateSolrHome using system property solr.solr.home: ..\..\..\..\..\..\..\..\..\Users\JenkinsSlave\workspace\Lucene-Solr-4.x-Windows\solr\build\solr-core\test\J0\.\org.apache.solr.cloud.CollectionsAPIDistributedZkTest-jetty3-1387149273925
[junit4] 2> 2020495 T4668 oasc.SolrResourceLoader.<init> new SolrResourceLoader for directory: '..\..\..\..\..\..\..\..\..\Users\JenkinsSlave\workspace\Lucene-Solr-4.x-Windows\solr\build\solr-core\test\J0\.\org.apache.solr.cloud.CollectionsAPIDistributedZkTest-jetty3-1387149273925\'
[junit4] 2> 2020546 T4668 oasc.ConfigSolr.fromFile Loading container configuration from C:\Users\JenkinsSlave\workspace\Lucene-Solr-4.x-Windows\solr\build\solr-core\test\J0\..\..\..\..\..\..\..\..\..\Users\JenkinsSlave\workspace\Lucene-Solr-4.x-Windows\solr\build\solr-core\test\J0\.\org.apache.solr.cloud.CollectionsAPIDistributedZkTest-jetty3-1387149273925\solr.xml
[junit4] 2> 2020641 T4668 oasc.ConfigSolrXml.<init> Config-defined core root directory:
[junit4] 2> 2020641 T4668 oasc.CoreContainer.<init> New CoreContainer 21002904
[junit4] 2> 2020641 T4668 oasc.CoreContainer.load Loading cores into CoreContainer [instanceDir=..\..\..\..\..\..\..\..\..\Users\JenkinsSlave\workspace\Lucene-Solr-4.x-Windows\solr\build\solr-core\test\J0\.\org.apache.solr.cloud.CollectionsAPIDistributedZkTest-jetty3-1387149273925\]
[junit4] 2> 2020646 T4668 oashc.HttpShardHandlerFactory.getParameter Setting socketTimeout to: 90000
[junit4] 2> 2020646 T4668 oashc.HttpShardHandlerFactory.getParameter Setting urlScheme to: http://
[junit4] 2> 2020646 T4668 oashc.HttpShardHandlerFactory.getParameter Setting connTimeout to: 15000
[junit4] 2> 2020646 T4668 oashc.HttpShardHandlerFactory.getParameter Setting maxConnectionsPerHost to: 20
[junit4] 2> 2020646 T4668 oashc.HttpShardHandlerFactory.getParameter Setting corePoolSize to: 0
[junit4] 2> 2020646 T4668 oashc.HttpShardHandlerFactory.getParameter Setting maximumPoolSize to: 2147483647
[junit4] 2> 2020649 T4668 oashc.HttpShardHandlerFactory.getParameter Setting maxThreadIdleTime to: 5
[junit4] 2> 2020649 T4668 oashc.HttpShardHandlerFactory.getParameter Setting sizeOfQueue to: -1
[junit4] 2> 2020649 T4668 oashc.HttpShardHandlerFactory.getParameter Setting fairnessPolicy to: false
[junit4] 2> 2020656 T4668 oasl.LogWatcher.createWatcher SLF4J impl is org.slf4j.impl.Log4jLoggerFactory
[junit4] 2> 2020656 T4668 oasl.LogWatcher.newRegisteredLogWatcher Registering Log Listener [Log4j (org.slf4j.impl.Log4jLoggerFactory)]
[junit4] 2> 2020656 T4668 oasc.CoreContainer.load Host Name: 127.0.0.1
[junit4] 2> 2020656 T4668 oasc.ZkContainer.initZooKeeper Zookeeper client=127.0.0.1:62649/solr
[junit4] 2> 2020658 T4668 oasc.ZkController.checkChrootPath zkHost includes chroot
[junit4] 2> 2020661 T4668 oascc.ConnectionManager.waitForConnected Waiting for client to connect to ZooKeeper
[junit4] 2> 2020691 T4738 oascc.ConnectionManager.process Watcher org.apache.solr.common.cloud.ConnectionManager@30a236 name:ZooKeeperConnection Watcher:127.0.0.1:62649 got event WatchedEvent state:SyncConnected type:None path:null path:null type:None
[junit4] 2> 2020692 T4668 oascc.ConnectionManager.waitForConnected Client is connected to ZooKeeper
[junit4] 2> 2020699 T4668 oascc.ConnectionManager.waitForConnected Waiting for client to connect to ZooKeeper
[junit4] 2> 2020702 T4740 oascc.ConnectionManager.process Watcher org.apache.solr.common.cloud.ConnectionManager@9d9d1 name:ZooKeeperConnection Watcher:127.0.0.1:62649/solr got event WatchedEvent state:SyncConnected type:None path:null path:null type:None
[junit4] 2> 2020703 T4668 oascc.ConnectionManager.waitForConnected Client is connected to ZooKeeper
[junit4] 2> 2020716 T4668 oascc.ZkStateReader.createClusterStateWatchersAndUpdate Updating cluster state from ZooKeeper...
[junit4] 2> 2021631 T4668 oasc.ZkController.createEphemeralLiveNode Register node as live in ZooKeeper:/live_nodes/127.0.0.1:62692_
[junit4] 2> 2021635 T4668 oascc.SolrZkClient.makePath makePath: /live_nodes/127.0.0.1:62692_
[junit4] 2> 2021647 T4740 oascc.ZkStateReader$3.process Updating live nodes... (4)
[junit4] 2> 2021649 T4699 oascc.ZkStateReader$3.process Updating live nodes... (4)
[junit4] 2> 2021651 T4694 oascc.ZkStateReader$3.process Updating live nodes... (4)
[junit4] 2> 2021652 T4712 oascc.ZkStateReader$3.process Updating live nodes... (4)
[junit4] 2> 2021654 T4726 oascc.ZkStateReader$3.process Updating live nodes... (4)
[junit4] 2> 2021667 T4668 oasc.CorePropertiesLocator.discover Looking for core definitions underneath C:\Users\JenkinsSlave\workspace\Lucene-Solr-4.x-Windows\solr\build\solr-core\test\J0\..\..\..\..\..\..\..\..\..\Users\JenkinsSlave\workspace\Lucene-Solr-4.x-Windows\solr\build\solr-core\test\J0\.\org.apache.solr.cloud.CollectionsAPIDistributedZkTest-jetty3-1387149273925
[junit4] 2> 2021905 T4668 oasc.CorePropertiesLocator.discoverUnder Found core conf in C:\Users\JenkinsSlave\workspace\Lucene-Solr-4.x-Windows\solr\build\solr-core\test\J0\..\..\..\..\..\..\..\..\..\Users\JenkinsSlave\workspace\Lucene-Solr-4.x-Windows\solr\build\solr-core\test\J0\.\org.apache.solr.cloud.CollectionsAPIDistributedZkTest-jetty3-1387149273925\conf\
[junit4] 2> 2021917 T4668 oasc.CorePropertiesLocator.discover Found 1 core definitions
[junit4] 2> 2021919 T4668 oass.SolrDispatchFilter.init user.dir=C:\Users\JenkinsSlave\workspace\Lucene-Solr-4.x-Windows\solr\build\solr-core\test\J0
[junit4] 2> 2021919 T4668 oass.SolrDispatchFilter.init SolrDispatchFilter.init() done
[junit4] 2> 2022420 T4668 oejs.Server.doStart jetty-8.1.10.v20130312
[junit4] 2> 2022425 T4668 oejs.AbstractConnector.doStart Started SelectChannelConnector@127.0.0.1:62701
[junit4] 2> 2022426 T4668 oass.SolrDispatchFilter.init SolrDispatchFilter.init()
[junit4] 2> 2022426 T4668 oasc.SolrResourceLoader.locateSolrHome JNDI not configured for solr (NoInitialContextEx)
[junit4] 2> 2022426 T4668 oasc.SolrResourceLoader.locateSolrHome using system property solr.solr.home: .\org.apache.solr.cloud.CollectionsAPIDistributedZkTest-jetty4-1387149275944
[junit4] 2> 2022426 T4668 oasc.SolrResourceLoader.<init> new SolrResourceLoader for directory: '.\org.apache.solr.cloud.CollectionsAPIDistributedZkTest-jetty4-1387149275944\'
[junit4] 2> 2022477 T4668 oasc.ConfigSolr.fromFile Loading container configuration from C:\Users\JenkinsSlave\workspace\Lucene-Solr-4.x-Windows\solr\build\solr-core\test\J0\.\org.apache.solr.cloud.CollectionsAPIDistributedZkTest-jetty4-1387149275944\solr.xml
[junit4] 2> 2022594 T4668 oasc.ConfigSolrXml.<init> Config-defined core root directory:
[junit4] 2> 2022595 T4668 oasc.CoreContainer.<init> New CoreContainer 31991878
[junit4] 2> 2022596 T4668 oasc.CoreContainer.load Loading cores into CoreContainer [instanceDir=.\org.apache.solr.cloud.CollectionsAPIDistributedZkTest-jetty4-1387149275944\]
[junit4] 2> 2022598 T4668 oashc.HttpShardHandlerFactory.getParameter Setting socketTimeout to: 90000
[junit4] 2> 2022598 T4668 oashc.HttpShardHandlerFactory.getParameter Setting urlScheme to: http://
[junit4] 2> 2022599 T4668 oashc.HttpShardHandlerFactory.getParameter Setting connTimeout to: 15000
[junit4] 2> 2022599 T4668 oashc.HttpShardHandlerFactory.getParameter Setting maxConnectionsPerHost to: 20
[junit4] 2> 2022600 T4668 oashc.HttpShardHandlerFactory.getParameter Setting corePoolSize to: 0
[junit4] 2> 2022600 T4668 oashc.HttpShardHandlerFactory.getParameter Setting maximumPoolSize to: 2147483647
[junit4] 2> 2022600 T4668 oashc.HttpShardHandlerFactory.getParameter Setting maxThreadIdleTime to: 5
[junit4] 2> 2022600 T4668 oashc.HttpShardHandlerFactory.getParameter Setting sizeOfQueue to: -1
[junit4] 2> 2022601 T4668 oashc.HttpShardHandlerFactory.getParameter Setting fairnessPolicy to: false
[junit4] 2> 2022608 T4668 oasl.LogWatcher.createWatcher SLF4J impl is org.slf4j.impl.Log4jLoggerFactory
[junit4] 2> 2022609 T4668 oasl.LogWatcher.newRegisteredLogWatcher Registering Log Listener [Log4j (org.slf4j.impl.Log4jLoggerFactory)]
[junit4] 2> 2022609 T4668 oasc.CoreContainer.load Host Name: 127.0.0.1
[junit4] 2> 2022610 T4668 oasc.ZkContainer.initZooKeeper Zookeeper client=127.0.0.1:62649/solr
[junit4] 2> 2022610 T4668 oasc.ZkController.checkChrootPath zkHost includes chroot
[junit4] 2> 2022612 T4668 oascc.ConnectionManager.waitForConnected Waiting for client to connect to ZooKeeper
[junit4] 2> 2022622 T4752 oascc.ConnectionManager.process Watcher org.apache.solr.common.cloud.ConnectionManager@ac4616 name:ZooKeeperConnection Watcher:127.0.0.1:62649 got event WatchedEvent state:SyncConnected type:None path:null path:null type:None
[junit4] 2> 2022622 T4668 oascc.ConnectionManager.waitForConnected Client is connected to ZooKeeper
[junit4] 2> 2022626 T4670 oazs.NIOServerCnxn.doIO WARN caught end of stream exception EndOfStreamException: Unable to read additional data from client sessionid 0x142f88a1519000d, likely client has closed socket
[junit4] 2> at org.apache.zookeeper.server.NIOServerCnxn.doIO(NIOServerCnxn.java:220)
[junit4] 2> at org.apache.zookeeper.server.NIOServerCnxnFactory.run(NIOServerCnxnFactory.java:208)
[junit4] 2> at java.lang.Thread.run(Thread.java:662)
[junit4] 2>
[junit4] 2> 2022628 T4668 oascc.ConnectionManager.waitForConnected Waiting for client to connect to ZooKeeper
[junit4] 2> 2022632 T4754 oascc.ConnectionManager.process Watcher org.apache.solr.common.cloud.ConnectionManager@c4ffc7 name:ZooKeeperConnection Watcher:127.0.0.1:62649/solr got event WatchedEvent state:SyncConnected type:None path:null path:null type:None
[junit4] 2> 2022632 T4668 oascc.ConnectionManager.waitForConnected Client is connected to ZooKeeper
[junit4] 2> 2022648 T4668 oascc.ZkStateReader.createClusterStateWatchersAndUpdate Updating cluster state from ZooKeeper...
[junit4] 2> 2023561 T4668 oasc.ZkController.createEphemeralLiveNode Register node as live in ZooKeeper:/live_nodes/127.0.0.1:62701_
[junit4] 2> 2023566 T4668 oascc.SolrZkClient.makePath makePath: /live_nodes/127.0.0.1:62701_
[junit4] 2> 2023578 T4740 oascc.ZkStateReader$3.process Updating live nodes... (5)
[junit4] 2> 2023580 T4726 oascc.ZkStateReader$3.process Updating live nodes... (5)
[junit4] 2> 2023586 T4694 oascc.ZkStateReader$3.process Updating live nodes... (5)
[junit4] 2> 2023587 T4754 oascc.ZkStateReader$3.process Updating live nodes... (5)
[junit4] 2> 2023588 T4699 oascc.ZkStateReader$3.process Updating live nodes... (5)
[junit4] 2> 2023589 T4712 oascc.ZkStateReader$3.process Updating live nodes... (5)
[junit4] 2> 2023623 T4668 oasc.CorePropertiesLocator.discover Looking for core definitions underneath C:\Users\JenkinsSlave\workspace\Lucene-Solr-4.x-Windows\solr\build\solr-core\test\J0\.\org.apache.solr.cloud.CollectionsAPIDistributedZkTest-jetty4-1387149275944
[junit4] 2> 2023881 T4668 oasc.CorePropertiesLocator.discoverUnder Found core conf in C:\Users\JenkinsSlave\workspace\Lucene-Solr-4.x-Windows\solr\build\solr-core\test\J0\.\org.apache.solr.cloud.CollectionsAPIDistributedZkTest-jetty4-1387149275944\conf\
[junit4] 2> 2023892 T4668 oasc.CorePropertiesLocator.discover Found 1 core definitions
[junit4] 2> 2023894 T4668 oass.SolrDispatchFilter.init user.dir=C:\Users\JenkinsSlave\workspace\Lucene-Solr-4.x-Windows\solr\build\solr-core\test\J0
[junit4] 2> 2023894 T4668 oass.SolrDispatchFilter.init SolrDispatchFilter.init() done
[junit4] 2> 2023929 T4707 oasha.CollectionsHandler.handleCreateAction Creating Collection : numShards=2&collection.configName=conf1&name=solrj_collection&replicationFactor=2&action=CREATE&router.field=myOwnField&wt=javabin&router.name=compositeId&version=2
[junit4] 2> 2023931 T4694 oasc.DistributedQueue$LatchChildWatcher.process LatchChildWatcher fired on path: /overseer/collection-queue-work state: SyncConnected type NodeChildrenChanged
[junit4] 2> 2023936 T4694 oasc.DistributedQueue$LatchChildWatcher.process LatchChildWatcher fired on path: /overseer/collection-queue-work state: SyncConnected type NodeChildrenChanged
[junit4] 2> 2023938 T4696 oasc.OverseerCollectionProcessor.run Overseer Collection Processor: Get the message id:/overseer/collection-queue-work/qn-0000000000 message:{
[junit4] 2> "operation":"createcollection",
[junit4] 2> "fromApi":"true",
[junit4] 2> "name":"solrj_collection",
[junit4] 2> "replicationFactor":"2",
[junit4] 2> "collection.configName":"conf1",
[junit4] 2> "numShards":"2",
[junit4] 2> "router.field":"myOwnField",
[junit4] 2> "router.name":"compositeId"}
[junit4] 2> 2023938 T4696 oasc.OverseerCollectionProcessor.processMessage WARN OverseerCollectionProcessor.processMessage : createcollection , {
[junit4] 2> "operation":"createcollection",
[junit4] 2> "fromApi":"true",
[junit4] 2> "name":"solrj_collection",
[junit4] 2> "replicationFactor":"2",
[junit4] 2> "collection.configName":"conf1",
[junit4] 2> "numShards":"2",
[junit4] 2> "router.field":"myOwnField",
[junit4] 2> "router.name":"compositeId"}
[junit4] 2> 2023940 T4696 oasc.OverseerCollectionProcessor.createConfNode creating collections conf node /collections/solrj_collection
[junit4] 2> 2023940 T4696 oascc.SolrZkClient.makePath makePath: /collections/solrj_collection
[junit4] 2> 2023953 T4694 oasc.DistributedQueue$LatchChildWatcher.process LatchChildWatcher fired on path: /overseer/queue state: SyncConnected type NodeChildrenChanged
[junit4] 2> 2023958 T4695 oascc.ZkStateReader.updateClusterState Updating cloud state from ZooKeeper...
[junit4] 2> 2023959 T4695 oasc.Overseer$ClusterStateUpdater.buildCollection building a new collection: solrj_collection
[junit4] 2> 2023960 T4695 oasc.Overseer$ClusterStateUpdater.createCollection Create collection solrj_collection with shards [shard1, shard2]
[junit4] 2> 2023967 T4694 oasc.DistributedQueue$LatchChildWatcher.process LatchChildWatcher fired on path: /overseer/queue state: SyncConnected type NodeChildrenChanged
[junit4] 2> 2023970 T4754 oascc.ZkStateReader$2.process A cluster state change: WatchedEvent state:SyncConnected type:NodeDataChanged path:/clusterstate.json, has occurred - updating... (live nodes size: 5)
[junit4] 2> 2023971 T4712 oascc.ZkStateReader$2.process A cluster state change: WatchedEvent state:SyncConnected type:NodeDataChanged path:/clusterstate.json, has occurred - updating... (live nodes size: 5)
[junit4] 2> 2023972 T4726 oascc.ZkStateReader$2.process A cluster state change: WatchedEvent state:SyncConnected type:NodeDataChanged path:/clusterstate.json, has occurred - updating... (live nodes size: 5)
[junit4] 2> 2023972 T4694 oascc.ZkStateReader$2.process A cluster state change: WatchedEvent state:SyncConnected type:NodeDataChanged path:/clusterstate.json, has occurred - updating... (live nodes size: 5)
[junit4] 2> 2023973 T4699 oascc.ZkStateReader$2.process A cluster state change: WatchedEvent state:SyncConnected type:NodeDataChanged path:/clusterstate.json, has occurred - updating... (live nodes size: 5)
[junit4] 2> 2023974 T4740 oascc.ZkStateReader$2.process A cluster state change: WatchedEvent state:SyncConnected type:NodeDataChanged path:/clusterstate.json, has occurred - updating... (live nodes size: 5)
[junit4] 2> 2024044 T4696 oasc.OverseerCollectionProcessor.createCollection going to create cores replicas shardNames [shard1, shard2] , repFactor : 2
[junit4] 2> 2024044 T4696 oasc.OverseerCollectionProcessor.createCollection Creating shard solrj_collection_shard1_replica1 as part of slice shard1 of collection solrj_collection on 127.0.0.1:62692_
[junit4] 2> 2024045 T4696 oasc.OverseerCollectionProcessor.createCollection Creating shard solrj_collection_shard1_replica2 as part of slice shard1 of collection solrj_collection on 127.0.0.1:62701_
[junit4] 2> 2024046 T4696 oasc.OverseerCollectionProcessor.createCollection Creating shard solrj_collection_shard2_replica1 as part of slice shard2 of collection solrj_collection on 127.0.0.1:62662_
[junit4] 2> 2024048 T4696 oasc.OverseerCollectionProcessor.createCollection Creating shard solrj_collection_shard2_replica2 as part of slice shard2 of collection solrj_collection on 127.0.0.1:62674_
[junit4] 2> 2024054 T4734 oasc.ZkController.publish publishing core=solrj_collection_shard1_replica1 state=down
[junit4] 2> 2024054 T4747 oasc.ZkController.publish publishing core=solrj_collection_shard1_replica2 state=down
[junit4] 2> 2024058 T4708 oasc.ZkController.publish publishing core=solrj_collection_shard2_replica2 state=down
[junit4] 2> 2024059 T4685 oasc.ZkController.publish publishing core=solrj_collection_shard2_replica1 state=down
[junit4] 2> 2024063 T4694 oasc.DistributedQueue$LatchChildWatcher.process LatchChildWatcher fired on path: /overseer/queue state: SyncConnected type NodeChildrenChanged
[junit4] 2> 2024063 T4734 oasc.ZkController.waitForCoreNodeName look for our core node name
[junit4] 2> 2024064 T4747 oasc.ZkController.waitForCoreNodeName look for our core node name
[junit4] 2> 2024064 T4708 oasc.ZkController.waitForCoreNodeName look for our core node name
[junit4] 2> 2024067 T4685 oasc.ZkController.waitForCoreNodeName look for our core node name
[junit4] 2> 2024070 T4695 oascc.ZkStateReader.updateClusterState Updating cloud state from ZooKeeper...
[junit4] 2> 2024072 T4695 oasc.Overseer$ClusterStateUpdater.updateState Update state numShards=2 message={
[junit4] 2> "operation":"state",
[junit4] 2> "state":"down",
[junit4] 2> "base_url":"http://127.0.0.1:62692",
[junit4] 2> "core":"solrj_collection_shard1_replica1",
[junit4] 2> "roles":null,
[junit4] 2> "node_name":"127.0.0.1:62692_",
[junit4] 2> "shard":"shard1",
[junit4] 2> "shard_range":null,
[junit4] 2> "shard_state":"active",
[junit4] 2> "shard_parent":null,
[junit4] 2> "collection":"solrj_collection",
[junit4] 2> "numShards":"2",
[junit4] 2> "core_node_name":null}
[junit4] 2> 2024080 T4694 oasc.DistributedQueue$LatchChildWatcher.process LatchChildWatcher fired on path: /overseer/queue state: SyncConnected type NodeChildrenChanged
[junit4] 2> 2024083 T4695 oasc.Overseer$ClusterStateUpdater.updateState Update state numShards=2 message={
[junit4] 2> "operation":"state",
[junit4] 2> "state":"down",
[junit4] 2> "base_url":"http://127.0.0.1:62701",
[junit4] 2> "core":"solrj_collection_shard1_replica2",
[junit4] 2> "roles":null,
[junit4] 2> "node_name":"127.0.0.1:62701_",
[junit4] 2> "shard":"shard1",
[junit4] 2> "shard_range":null,
[junit4] 2> "shard_state":"active",
[junit4] 2> "shard_parent":null,
[junit4] 2> "collection":"solrj_collection",
[junit4] 2> "numShards":"2",
[junit4] 2> "core_node_name":null}
[junit4] 2> 2024091 T4694 oasc.DistributedQueue$LatchChildWatcher.process LatchChildWatcher fired on path: /overseer/queue state: SyncConnected type NodeChildrenChanged
[junit4] 2> 2024095 T4695 oasc.Overseer$ClusterStateUpdater.updateState Update state numShards=2 message={
[junit4] 2> "operation":"state",
[junit4] 2> "state":"down",
[junit4] 2> "base_url":"http://127.0.0.1:62674",
[junit4] 2> "core":"solrj_collection_shard2_replica2",
[junit4] 2> "roles":null,
[junit4] 2> "node_name":"127.0.0.1:62674_",
[junit4] 2> "shard":"shard2",
[junit4] 2> "shard_range":null,
[junit4] 2> "shard_state":"active",
[junit4] 2> "shard_parent":null,
[junit4] 2> "collection":"solrj_collection",
[junit4] 2> "numShards":"2",
[junit4] 2> "core_node_name":null}
[junit4] 2> 2024103 T4694 oasc.DistributedQueue$LatchChildWatcher.process LatchChildWatcher fired on path: /overseer/queue state: SyncConnected type NodeChildrenChanged
[junit4] 2> 2024106 T4695 oasc.Overseer$ClusterStateUpdater.updateState Update state numShards=2 message={
[junit4] 2> "operation":"state",
[junit4] 2> "state":"down",
[junit4] 2> "base_url":"http://127.0.0.1:62662",
[junit4] 2> "core":"solrj_collection_shard2_replica1",
[junit4] 2> "roles":null,
[junit4] 2> "node_name":"127.0.0.1:62662_",
[junit4] 2> "shard":"shard2",
[junit4] 2> "shard_range":null,
[junit4] 2> "shard_state":"active",
[junit4] 2> "shard_parent":null,
[junit4] 2> "collection":"solrj_collection",
[junit4] 2> "numShards":"2",
[junit4] 2> "core_node_name":null}
[junit4] 2> 2024113 T4694 oasc.DistributedQueue$LatchChildWatcher.process LatchChildWatcher fired on path: /overseer/queue state: SyncConnected type NodeChildrenChanged
[junit4] 2> 2024214 T4754 oascc.ZkStateReader$2.process A cluster state change: WatchedEvent state:SyncConnected type:NodeDataChanged path:/clusterstate.json, has occurred - updating... (live nodes size: 5)
[junit4] 2> 2024214 T4694 oascc.ZkStateReader$2.process A cluster state change: WatchedEvent state:SyncConnected type:NodeDataChanged path:/clusterstate.json, has occurred - updating... (live nodes size: 5)
[junit4] 2> 2024215 T4740 oascc.ZkStateReader$2.process A cluster state change: WatchedEvent state:SyncConnected type:NodeDataChanged path:/clusterstate.json, has occurred - updating... (live nodes size: 5)
[junit4] 2> 2024216 T4712 oascc.ZkStateReader$2.process A cluster state change: WatchedEvent state:SyncConnected type:NodeDataChanged path:/clusterstate.json, has occurred - updating... (live nodes size: 5)
[junit4] 2> 2024216 T4699 oascc.ZkStateReader$2.process A cluster state change: WatchedEvent state:SyncConnected type:NodeDataChanged path:/clusterstate.json, has occurred - updating... (live nodes size: 5)
[junit4] 2> 2024217 T4726 oascc.ZkStateReader$2.process A cluster state change: WatchedEvent state:SyncConnected type:NodeDataChanged path:/clusterstate.json, has occurred - updating... (live nodes size: 5)
[junit4] 2> 2024968 T4734 oasc.ZkController.waitForShardId waiting to find shard id in clusterstate for solrj_collection_shard1_replica1
[junit4] 2> 2024968 T4747 oasc.ZkController.waitForShardId waiting to find shard id in clusterstate for solrj_collection_shard1_replica2
[junit4] 2> 2024970 T4708 oasc.ZkController.waitForShardId waiting to find shard id in clusterstate for solrj_collection_shard2_replica2
[junit4] 2> 2024973 T4747 oasc.CoreContainer.create Creating SolrCore 'solrj_collection_shard1_replica2' using instanceDir: .\org.apache.solr.cloud.CollectionsAPIDistributedZkTest-jetty4-1387149275944\solrj_collection_shard1_replica2
[junit4] 2> 2024973 T4708 oasc.CoreContainer.create Creating SolrCore 'solrj_collection_shard2_replica2' using instanceDir: ..\..\..\..\..\..\..\..\..\Users\JenkinsSlave\workspace\Lucene-Solr-4.x-Windows\solr\build\solr-core\test\J0\.\org.apache.solr.cloud.CollectionsAPIDistributedZkTest-jetty1-1387149270034\solrj_collection_shard2_replica2
[junit4] 2> 2024974 T4685 oasc.ZkController.waitForShardId waiting to find shard id in clusterstate for solrj_collection_shard2_replica1
[junit4] 2> 2024973 T4747 oasc.ZkController.createCollectionZkNode Check for collection zkNode:solrj_collection
[junit4] 2> 2024974 T4708 oasc.ZkController.createCollectionZkNode Check for collection zkNode:solrj_collection
[junit4] 2> 2024975 T4734 oasc.CoreContainer.create Creating SolrCore 'solrj_collection_shard1_replica1' using instanceDir: ..\..\..\..\..\..\..\..\..\Users\JenkinsSlave\workspace\Lucene-Solr-4.x-Windows\solr\build\solr-core\test\J0\.\org.apache.solr.cloud.CollectionsAPIDistributedZkTest-jetty3-1387149273925\solrj_collection_shard1_replica1
[junit4] 2> 2024976 T4734 oasc.ZkController.createCollectionZkNode Check for collection zkNode:solrj_collection
[junit4] 2> 2024978 T4708 oasc.ZkController.createCollectionZkNode Collection zkNode exists
[junit4] 2> 2024978 T4708 oascc.ZkStateReader.readConfigName Load collection config from:/collections/solrj_collection
[junit4] 2> 2024978 T4734 oasc.ZkController.createCollectionZkNode Collection zkNode exists
[junit4] 2> 2024978 T4734 oascc.ZkStateReader.readConfigName Load collection config from:/collections/solrj_collection
[junit4] 2> 2024980 T4747 oasc.ZkController.createCollectionZkNode Collection zkNode exists
[junit4] 2> 2024980 T4747 oascc.ZkStateReader.readConfigName Load collection config from:/collections/solrj_collection
[junit4] 2> 2024981 T4685 oasc.CoreContainer.create Creating SolrCore 'solrj_collection_shard2_replica1' using instanceDir: ..\..\..\..\..\..\..\..\..\Users\JenkinsSlave\workspace\Lucene-Solr-4.x-Windows\solr\build\solr-core\test\J0\.\org.apache.solr.cloud.CollectionsAPIDistributedZkTest-controljetty-1387149268675\solrj_collection_shard2_replica1
[junit4] 2> 2024981 T4685 oasc.ZkController.createCollectionZkNode Check for collection zkNode:solrj_collection
[junit4] 2> 2024984 T4685 oasc.ZkController.createCollectionZkNode Collection zkNode exists
[junit4] 2> 2024984 T4685 oascc.ZkStateReader.readConfigName Load collection config from:/collections/solrj_collection
[junit4] 2> 2024989 T4734 oasc.SolrResourceLoader.<init> new SolrResourceLoader for directory: '..\..\..\..\..\..\..\..\..\Users\JenkinsSlave\workspace\Lucene-Solr-4.x-Windows\solr\build\solr-core\test\J0\.\org.apache.solr.cloud.CollectionsAPIDistributedZkTest-jetty3-1387149273925\solrj_collection_shard1_replica1\'
[junit4] 2> 2024992 T4708 oasc.SolrResourceLoader.<init> new SolrResourceLoader for directory: '..\..\..\..\..\..\..\..\..\Users\JenkinsSlave\workspace\Lucene-Solr-4.x-Windows\solr\build\solr-core\test\J0\.\org.apache.solr.cloud.CollectionsAPIDistributedZkTest-jetty1-1387149270034\solrj_collection_shard2_replica2\'
[junit4] 2> 2024996 T4685 oasc.SolrResourceLoader.<init> new SolrResourceLoader for directory: '..\..\..\..\..\..\..\..\..\Users\JenkinsSlave\workspace\Lucene-Solr-4.x-Windows\solr\build\solr-core\test\J0\.\org.apache.solr.cloud.CollectionsAPIDistributedZkTest-controljetty-1387149268675\solrj_collection_shard2_replica1\'
[junit4] 2> 2024999 T4747 oasc.SolrResourceLoader.<init> new SolrResourceLoader for directory: '.\org.apache.solr.cloud.CollectionsAPIDistributedZkTest-jetty4-1387149275944\solrj_collection_shard1_replica2\'
[junit4] 2> 2025210 T4734 oasc.SolrConfig.<init> Using Lucene MatchVersion: LUCENE_47
[junit4] 2> 2025244 T4747 oasc.SolrConfig.<init> Using Lucene MatchVersion: LUCENE_47
[junit4] 2> 2025401 T4685 oasc.SolrConfig.<init> Using Lucene MatchVersion: LUCENE_47
[junit4] 2> 2025427 T4747 oasc.SolrConfig.<init> Loaded SolrConfig: solrconfig.xml
[junit4] 2> 2025525 T4708 oasc.SolrConfig.<init> Using Lucene MatchVersion: LUCENE_47
[junit4] 2> 2025608 T4747 oass.IndexSchema.readSchema Reading Solr Schema from schema.xml
[junit4] 2> 2025621 T4734 oasc.SolrConfig.<init> Loaded SolrConfig: solrconfig.xml
[junit4] 2> 2025624 T4685 oasc.SolrConfig.<init> Loaded SolrConfig: solrconfig.xml
[junit4] 2> 2025637 T4747 oass.IndexSchema.readSchema [solrj_collection_shard1_replica2] Schema name=test
[junit4] 2> 2025653 T4708 oasc.SolrConfig.<init> Loaded SolrConfig: solrconfig.xml
[junit4] 2> 2025662 T4734 oass.IndexSchema.readSchema Reading Solr Schema from schema.xml
[junit4] 2> 2025663 T4685 oass.IndexSchema.readSchema Reading Solr Schema from schema.xml
[junit4] 2> 2025673 T4734 oass.IndexSchema.readSchema [solrj_collection_shard1_replica1] Schema name=test
[junit4] 2> 2025680 T4685 oass.IndexSchema.readSchema [solrj_collection_shard2_replica1] Schema name=test
[junit4] 2> 2025775 T4708 oass.IndexSchema.readSchema Reading Solr Schema from schema.xml
[junit4] 2> 2025842 T4708 oass.IndexSchema.readSchema [solrj_collection_shard2_replica2] Schema name=test
[junit4] 2> 2028427 T4708 oass.ByteField.init WARN ByteField is deprecated and will be removed in 5.0. You should use TrieIntField instead.
[junit4] 2> 2028427 T4708 oass.ShortField.init WARN ShortField is deprecated and will be removed in 5.0. You should use TrieIntField instead.
[junit4] 2> 2028430 T4708 oass.OpenExchangeRatesOrgProvider.init Initialized with rates=open-exchange-rates.json, refreshInterval=1440.
[junit4] 2> 2028465 T4708 oass.IndexSchema.readSchema default search field in schema is text
[junit4] 2> 2028474 T4708 oass.IndexSchema.readSchema unique key field: id
[junit4] 2> 2028568 T4685 oass.ByteField.init WARN ByteField is deprecated and will be removed in 5.0. You should use TrieIntField instead.
[junit4] 2> 2028570 T4685 oass.ShortField.init WARN ShortField is deprecated and will be removed in 5.0. You should use TrieIntField instead.
[junit4] 2> 2028571 T4685 oass.OpenExchangeRatesOrgProvider.init Initialized with rates=open-exchange-rates.json, refreshInterval=1440.
[junit4] 2> 2028580 T4685 oass.IndexSchema.readSchema default search field in schema is text
[junit4] 2> 2028685 T4747 oass.ByteField.init WARN ByteField is deprecated and will be removed in 5.0. You should use TrieIntField instead.
[junit4] 2> 2028687 T4747 oass.ShortField.init WARN ShortField is deprecated and will be removed in 5.0. You should use TrieIntField instead.
[junit4] 2> 2028688 T4747 oass.OpenExchangeRatesOrgProvider.init Initialized with rates=open-exchange-rates.json, refreshInterval=1440.
[junit4] 2> 2028702 T4747 oass.IndexSchema.readSchema default search field in schema is text
[junit4] 2> 2028717 T4747 oass.IndexSchema.readSchema unique key field: id
[junit4] 2> 2028721 T4685 oass.IndexSchema.readSchema unique key field: id
[junit4] 2> 2028736 T4734 oass.ByteField.init WARN ByteField is deprecated and will be removed in 5.0. You should use TrieIntField instead.
[junit4] 2> 2028736 T4734 oass.ShortField.init WARN ShortField is deprecated and will be removed in 5.0. You should use TrieIntField instead.
[junit4] 2> 2028738 T4734 oass.OpenExchangeRatesOrgProvider.init Initialized with rates=open-exchange-rates.json, refreshInterval=1440.
[junit4] 2> 2028756 T4734 oass.IndexSchema.readSchema default search field in schema is text
[junit4] 2> 2028762 T4734 oass.IndexSchema.readSchema unique key field: id
[junit4] 2> 2028802 T4747 oass.FileExchangeRateProvider.reload Reloading exchange rates from file currency.xml
[junit4] 2> 2028824 T4747 oass.FileExchangeRateProvider.reload Reloading exchange rates from file currency.xml
[junit4] 2> 2028837 T4747 oass.OpenExchangeRatesOrgProvider.reload Reloading exchange rates from open-exchange-rates.json
[junit4] 2> 2028838 T4685 oass.FileExchangeRateProvider.reload Reloading exchange rates from file currency.xml
[junit4] 2> 2028844 T4708 oass.FileExchangeRateProvider.reload Reloading exchange rates from file currency.xml
[junit4] 2> 2028845 T4747 oass.OpenExchangeRatesOrgProvider$OpenExchangeRates.<init> WARN Unknown key IMPORTANT NOTE
[junit4] 2> 2028845 T4747 oass.OpenExchangeRatesOrgProvider$OpenExchangeRates.<init> WARN Expected key, got STRING
[junit4] 2> 2028845 T4747 oass.OpenExchangeRatesOrgProvider.reload Reloading exchange rates from open-exchange-rates.json
[junit4] 2> 2028849 T4685 oass.FileExchangeRateProvider.reload Reloading exchange rates from file currency.xml
[junit4] 2> 2028855 T4747 oass.OpenExchangeRatesOrgProvider$OpenExchangeRates.<init> WARN Unknown key IMPORTANT NOTE
[junit4] 2> 2028855 T4747 oass.OpenExchangeRatesOrgProvider$OpenExchangeRates.<init> WARN Expected key, got STRING
[junit4] 2> 2028856 T4747 oasc.SolrCore.initDirectoryFactory org.apache.solr.core.MockDirectoryFactory
[junit4] 2> 2028856 T4747 oasc.SolrCore.<init> [solrj_collection_shard1_replica2] Opening new SolrCore at .\org.apache.solr.cloud.CollectionsAPIDistributedZkTest-jetty4-1387149275944\solrj_collection_shard1_replica2\, dataDir=.\org.apache.solr.cloud.CollectionsAPIDistributedZkTest-jetty4-1387149275944\solrj_collection_shard1_replica2\data\
[junit4] 2> 2028856 T4747 oasc.JmxMonitoredMap.<init> JMX monitoring is enabled. Adding Solr mbeans to JMX Server: com.sun.jmx.mbeanserver.JmxMBeanServer@546169
[junit4] 2> 2028859 T4747 oasc.CachingDirectoryFactory.get return new directory for .\org.apache.solr.cloud.CollectionsAPIDistributedZkTest-jetty4-1387149275944\solrj_collection_shard1_replica2\data\
[junit4] 2> 2028859 T4747 oasc.SolrCore.getNewIndexDir New index directory detected: old=null new=.\org.apache.solr.cloud.CollectionsAPIDistributedZkTest-jetty4-1387149275944\solrj_collection_shard1_replica2\data\index/
[junit4] 2> 2028859 T4747 oasc.SolrCore.initIndex WARN [solrj_collection_shard1_replica2] Solr index directory '.\org.apache.solr.cloud.CollectionsAPIDistributedZkTest-jetty4-1387149275944\solrj_collection_shard1_replica2\data\index' doesn't exist. Creating new index...
[junit4] 2> 2028859 T4747 oasc.CachingDirectoryFactory.get return new directory for .\org.apache.solr.cloud.CollectionsAPIDistributedZkTest-jetty4-1387149275944\solrj_collection_shard1_replica2\data\index
[junit4] 2> 2028859 T4708 oass.FileExchangeRateProvider.reload Reloading exchange rates from file currency.xml
[junit4] 2> 2028861 T4747 oasu.RandomMergePolicy.<init> RandomMergePolicy wrapping class org.apache.lucene.index.TieredMergePolicy: [TieredMergePolicy: maxMergeAtOnce=47, maxMergeAtOnceExplicit=24, maxMergedSegmentMB=75.1435546875, floorSegmentMB=1.8193359375, forceMergeDeletesPctAllowed=14.124764945150462, segmentsPerTier=43.0, maxCFSSegmentSizeMB=8.796093022207999E12, noCFSRatio=0.4314097897793133
[junit4] 2> 2028863 T4747 oasc.SolrDeletionPolicy.onCommit SolrDeletionPolicy.onCommit: commits: num=1
[junit4] 2> commit{dir=MockDirectoryWrapper(org.apache.lucene.store.RAMDirectory@1a1c433 lockFactory=org.apache.lucene.store.SingleInstanceLockFactory@86b062),segFN=segments_1,generation=1}
[junit4] 2> 2028863 T4747 oasc.SolrDeletionPolicy.updateCommits newest commit generation = 1
[junit4] 2> 2028868 T4747 oasup.UpdateRequestProcessorChain.init creating updateRequestProcessorChain "nodistrib"
[junit4] 2> 2028868 T4685 oass.OpenExchangeRatesOrgProvider.reload Reloading exchange rates from open-exchange-rates.json
[junit4] 2> 2028868 T4747 oasup.UpdateRequestProcessorChain.init creating updateRequestProcessorChain "dedupe"
[junit4] 2> 2028870 T4747 oasup.UpdateRequestProcessorChain.init inserting DistributedUpdateProcessorFactory into updateRequestProcessorChain "dedupe"
[junit4] 2> 2028871 T4747 oasup.UpdateRequestProcessorChain.init creating updateRequestProcessorChain "stored_sig"
[junit4] 2> 2028871 T4747 oasup.UpdateRequestProcessorChain.init inserting DistributedUpdateProcessorFactory into updateRequestProcessorChain "stored_sig"
[junit4] 2> 2028871 T4747 oasup.UpdateRequestProcessorChain.init creating updateRequestProcessorChain "distrib-dup-test-chain-explicit"
[junit4] 2> 2028876 T4708 oass.OpenExchangeRatesOrgProvider.reload Reloading exchange rates from open-exchange-rates.json
[junit4] 2> 2028878 T4747 oasup.UpdateRequestProcessorChain.init creating updateRequestProcessorChain "distrib-dup-test-chain-implicit"
[junit4] 2> 2028878 T4747 oasup.UpdateRequestProcessorChain.init inserting DistributedUpdateProcessorFactory into updateRequestProcessorChain "distrib-dup-test-chain-implicit"
[junit4] 2> 2028878 T4747 oasc.SolrCore.loadUpdateProcessorChains no updateRequestProcessorChain defined as default, creating implicit default
[junit4] 2> 2028879 T4747 oasc.RequestHandlers.initHandlersFromConfig created standard: solr.StandardRequestHandler
[junit4] 2> 2028880 T4747 oasc.RequestHandlers.initHandlersFromConfig created /get: solr.RealTimeGetHandler
[junit4] 2> 2028881 T4747 oasc.RequestHandlers.initHandlersFromConfig adding lazy requestHandler: solr.ReplicationHandler
[junit4] 2> 2028881 T4747 oasc.RequestHandlers.initHandlersFromConfig created /replication: solr.ReplicationHandler
[junit4] 2> 2028882 T4747 oasc.RequestHandlers.initHandlersFromConfig created /update: solr.UpdateRequestHandler
[junit4] 2> 2028883 T4747 oasc.RequestHandlers.initHandlersFromConfig created /admin/: org.apache.solr.handler.admin.AdminHandlers
[junit4] 2> 2028881 T4685 oass.OpenExchangeRatesOrgProvider$OpenExchangeRates.<init> WARN Unknown key IMPORTANT NOTE
[junit4] 2> 2028886 T4685 oass.OpenExchangeRatesOrgProvider$OpenExchangeRates.<init> WARN Expected key, got STRING
[junit4] 2> 2028886 T4685 oass.OpenExchangeRatesOrgProvider.reload Reloading exchange rates from open-exchange-rates.json
[junit4] 2> 2028885 T4747 oasc.RequestHandlers.initHandlersFromConfig created /admin/file: solr.admin.ShowFileRequestHandler
[junit4] 2> 2028888 T4734 oass.FileExchangeRateProvider.reload Reloading exchange rates from file currency.xml
[junit4] 2> 2028884 T4708 oass.OpenExchangeRatesOrgProvider$OpenExchangeRates.<init> WARN Unknown key IMPORTANT NOTE
[junit4] 2> 2028889 T4708 oass.OpenExchangeRatesOrgProvider$OpenExchangeRates.<init> WARN Expected key, got STRING
[junit4] 2> 2028889 T4708 oass.OpenExchangeRatesOrgProvider.reload Reloading exchange rates from open-exchange-rates.json
[junit4] 2> 2028896 T4747 oashl.XMLLoader.init xsltCacheLifetimeSeconds=60
[junit4] 2> 2028901 T4734 oass.FileExchangeRateProvider.reload Reloading exchange rates from file currency.xml
[junit4] 2> 2028902 T4708 oass.OpenExchangeRatesOrgProvider$OpenExchangeRates.<init> WARN Unknown key IMPORTANT NOTE
[junit4] 2> 2028902 T4708 oass.OpenExchangeRatesOrgProvider$OpenExchangeRates.<init> WARN Expected key, got STRING
[junit4] 2> 2028902 T4708 oasc.SolrCore.initDirectoryFactory org.apache.solr.core.MockDirectoryFactory
[junit4] 2> 2028905 T4708 oasc.SolrCore.<init> [solrj_collection_shard2_replica2] Opening new SolrCore at ..\..\..\..\..\..\..\..\..\Users\JenkinsSlave\workspace\Lucene-Solr-4.x-Windows\solr\build\solr-core\test\J0\.\org.apache.solr.cloud.CollectionsAPIDistributedZkTest-jetty1-1387149270034\solrj_collection_shard2_replica2\, dataDir=..\..\..\..\..\..\..\..\..\Users\JenkinsSlave\workspace\Lucene-Solr-4.x-Windows\solr\build\solr-core\test\J0\.\org.apache.solr.cloud.CollectionsAPIDistributedZkTest-jetty1-1387149270034\solrj_collection_shard2_replica2\data\
[junit4] 2> 2028905 T4708 oasc.JmxMonitoredMap.<init> JMX monitoring is enabled. Adding Solr mbeans to JMX Server: com.sun.jmx.mbeanserver.JmxMBeanServer@546169
[junit4] 2> 2028905 T4747 oasu.CommitTracker.<init> Hard AutoCommit: disabled
[junit4] 2> 2028906 T4747 oasu.CommitTracker.<init> Soft AutoCommit: disabled
[junit4] 2> 2028906 T4708 oasc.CachingDirectoryFactory.get return new directory for ..\..\..\..\..\..\..\..\..\Users\JenkinsSlave\workspace\Lucene-Solr-4.x-Windows\solr\build\solr-core\test\J0\.\org.apache.solr.cloud.CollectionsAPIDistributedZkTest-jetty1-1387149270034\solrj_collection_shard2_replica2\data\
[junit4] 2> 2028907 T4708 oasc.SolrCore.getNewIndexDir New index directory detected: old=null new=..\..\..\..\..\..\..\..\..\Users\JenkinsSlave\workspace\Lucene-Solr-4.x-Windows\solr\build\solr-core\test\J0\.\org.apache.solr.cloud.CollectionsAPIDistributedZkTest-jetty1-1387149270034\solrj_collection_shard2_replica2\data\index/
[junit4] 2> 2028907 T4708 oasc.SolrCore.initIndex WARN [solrj_collection_shard2_replica2] Solr index directory '..\..\..\..\..\..\..\..\..\Users\JenkinsSlave\workspace\Lucene-Solr-4.x-Windows\solr\build\solr-core\test\J0\.\org.apache.solr.cloud.CollectionsAPIDistributedZkTest-jetty1-1387149270034\solrj_collection_shard2_replica2\data\index' doesn't exist. Creating new index...
[junit4] 2> 2028908 T4708 oasc.CachingDirectoryFactory.get return new directory for ..\..\..\..\..\..\..\..\..\Users\JenkinsSlave\workspace\Lucene-Solr-4.x-Windows\solr\build\solr-core\test\J0\.\org.apache.solr.cloud.CollectionsAPIDistributedZkTest-jetty1-1387149270034\solrj_collection_shard2_replica2\data\index
[junit4] 2> 2028909 T4708 oasu.RandomMergePolicy.<init> RandomMergePolicy wrapping class org.apache.lucene.index.TieredMergePolicy: [TieredMergePolicy: maxMergeAtOnce=47, maxMergeAtOnceExplicit=24, maxMergedSegmentMB=75.1435546875, floorSegmentMB=1.8193359375, forceMergeDeletesPctAllowed=14.124764945150462, segmentsPerTier=43.0, maxCFSSegmentSizeMB=8.796093022207999E12, noCFSRatio=0.4314097897793133
[junit4] 2> 2028906 T4685 oass.OpenExchangeRatesOrgProvider$OpenExchangeRates.<init> WARN Unknown key IMPORTANT NOTE
[junit4] 2> 2028910 T4685 oass.OpenExchangeRatesOrgProvider$OpenExchangeRates.<init> WARN Expected key, got STRING
[junit4] 2> 2028911 T4685 oasc.SolrCore.initDirectoryFactory org.apache.solr.core.MockDirectoryFactory
[junit4] 2> 2028912 T4685 oasc.SolrCore.<init> [solrj_collection_shard2_replica1] Opening new SolrCore at ..\..\..\..\..\..\..\..\..\Users\JenkinsSlave\workspace\Lucene-Solr-4.x-Windows\solr\build\solr-core\test\J0\.\org.apache.solr.cloud.CollectionsAPIDistributedZkTest-controljetty-1387149268675\solrj_collection_shard2_replica1\, dataDir=..\..\..\..\..\..\..\..\..\Users\JenkinsSlave\workspace\Lucene-Solr-4.x-Windows\solr\build\solr-core\test\J0\.\org.apache.solr.cloud.CollectionsAPIDistributedZkTest-controljetty-1387149268675\solrj_collection_shard2_replica1\data\
[junit4] 2> 2028912 T4685 oasc.JmxMonitoredMap.<init> JMX monitoring is enabled. Adding Solr mbeans to JMX Server: com.sun.jmx.mbeanserver.JmxMBeanServer@546169
[junit4] 2> 2028908 T4747 oasu.RandomMergePolicy.<init> RandomMergePolicy wrapping class org.apache.lucene.index.LogDocMergePolicy: [LogDocMergePolicy: minMergeSize=1000, mergeFactor=32, maxMergeSize=9223372036854775807, maxMergeSizeForForcedMerge=9223372036854775807, calibrateSizeByDeletes=false, maxMergeDocs=2147483647, maxCFSSegmentSizeMB=8.796093022207999E12, noCFSRatio=0.13112597252937902]
[junit4] 2> 2028927 T4734 oass.OpenExchangeRatesOrgProvider.reload Reloading exchange rates from open-exchange-rates.json
[junit4] 2> 2028928 T4685 oasc.CachingDirectoryFactory.get return new directory for ..\..\..\..\..\..\..\..\..\Users\JenkinsSlave\workspace\Lucene-Solr-4.x-Windows\solr\build\solr-core\test\J0\.\org.apache.solr.cloud.CollectionsAPIDistributedZkTest-controljetty-1387149268675\solrj_collection_shard2_replica1\data\
[junit4] 2> 2028929 T4685 oasc.SolrCore.getNewIndexDir New index directory detected: old=null new=..\..\..\..\..\..\..\..\..\Users\JenkinsSlave\workspace\Lucene-Solr-4.x-Windows\solr\build\solr-core\test\J0\.\org.apache.solr.cloud.CollectionsAPIDistributedZkTest-controljetty-1387149268675\solrj_collection_shard2_replica1\data\index/
[junit4] 2> 2028929 T4685 oasc.SolrCore.initIndex WARN [solrj_collection_shard2_replica1] Solr index directory '..\..\..\..\..\..\..\..\..\Users\JenkinsSlave\workspace\Lucene-Solr-4.x-Windows\solr\build\solr-core\test\J0\.\org.apache.solr.cloud.CollectionsAPIDistributedZkTest-controljetty-1387149268675\solrj_collection_shard2_replica1\data\index' doesn't exist. Creating new index...
[junit4] 2> 2028928 T4747 oasc.SolrDeletionPolicy.onInit SolrDeletionPolicy.onInit: commits: num=1
[junit4] 2> commit{dir=MockDirectoryWrapper(org.apache.lucene.store.RAMDirectory@1a1c433 lockFactory=org.apache.lucene.store.SingleInstanceLockFactory@86b062),segFN=segments_1,generation=1}
[junit4] 2> 2028931 T4747 oasc.SolrDeletionPolicy.updateCommits newest commit generation = 1
[junit4] 2> 2028932 T4747 oass.SolrIndexSearcher.<init> Opening Searcher@1c3af7c main
[junit4] 2> 2028930 T4685 oasc.CachingDirectoryFactory.get return new directory for ..\..\..\..\..\..\..\..\..\Users\JenkinsSlave\workspace\Lucene-Solr-4.x-Windows\solr\build\solr-core\test\J0\.\org.apache.solr.cloud.CollectionsAPIDistributedZkTest-controljetty-1387149268675\solrj_collection_shard2_replica1\data\index
[junit4] 2> 2028928 T4708 oasc.SolrDeletionPolicy.onCommit SolrDeletionPolicy.onCommit: commits: num=1
[junit4] 2> commit{dir=MockDirectoryWrapper(org.apache.lucene.store.RAMDirectory@1c790b lockFactory=org.apache.lucene.store.SingleInstanceLockFactory@473717),segFN=segments_1,generation=1}
[junit4] 2> 2028936 T4708 oasc.SolrDeletionPolicy.updateCommits newest commit generation = 1
[junit4] 2> 2028940 T4708 oasup.UpdateRequestProcessorChain.init creating updateRequestProcessorChain "nodistrib"
[junit4] 2> 2028940 T4708 oasup.UpdateRequestProcessorChain.init creating updateRequestProcessorChain "dedupe"
[junit4] 2> 2028941 T4708 oasup.UpdateRequestProcessorChain.init inserting DistributedUpdateProcessorFactory into updateRequestProcessorChain "dedupe"
[junit4] 2> 2028941 T4708 oasup.UpdateRequestProcessorChain.init creating updateRequestProcessorChain "stored_sig"
[junit4] 2> 2028941 T4708 oasup.UpdateRequestProcessorChain.init inserting DistributedUpdateProcessorFactory into updateRequestProcessorChain "stored_sig"
[junit4] 2> 2028942 T4708 oasup.UpdateRequestProcessorChain.init creating updateRequestProcessorChain "distrib-dup-test-chain-explicit"
[junit4] 2> 2028943 T4708 oasup.UpdateRequestProcessorChain.init creating updateRequestProcessorChain "distrib-dup-test-chain-implicit"
[junit4] 2> 2028943 T4708 oasup.UpdateRequestProcessorChain.init inserting DistributedUpdateProcessorFactory into updateRequestProcessorChain "distrib-dup-test-chain-implicit"
[junit4] 2> 2028944 T4708 oasc.SolrCore.loadUpdateProcessorChains no updateRequestProcessorChain defined as default, creating implicit default
[junit4] 2> 2028945 T4708 oasc.RequestHandlers.initHandlersFromConfig created standard: solr.StandardRequestHandler
[junit4] 2> 2028945 T4708 oasc.RequestHandlers.initHandlersFromConfig created /get: solr.RealTimeGetHandler
[junit4] 2> 2028946 T4708 oasc.RequestHandlers.initHandlersFromConfig adding lazy requestHandler: solr.ReplicationHandler
[junit4] 2> 2028946 T4708 oasc.RequestHandlers.initHandlersFromConfig created /replication: solr.ReplicationHandler
[junit4] 2> 2028948 T4708 oasc.RequestHandlers.initHandlersFromConfig created /update: solr.UpdateRequestHandler
[junit4] 2> 2028948 T4708 oasc.RequestHandlers.initHandlersFromConfig created /admin/: org.apache.solr.handler.admin.AdminHandlers
[junit4] 2> 2028935 T4685 oasu.RandomMergePolicy.<init> RandomMergePolicy wrapping class org.apache.lucene.index.TieredMergePolicy: [TieredMergePolicy: maxMergeAtOnce=47, maxMergeAtOnceExplicit=24, maxMergedSegmentMB=75.1435546875, floorSegmentMB=1.8193359375, forceMergeDeletesPctAllowed=14.124764945150462, segmentsPerTier=43.0, maxCFSSegmentSizeMB=8.796093022207999E12, noCFSRatio=0.4314097897793133
[junit4] 2> 2028935 T4734 oass.OpenExchangeRatesOrgProvider$OpenExchangeRates.<init> WARN Unknown key IMPORTANT NOTE
[junit4] 2> 2028950 T4685 oasc.SolrDeletionPolicy.onCommit SolrDeletionPolicy.onCommit: commits: num=1
[junit4] 2> commit{dir=MockDirectoryWrapper(org.apache.lucene.store.RAMDirectory@1455b1e lockFactory=org.apache.lucene.store.SingleInstanceLockFactory@9826da),segFN=segments_1,generation=1}
[junit4] 2> 2028951 T4685 oasc.SolrDeletionPolicy.updateCommits newest commit generation = 1
[junit4] 2> 2028950 T4760 oasc.SolrCore.registerSearcher [solrj_collection_shard1_replica2] Registered new searcher Searcher@1c3af7c main{StandardDirectoryReader(segments_1:1:nrt)}
[junit4] 2> 2028950 T4734 oass.OpenExchangeRatesOrgProvider$OpenExchangeRates.<init> WARN Expected key, got STRING
[junit4] 2> 2028952 T4734 oass.OpenExchangeRatesOrgProvider.reload Reloading exchange rates from open-exchange-rates.json
[junit4] 2> 2028949 T4708 oasc.RequestHandlers.initHandlersFromConfig created /admin/file: solr.admin.ShowFileRequestHandler
[junit4] 2> 2028956 T4708 oashl.XMLLoader.init xsltCacheLifetimeSeconds=60
[junit4] 2> 2028957 T4685 oasup.UpdateRequestProcessorChain.init creating updateRequestProcessorChain "nodistrib"
[junit4] 2> 2028957 T4685 oasup.UpdateRequestProcessorChain.init creating updateRequestProcessorChain "dedupe"
[junit4] 2> 2028958 T4685 oasup.UpdateRequestProcessorChain.init inserting DistributedUpdateProcessorFactory into updateRequestProcessorChain "dedupe"
[junit4] 2> 2028958 T4685 oasup.UpdateRequestProcessorChain.init creating updateRequestProcessorChain "stored_sig"
[junit4] 2> 2028958 T4685 oasup.UpdateRequestProcessorChain.init inserting DistributedUpdateProcessorFactory into updateRequestProcessorChain "stored_sig"
[junit4] 2> 2028958 T4685 oasup.UpdateRequestProcessorChain.init creating updateRequestProcessorChain "distrib-dup-test-chain-explicit"
[junit4] 2> 2028961 T4685 oasup.UpdateRequestProcessorChain.init creating updateRequestProcessorChain "distrib-dup-test-chain-implicit"
[junit4] 2> 2028961 T4685 oasup.UpdateRequestProcessorChain.init inserting DistributedUpdateProcessorFactory into updateRequestProcessorChain "distrib-dup-test-chain-implicit"
[junit4] 2> 2028961 T4685 oasc.SolrCore.loadUpdateProcessorChains no updateRequestProcessorChain defined as default, creating implicit default
[junit4] 2> 2028962 T4685 oasc.RequestHandlers.initHandlersFromConfig created standard: solr.StandardRequestHandler
[junit4] 2> 2028963 T4708 oasu.CommitTracker.<init> Hard AutoCommit: disabled
[junit4] 2> 2028963 T4685 oasc.RequestHandlers.initHandlersFromConfig created /get: solr.RealTimeGetHandler
[junit4] 2> 2028963 T4708 oasu.CommitTracker.<init> Soft AutoCommit: disabled
[junit4] 2> 2028964 T4685 oasc.RequestHandlers.initHandlersFromConfig adding lazy requestHandler: solr.ReplicationHandler
[junit4] 2> 2028965 T4708 oasu.RandomMergePolicy.<init> RandomMergePolicy wrapping class org.apache.lucene.index.LogDocMergePolicy: [LogDocMergePolicy: minMergeSize=1000, mergeFactor=32, maxMergeSize=9223372036854775807, maxMergeSizeForForcedMerge=9223372036854775807, calibrateSizeByDeletes=false, maxMergeDocs=2147483647, maxCFSSegmentSizeMB=8.796093022207999E12, noCFSRatio=0.13112597252937902]
[junit4] 2> 2028967 T4734 oass.OpenExchangeRatesOrgProvider$OpenExchangeRates.<init> WARN Unknown key IMPORTANT NOTE
[junit4] 2> 2028967 T4734 oass.OpenExchangeRatesOrgProvider$OpenExchangeRates.<init> WARN Expected key, got STRING
[junit4] 2> 2028966 T4685 oasc.RequestHandlers.initHandlersFromConfig created /replication: solr.ReplicationHandler
[junit4] 2> 2028969 T4734 oasc.SolrCore.initDirectoryFactory org.apache.solr.core.MockDirectoryFactory
[junit4] 2> 2028969 T4685 oasc.RequestHandlers.initHandlersFromConfig created /update: solr.UpdateRequestHandler
[junit4] 2> 2028967 T4708 oasc.SolrDeletionPolicy.onInit SolrDeletionPolicy.onInit: commits: num=1
[junit4] 2> commit{dir=MockDirectoryWrapper(org.apache.lucene.store.RAMDirectory@1c790b lockFactory=org.apache.lucene.store.SingleInstanceLockFactory@473717),segFN=segments_1,generation=1}
[junit4] 2> 2028970 T4708 oasc.SolrDeletionPolicy.updateCommits newest commit generation = 1
[junit4] 2> 2028967 T4747 oasc.CoreContainer.registerCore registering core: solrj_collection_shard1_replica2
[junit4] 2> 2028971 T4747 oasc.ZkController.register Register replica - core:solrj_collection_shard1_replica2 address:http://127.0.0.1:62701 collection:solrj_collection shard:shard1
[junit4] 2> 2028971 T4708 oass.SolrIndexSearcher.<init> Opening Searcher@173eaa6 main
[junit4] 2> 2028970 T4685 oasc.RequestHandlers.initHandlersFromConfig created /admin/: org.apache.solr.handler.admin.AdminHandlers
[junit4] 2> 2028970 T4734 oasc.SolrCore.<init> [solrj_collection_shard1_replica1] Opening new SolrCore at ..\..\..\..\..\..\..\..\..\Users\JenkinsSlave\workspace\Lucene-Solr-4.x-Windows\solr\build\solr-core\test\J0\.\org.apache.solr.cloud.CollectionsAPIDistributedZkTest-jetty3-1387149273925\solrj_collection_shard1_replica1\, dataDir=..\..\..\..\..\..\..\..\..\Users\JenkinsSlave\workspace\Lucene-Solr-4.x-Windows\solr\build\solr-core\test\J0\.\org.apache.solr.cloud.CollectionsAPIDistributedZkTest-jetty3-1387149273925\solrj_collection_shard1_replica1\data\
[junit4] 2> 2028973 T4734 oasc.JmxMonitoredMap.<init> JMX monitoring is enabled. Adding Solr mbeans to JMX Server: com.sun.jmx.mbeanserver.JmxMBeanServer@546169
[junit4] 2> 2028974 T4734 oasc.CachingDirectoryFactory.get return new directory for ..\..\..\..\..\..\..\..\..\Users\JenkinsSlave\workspace\Lucene-Solr-4.x-Windows\solr\build\solr-core\test\J0\.\org.apache.solr.cloud.CollectionsAPIDistributedZkTest-jetty3-1387149273925\solrj_collection_shard1_replica1\data\
[junit4] 2> 2028975 T4734 oasc.SolrCore.getNewIndexDir New index directory detected: old=null new=..\..\..\..\..\..\..\..\..\Users\JenkinsSlave\workspace\Lucene-Solr-4.x-Windows\solr\build\solr-core\test\J0\.\org.apache.solr.cloud.CollectionsAPIDistributedZkTest-jetty3-1387149273925\solrj_collection_shard1_replica1\data\index/
[junit4] 2> 2028975 T4734 oasc.SolrCore.initIndex WARN [solrj_collection_shard1_replica1] Solr index directory '..\..\..\..\..\..\..\..\..\Users\JenkinsSlave\workspace\Lucene-Solr-4.x-Windows\solr\build\solr-core\test\J0\.\org.apache.solr.cloud.CollectionsAPIDistributedZkTest-jetty3-1387149273925\solrj_collection_shard1_replica1\data\index' doesn't exist. Creating new index...
[junit4] 2> 2028975 T4761 oasc.SolrCore.registerSearcher [solrj_collection_shard2_replica2] Registered new searcher Searcher@173eaa6 main{StandardDirectoryReader(segments_1:1:nrt)}
[junit4] 2> 2028973 T4685 oasc.RequestHandlers.initHandlersFromConfig created /admin/file: solr.admin.ShowFileRequestHandler
[junit4] 2> 2028975 T4734 oasc.CachingDirectoryFactory.get return new directory for ..\..\..\..\..\..\..\..\..\Users\JenkinsSlave\workspace\Lucene-Solr-4.x-Windows\solr\build\solr-core\test\J0\.\org.apache.solr.cloud.CollectionsAPIDistributedZkTest-jetty3-1387149273925\solrj_collection_shard1_replica1\data\index
[junit4] 2> 2028978 T4734 oasu.RandomMergePolicy.<init> RandomMergePolicy wrapping class org.apache.lucene.index.TieredMergePolicy: [TieredMergePolicy: maxMergeAtOnce=47, maxMergeAtOnceExplicit=24, maxMergedSegmentMB=75.1435546875, floorSegmentMB=1.8193359375, forceMergeDeletesPctAllowed=14.124764945150462, segmentsPerTier=43.0, maxCFSSegmentSizeMB=8.796093022207999E12, noCFSRatio=0.4314097897793133
[junit4] 2> 2028979 T4685 oashl.XMLLoader.init xsltCacheLifetimeSeconds=60
[junit4] 2> 2028980 T4708 oasc.CoreContainer.registerCore registering core: solrj_collection_shard2_replica2
[junit4] 2> 2028980 T4708 oasc.ZkController.register Register replica - core:solrj_collection_shard2_replica2 address:http://127.0.0.1:62674 collection:solrj_collection shard:shard2
[junit4] 2> 2028981 T4734 oasc.SolrDeletionPolicy.onCommit SolrDeletionPolicy.onCommit: commits: num=1
[junit4] 2> commit{dir=MockDirectoryWrapper(org.apache.lucene.store.RAMDirectory@6548cd lockFactory=org.apache.lucene.store.SingleInstanceLockFactory@c54d0e),segFN=segments_1,generation=1}
[junit4] 2> 2028982 T4734 oasc.SolrDeletionPolicy.updateCommits newest commit generation = 1
[junit4] 2> 2028975 T4747 oascc.SolrZkClient.makePath makePath: /collections/solrj_collection/leader_elect/shard1/election
[junit4] 2> 2028989 T4708 oascc.SolrZkClient.makePath makePath: /collections/solrj_collection/leader_elect/shard2/election
[junit4] 2> 2028987 T4734 oasup.UpdateRequestProcessorChain.init creating updateRequestProcessorChain "nodistrib"
[junit4] 2> 2028991 T4734 oasup.UpdateRequestProcessorChain.init creating updateRequestProcessorChain "dedupe"
[junit4] 2> 2028991 T4734 oasup.UpdateRequestProcessorChain.init inserting DistributedUpdateProcessorFactory into updateRequestProcessorChain "dedupe"
[junit4] 2> 2028991 T4734 oasup.UpdateRequestProcessorChain.init creating updateRequestProcessorChain "stored_sig"
[junit4] 2> 2028991 T4734 oasup.UpdateRequestProcessorChain.init inserting DistributedUpdateProcessorFactory into updateRequestProcessorChain "stored_sig"
[junit4] 2> 2028991 T4734 oasup.UpdateRequestProcessorChain.init creating updateRequestProcessorChain "distrib-dup-test-chain-explicit"
[junit4] 2> 2028994 T4734 oasup.UpdateRequestProcessorChain.init creating updateRequestProcessorChain "distrib-dup-test-chain-implicit"
[junit4] 2> 2028994 T4734 oasup.UpdateRequestProcessorChain.init inserting DistributedUpdateProcessorFactory into updateRequestProcessorChain "distrib-dup-test-chain-impli
[...truncated too long message...]
ndex [CachedDir<<refCount=0;path=.\org.apache.solr.cloud.CollectionsAPIDistributedZkTest-jetty4-1387149275944\awholynewstresscollection_collection0_0_shard2_replica4\data\index;done=false>>]
[junit4] 2> 2303911 T4668 oasc.CachingDirectoryFactory.close Closing directory: .\org.apache.solr.cloud.CollectionsAPIDistributedZkTest-jetty4-1387149275944\awholynewstresscollection_collection0_0_shard2_replica4\data\index
[junit4] 2> 2303924 T4794 oascc.ZkStateReader$3.process Updating live nodes... (0)
[junit4] 2> 2303926 T4699 oascc.ZkStateReader$3.process Updating live nodes... (0)
[junit4] 2> 2303935 T4668 oejsh.ContextHandler.doStop stopped o.e.j.s.ServletContextHandler{/,null}
[junit4] 2> 2304001 T4668 oasc.ChaosMonkey.monkeyLog monkey: stop shard! 62662
[junit4] 2> !!!! WARNING: best effort to remove C:\Users\JenkinsSlave\workspace\Lucene-Solr-4.x-Windows\solr\build\solr-core\test\J0\.\org.apache.solr.cloud.CollectionsAPIDistributedZkTest-1387149268234\zookeeper\server1\data\version-2\log.1 FAILED !!!!!
[junit4] 2> !!!! WARNING: best effort to remove C:\Users\JenkinsSlave\workspace\Lucene-Solr-4.x-Windows\solr\build\solr-core\test\J0\.\org.apache.solr.cloud.CollectionsAPIDistributedZkTest-1387149268234\zookeeper\server1\data\version-2 FAILED !!!!!
[junit4] 2> !!!! WARNING: best effort to remove C:\Users\JenkinsSlave\workspace\Lucene-Solr-4.x-Windows\solr\build\solr-core\test\J0\.\org.apache.solr.cloud.CollectionsAPIDistributedZkTest-1387149268234\zookeeper\server1\data FAILED !!!!!
[junit4] 2> !!!! WARNING: best effort to remove C:\Users\JenkinsSlave\workspace\Lucene-Solr-4.x-Windows\solr\build\solr-core\test\J0\.\org.apache.solr.cloud.CollectionsAPIDistributedZkTest-1387149268234\zookeeper\server1 FAILED !!!!!
[junit4] 2> !!!! WARNING: best effort to remove C:\Users\JenkinsSlave\workspace\Lucene-Solr-4.x-Windows\solr\build\solr-core\test\J0\.\org.apache.solr.cloud.CollectionsAPIDistributedZkTest-1387149268234\zookeeper FAILED !!!!!
[junit4] 2> !!!! WARNING: best effort to remove C:\Users\JenkinsSlave\workspace\Lucene-Solr-4.x-Windows\solr\build\solr-core\test\J0\.\org.apache.solr.cloud.CollectionsAPIDistributedZkTest-1387149268234 FAILED !!!!!
[junit4] 2> 2304015 T4668 oas.SolrTestCaseJ4.tearDown ###Ending testDistribSearch
[junit4] 2> 2304017 T4668 oasc.ZkTestServer.send4LetterWord connecting to 127.0.0.1:62649 62649
[junit4] 2> 2305577 T4754 oascc.ZkStateReader$3.process WARN ZooKeeper watch triggered, but Solr cannot talk to ZK
[junit4] 1> client port:0.0.0.0/0.0.0.0:0
[junit4] 2> NOTE: reproduce with: ant test -Dtestcase=CollectionsAPIDistributedZkTest -Dtests.method=testDistribSearch -Dtests.seed=6BC34A766454FBAE -Dtests.slow=true -Dtests.locale=da_DK -Dtests.timezone=America/Anchorage -Dtests.file.encoding=ISO-8859-1
[junit4] ERROR 292s | CollectionsAPIDistributedZkTest.testDistribSearch <<<
[junit4] > Throwable #1: com.carrotsearch.randomizedtesting.UncaughtExceptionError: Captured an uncaught exception in thread: Thread[id=4976, name=Thread-2016, state=RUNNABLE, group=TGRP-CollectionsAPIDistributedZkTest]
[junit4] > at __randomizedtesting.SeedInfo.seed([6BC34A766454FBAE:EA25C46E130B9B92]:0)
[junit4] > Caused by: org.apache.solr.client.solrj.impl.HttpSolrServer$RemoteSolrException: collection already exists: awholynewstresscollection_collection0_0
[junit4] > at __randomizedtesting.SeedInfo.seed([6BC34A766454FBAE]:0)
[junit4] > at org.apache.solr.client.solrj.impl.HttpSolrServer.request(HttpSolrServer.java:495)
[junit4] > at org.apache.solr.client.solrj.impl.HttpSolrServer.request(HttpSolrServer.java:199)
[junit4] > at org.apache.solr.client.solrj.impl.LBHttpSolrServer.request(LBHttpSolrServer.java:283)
[junit4] > at org.apache.solr.client.solrj.impl.CloudSolrServer.request(CloudSolrServer.java:640)
[junit4] > at org.apache.solr.cloud.AbstractFullDistribZkTestBase.createCollection(AbstractFullDistribZkTestBase.java:1607)
[junit4] > at org.apache.solr.cloud.AbstractFullDistribZkTestBase.createCollection(AbstractFullDistribZkTestBase.java:1633)
[junit4] > at org.apache.solr.cloud.CollectionsAPIDistributedZkTest$1CollectionThread.run(CollectionsAPIDistributedZkTest.java:916)
[junit4] 2> 2306609 T4668 oas.SolrTestCaseJ4.deleteCore ###deleteCore
[junit4] 2> NOTE: test params are: codec=Lucene3x, sim=RandomSimilarityProvider(queryNorm=false,coord=crazy): {}, locale=da_DK, timezone=America/Anchorage
[junit4] 2> NOTE: Windows 7 6.1 x86/Sun Microsystems Inc. 1.6.0_45 (32-bit)/cpus=2,threads=2,free=47503648,total=323657728
[junit4] 2> NOTE: All tests run in this JVM: [PreAnalyzedFieldTest, BasicZkTest, TestDocBasedVersionConstraints, DateFieldTest, TestSolrXMLSerializer, DefaultValueUpdateProcessorTest, ResponseLogComponentTest, CoreAdminCreateDiscoverTest, BlockDirectoryTest, FastVectorHighlighterTest, HdfsBasicDistributedZkTest, ConvertedLegacyTest, TestPHPSerializedResponseWriter, RegexBoostProcessorTest, AddBlockUpdateTest, TestCollationKeyRangeQueries, UpdateParamsTest, SoftAutoCommitTest, TestLRUCache, QueryElevationComponentTest, AddSchemaFieldsUpdateProcessorFactoryTest, PreAnalyzedUpdateProcessorTest, InfoHandlerTest, CoreMergeIndexesAdminHandlerTest, SuggestComponentTest, TestUtils, FileUtilsTest, TestSchemaResource, TestPseudoReturnFields, SolrIndexConfigTest, TestAnalyzeInfixSuggestions, TestDFRSimilarityFactory, DisMaxRequestHandlerTest, SolrXmlInZkTest, TestImplicitCoreProperties, TestDistribDocBasedVersion, TestSolrQueryParserResource, TestCloudManagedSchema, DirectUpdateHandlerTest, MultiTermTest, TestJmxIntegration, TestQueryUtils, TestReloadAndDeleteDocs, SuggesterTSTTest, TestUpdate, TestFuzzyAnalyzedSuggestions, TestOmitPositions, TestFaceting, TestDocSet, StandardRequestHandlerTest, TestSort, TestWordDelimiterFilterFactory, TestConfig, HdfsRecoveryZkTest, TestSchemaVersionResource, TestAnalyzedSuggestions, SortByFunctionTest, DocValuesMissingTest, TestFieldTypeResource, HdfsBasicDistributedZk2Test, OverseerCollectionProcessorTest, LegacyHTMLStripCharFilterTest, TestCodecSupport, TestFastLRUCache, ChaosMonkeySafeLeaderTest, TestSolrXmlPersistence, ZkSolrClientTest, ChaosMonkeyNothingIsSafeTest, TestRandomMergePolicy, PluginInfoTest, BasicFunctionalityTest, SolrInfoMBeanTest, UnloadDistributedZkTest, TestSweetSpotSimilarityFactory, DocValuesTest, TestStressLucene, AssignTest, TestNRTOpen, TestFieldCollectionResource, PrimitiveFieldTypeTest, RecoveryZkTest, TestSolrIndexConfig, DebugComponentTest, TestPartialUpdateDeduplication, TestExtendedDismaxParser, BlockCacheTest, TestInfoStreamLogging, SystemInfoHandlerTest, FieldMutatingUpdateProcessorTest, SearchHandlerTest, TestDefaultSearchFieldResource, SuggesterFSTTest, TestFieldResource, TestStressReorder, TestTrie, DistributedDebugComponentTest, EchoParamsTest, StatelessScriptUpdateProcessorFactoryTest, SolrRequestParserTest, TestQuerySenderNoQuery, SpellPossibilityIteratorTest, QueryEqualityTest, RequestHandlersTest, SliceStateTest, TestClassNameShortening, TestValueSourceCache, TestSolrCoreProperties, SliceStateUpdateTest, AlternateDirectoryTest, TestSolrDeletionPolicy1, TestDocumentBuilder, SOLR749Test, TestCoreDiscovery, TestNonNRTOpen, TestHighFrequencyDictionaryFactory, TestDistributedSearch, DirectSolrSpellCheckerTest, LeaderElectionTest, ShardRoutingCustomTest, SpellCheckCollatorTest, ExternalFileFieldSortTest, HardAutoCommitTest, SpellCheckComponentTest, TestNoOpRegenerator, TestZkChroot, CoreAdminHandlerTest, TestIndexSearcher, DocumentBuilderTest, TimeZoneUtilsTest, TriLevelCompositeIdRoutingTest, SuggesterWFSTTest, JSONWriterTest, RequiredFieldsTest, DistanceFunctionTest, LeaderElectionIntegrationTest, ShardSplitTest, ZkControllerTest, TestFastOutputStream, TestSystemIdResolver, TestMultiCoreConfBootstrap, BadComponentTest, BinaryUpdateRequestHandlerTest, DateMathParserTest, EnumFieldTest, TestManagedSchemaFieldResource, DeleteShardTest, DistributedTermsComponentTest, TestRTGBase, CachingDirectoryFactoryTest, TestSimpleQParserPlugin, TestSearchPerf, HighlighterConfigTest, TestCSVResponseWriter, TestBinaryField, TestFileDictionaryLookup, WordBreakSolrSpellCheckerTest, TestStressVersions, ParsingFieldUpdateProcessorsTest, TestCollapseQParserPlugin, ShardRoutingTest, HighlighterTest, DistributedSuggesterComponentTest, BasicDistributedZkTest, CollectionsAPIDistributedZkTest]
[junit4] Completed in 292.51s, 1 test, 1 error <<< FAILURES!
[...truncated 572 lines...]
BUILD FAILED
C:\Users\JenkinsSlave\workspace\Lucene-Solr-4.x-Windows\build.xml:459: The following error occurred while executing this line:
C:\Users\JenkinsSlave\workspace\Lucene-Solr-4.x-Windows\build.xml:439: The following error occurred while executing this line:
C:\Users\JenkinsSlave\workspace\Lucene-Solr-4.x-Windows\build.xml:39: The following error occurred while executing this line:
C:\Users\JenkinsSlave\workspace\Lucene-Solr-4.x-Windows\extra-targets.xml:37: The following error occurred while executing this line:
C:\Users\JenkinsSlave\workspace\Lucene-Solr-4.x-Windows\solr\build.xml:189: The following error occurred while executing this line:
C:\Users\JenkinsSlave\workspace\Lucene-Solr-4.x-Windows\solr\common-build.xml:491: The following error occurred while executing this line:
C:\Users\JenkinsSlave\workspace\Lucene-Solr-4.x-Windows\lucene\common-build.xml:1307: The following error occurred while executing this line:
C:\Users\JenkinsSlave\workspace\Lucene-Solr-4.x-Windows\lucene\common-build.xml:940: There were test failures: 347 suites, 1516 tests, 1 error, 41 ignored (13 assumptions)
Total time: 110 minutes 6 seconds
Build step 'Invoke Ant' marked build as failure
Description set: Java: 32bit/jdk1.6.0_45 -client -XX:+UseConcMarkSweepGC
Archiving artifacts
Recording test results
Email was triggered for: Failure
Sending email for trigger: Failure
[JENKINS] Lucene-Solr-4.x-Windows (64bit/jdk1.8.0-ea-b119) - Build
# 3495 - Still Failing!
Posted by Policeman Jenkins Server <je...@thetaphi.de>.
Build: http://jenkins.thetaphi.de/job/Lucene-Solr-4.x-Windows/3495/
Java: 64bit/jdk1.8.0-ea-b119 -XX:+UseCompressedOops -XX:+UseParallelGC
1 tests failed.
REGRESSION: org.apache.solr.core.TestNonNRTOpen.testReaderIsNotNRT
Error Message:
expected:<3> but was:<2>
Stack Trace:
java.lang.AssertionError: expected:<3> but was:<2>
at __randomizedtesting.SeedInfo.seed([E763DD0E7D8A9CA8:52E5BC89C24B2E5C]:0)
at org.junit.Assert.fail(Assert.java:93)
at org.junit.Assert.failNotEquals(Assert.java:647)
at org.junit.Assert.assertEquals(Assert.java:128)
at org.junit.Assert.assertEquals(Assert.java:472)
at org.junit.Assert.assertEquals(Assert.java:456)
at org.apache.solr.core.TestNonNRTOpen.assertNotNRT(TestNonNRTOpen.java:133)
at org.apache.solr.core.TestNonNRTOpen.testReaderIsNotNRT(TestNonNRTOpen.java:94)
at sun.reflect.NativeMethodAccessorImpl.invoke0(Native Method)
at sun.reflect.NativeMethodAccessorImpl.invoke(NativeMethodAccessorImpl.java:62)
at sun.reflect.DelegatingMethodAccessorImpl.invoke(DelegatingMethodAccessorImpl.java:43)
at java.lang.reflect.Method.invoke(Method.java:483)
at com.carrotsearch.randomizedtesting.RandomizedRunner.invoke(RandomizedRunner.java:1559)
at com.carrotsearch.randomizedtesting.RandomizedRunner.access$600(RandomizedRunner.java:79)
at com.carrotsearch.randomizedtesting.RandomizedRunner$6.evaluate(RandomizedRunner.java:737)
at com.carrotsearch.randomizedtesting.RandomizedRunner$7.evaluate(RandomizedRunner.java:773)
at com.carrotsearch.randomizedtesting.RandomizedRunner$8.evaluate(RandomizedRunner.java:787)
at com.carrotsearch.randomizedtesting.rules.SystemPropertiesRestoreRule$1.evaluate(SystemPropertiesRestoreRule.java:53)
at org.apache.lucene.util.TestRuleSetupTeardownChained$1.evaluate(TestRuleSetupTeardownChained.java:50)
at org.apache.lucene.util.TestRuleFieldCacheSanity$1.evaluate(TestRuleFieldCacheSanity.java:51)
at org.apache.lucene.util.AbstractBeforeAfterRule$1.evaluate(AbstractBeforeAfterRule.java:46)
at com.carrotsearch.randomizedtesting.rules.SystemPropertiesInvariantRule$1.evaluate(SystemPropertiesInvariantRule.java:55)
at org.apache.lucene.util.TestRuleThreadAndTestName$1.evaluate(TestRuleThreadAndTestName.java:49)
at org.apache.lucene.util.TestRuleIgnoreAfterMaxFailures$1.evaluate(TestRuleIgnoreAfterMaxFailures.java:70)
at org.apache.lucene.util.TestRuleMarkFailure$1.evaluate(TestRuleMarkFailure.java:48)
at com.carrotsearch.randomizedtesting.rules.StatementAdapter.evaluate(StatementAdapter.java:36)
at com.carrotsearch.randomizedtesting.ThreadLeakControl$StatementRunner.run(ThreadLeakControl.java:358)
at com.carrotsearch.randomizedtesting.ThreadLeakControl.forkTimeoutingTask(ThreadLeakControl.java:782)
at com.carrotsearch.randomizedtesting.ThreadLeakControl$3.evaluate(ThreadLeakControl.java:442)
at com.carrotsearch.randomizedtesting.RandomizedRunner.runSingleTest(RandomizedRunner.java:746)
at com.carrotsearch.randomizedtesting.RandomizedRunner$3.evaluate(RandomizedRunner.java:648)
at com.carrotsearch.randomizedtesting.RandomizedRunner$4.evaluate(RandomizedRunner.java:682)
at com.carrotsearch.randomizedtesting.RandomizedRunner$5.evaluate(RandomizedRunner.java:693)
at com.carrotsearch.randomizedtesting.rules.StatementAdapter.evaluate(StatementAdapter.java:36)
at com.carrotsearch.randomizedtesting.rules.SystemPropertiesRestoreRule$1.evaluate(SystemPropertiesRestoreRule.java:53)
at org.apache.lucene.util.AbstractBeforeAfterRule$1.evaluate(AbstractBeforeAfterRule.java:46)
at org.apache.lucene.util.TestRuleStoreClassName$1.evaluate(TestRuleStoreClassName.java:42)
at com.carrotsearch.randomizedtesting.rules.SystemPropertiesInvariantRule$1.evaluate(SystemPropertiesInvariantRule.java:55)
at com.carrotsearch.randomizedtesting.rules.NoShadowingOrOverridesOnMethodsRule$1.evaluate(NoShadowingOrOverridesOnMethodsRule.java:39)
at com.carrotsearch.randomizedtesting.rules.NoShadowingOrOverridesOnMethodsRule$1.evaluate(NoShadowingOrOverridesOnMethodsRule.java:39)
at com.carrotsearch.randomizedtesting.rules.StatementAdapter.evaluate(StatementAdapter.java:36)
at org.apache.lucene.util.TestRuleAssertionsRequired$1.evaluate(TestRuleAssertionsRequired.java:43)
at org.apache.lucene.util.TestRuleMarkFailure$1.evaluate(TestRuleMarkFailure.java:48)
at org.apache.lucene.util.TestRuleIgnoreAfterMaxFailures$1.evaluate(TestRuleIgnoreAfterMaxFailures.java:70)
at org.apache.lucene.util.TestRuleIgnoreTestSuites$1.evaluate(TestRuleIgnoreTestSuites.java:55)
at com.carrotsearch.randomizedtesting.rules.StatementAdapter.evaluate(StatementAdapter.java:36)
at com.carrotsearch.randomizedtesting.ThreadLeakControl$StatementRunner.run(ThreadLeakControl.java:358)
at java.lang.Thread.run(Thread.java:744)
Build Log:
[...truncated 10044 lines...]
[junit4] Suite: org.apache.solr.core.TestNonNRTOpen
[junit4] 2> 160577 T725 oas.SolrTestCaseJ4.initCore ####initCore
[junit4] 2> Creating dataDir: C:\Users\JenkinsSlave\workspace\Lucene-Solr-4.x-Windows\solr\build\solr-core\test\J0\.\solrtest-TestNonNRTOpen-1387174383852
[junit4] 2> 160580 T725 oasc.SolrResourceLoader.<init> new SolrResourceLoader for directory: 'C:\Users\JenkinsSlave\workspace\Lucene-Solr-4.x-Windows\solr\build\solr-core\test-files\solr\collection1\'
[junit4] 2> 160582 T725 oasc.SolrResourceLoader.replaceClassLoader Adding 'file:/C:/Users/JenkinsSlave/workspace/Lucene-Solr-4.x-Windows/solr/build/solr-core/test-files/solr/collection1/lib/classes/' to classloader
[junit4] 2> 160585 T725 oasc.SolrResourceLoader.replaceClassLoader Adding 'file:/C:/Users/JenkinsSlave/workspace/Lucene-Solr-4.x-Windows/solr/build/solr-core/test-files/solr/collection1/lib/README' to classloader
[junit4] 2> 160642 T725 oasc.SolrConfig.<init> Using Lucene MatchVersion: LUCENE_47
[junit4] 2> 160647 T725 oasc.SolrConfig.<init> Loaded SolrConfig: solrconfig-basic.xml
[junit4] 2> 160650 T725 oass.IndexSchema.readSchema Reading Solr Schema from schema-minimal.xml
[junit4] 2> 160658 T725 oass.IndexSchema.readSchema [null] Schema name=minimal
[junit4] 2> 160661 T725 oass.IndexSchema.readSchema WARN no uniqueKey specified in schema.
[junit4] 2> 160661 T725 oasc.SolrResourceLoader.locateSolrHome JNDI not configured for solr (NoInitialContextEx)
[junit4] 2> 160661 T725 oasc.SolrResourceLoader.locateSolrHome using system property solr.solr.home: C:\Users\JenkinsSlave\workspace\Lucene-Solr-4.x-Windows\solr\build\solr-core\test-files\solr
[junit4] 2> 160661 T725 oasc.SolrResourceLoader.<init> new SolrResourceLoader for directory: 'C:\Users\JenkinsSlave\workspace\Lucene-Solr-4.x-Windows\solr\build\solr-core\test-files\solr\'
[junit4] 2> 160676 T725 oasc.SolrResourceLoader.locateSolrHome JNDI not configured for solr (NoInitialContextEx)
[junit4] 2> 160676 T725 oasc.SolrResourceLoader.locateSolrHome using system property solr.solr.home: C:\Users\JenkinsSlave\workspace\Lucene-Solr-4.x-Windows\solr\build\solr-core\test-files\solr
[junit4] 2> 160676 T725 oasc.SolrResourceLoader.<init> new SolrResourceLoader for deduced Solr Home: 'C:\Users\JenkinsSlave\workspace\Lucene-Solr-4.x-Windows\solr\build\solr-core\test-files\solr\'
[junit4] 2> 160700 T725 oasc.CoreContainer.<init> New CoreContainer 1444753258
[junit4] 2> 160700 T725 oasc.CoreContainer.load Loading cores into CoreContainer [instanceDir=C:\Users\JenkinsSlave\workspace\Lucene-Solr-4.x-Windows\solr\build\solr-core\test-files\solr\]
[junit4] 2> 160701 T725 oashc.HttpShardHandlerFactory.getParameter Setting socketTimeout to: 0
[junit4] 2> 160701 T725 oashc.HttpShardHandlerFactory.getParameter Setting urlScheme to: http://
[junit4] 2> 160701 T725 oashc.HttpShardHandlerFactory.getParameter Setting connTimeout to: 0
[junit4] 2> 160701 T725 oashc.HttpShardHandlerFactory.getParameter Setting maxConnectionsPerHost to: 20
[junit4] 2> 160701 T725 oashc.HttpShardHandlerFactory.getParameter Setting corePoolSize to: 0
[junit4] 2> 160701 T725 oashc.HttpShardHandlerFactory.getParameter Setting maximumPoolSize to: 2147483647
[junit4] 2> 160701 T725 oashc.HttpShardHandlerFactory.getParameter Setting maxThreadIdleTime to: 5
[junit4] 2> 160701 T725 oashc.HttpShardHandlerFactory.getParameter Setting sizeOfQueue to: -1
[junit4] 2> 160701 T725 oashc.HttpShardHandlerFactory.getParameter Setting fairnessPolicy to: false
[junit4] 2> 160711 T725 oasl.LogWatcher.createWatcher SLF4J impl is org.slf4j.impl.Log4jLoggerFactory
[junit4] 2> 160711 T725 oasl.LogWatcher.newRegisteredLogWatcher Registering Log Listener [Log4j (org.slf4j.impl.Log4jLoggerFactory)]
[junit4] 2> 160711 T725 oasc.CoreContainer.load Host Name:
[junit4] 2> 160788 T726 oasc.CoreContainer.create Creating SolrCore 'collection1' using instanceDir: C:\Users\JenkinsSlave\workspace\Lucene-Solr-4.x-Windows\solr\build\solr-core\test-files\solr\collection1
[junit4] 2> 160788 T726 oasc.SolrResourceLoader.<init> new SolrResourceLoader for directory: 'C:\Users\JenkinsSlave\workspace\Lucene-Solr-4.x-Windows\solr\build\solr-core\test-files\solr\collection1\'
[junit4] 2> 160788 T726 oasc.SolrResourceLoader.replaceClassLoader Adding 'file:/C:/Users/JenkinsSlave/workspace/Lucene-Solr-4.x-Windows/solr/build/solr-core/test-files/solr/collection1/lib/classes/' to classloader
[junit4] 2> 160788 T726 oasc.SolrResourceLoader.replaceClassLoader Adding 'file:/C:/Users/JenkinsSlave/workspace/Lucene-Solr-4.x-Windows/solr/build/solr-core/test-files/solr/collection1/lib/README' to classloader
[junit4] 2> 160829 T726 oasc.SolrConfig.<init> Using Lucene MatchVersion: LUCENE_47
[junit4] 2> 160834 T726 oasc.SolrConfig.<init> Loaded SolrConfig: solrconfig-basic.xml
[junit4] 2> 160836 T726 oass.IndexSchema.readSchema Reading Solr Schema from schema-minimal.xml
[junit4] 2> 160839 T726 oass.IndexSchema.readSchema [collection1] Schema name=minimal
[junit4] 2> 160841 T726 oass.IndexSchema.readSchema WARN no uniqueKey specified in schema.
[junit4] 2> 160841 T726 oasc.SolrCore.initDirectoryFactory solr.StandardDirectoryFactory
[junit4] 2> 160869 T726 oasc.SolrCore.<init> [collection1] Opening new SolrCore at C:\Users\JenkinsSlave\workspace\Lucene-Solr-4.x-Windows\solr\build\solr-core\test-files\solr\collection1\, dataDir=C:\Users\JenkinsSlave\workspace\Lucene-Solr-4.x-Windows\solr\build\solr-core\test\J0\.\solrtest-TestNonNRTOpen-1387174383852\
[junit4] 2> 160869 T726 oasc.SolrCore.<init> JMX monitoring not detected for core: collection1
[junit4] 2> 160870 T726 oasc.CachingDirectoryFactory.get return new directory for C:\Users\JenkinsSlave\workspace\Lucene-Solr-4.x-Windows\solr\build\solr-core\test\J0\solrtest-TestNonNRTOpen-1387174383852
[junit4] 2> 160870 T726 oasc.SolrCore.getNewIndexDir New index directory detected: old=null new=C:\Users\JenkinsSlave\workspace\Lucene-Solr-4.x-Windows\solr\build\solr-core\test\J0\.\solrtest-TestNonNRTOpen-1387174383852\index/
[junit4] 2> 160871 T726 oasc.SolrCore.initIndex WARN [collection1] Solr index directory 'C:\Users\JenkinsSlave\workspace\Lucene-Solr-4.x-Windows\solr\build\solr-core\test\J0\.\solrtest-TestNonNRTOpen-1387174383852\index' doesn't exist. Creating new index...
[junit4] 2> 160871 T726 oasc.CachingDirectoryFactory.get return new directory for C:\Users\JenkinsSlave\workspace\Lucene-Solr-4.x-Windows\solr\build\solr-core\test\J0\solrtest-TestNonNRTOpen-1387174383852\index
[junit4] 2> 160876 T726 oasc.SolrDeletionPolicy.onCommit SolrDeletionPolicy.onCommit: commits: num=1
[junit4] 2> commit{dir=C:\Users\JenkinsSlave\workspace\Lucene-Solr-4.x-Windows\solr\build\solr-core\test\J0\solrtest-TestNonNRTOpen-1387174383852\index,segFN=segments_1,generation=1}
[junit4] 2> 160876 T726 oasc.SolrDeletionPolicy.updateCommits newest commit generation = 1
[junit4] 2> 160877 T726 oasc.SolrCore.loadUpdateProcessorChains no updateRequestProcessorChain defined as default, creating implicit default
[junit4] 2> 160878 T726 oasc.RequestHandlers.initHandlersFromConfig created standard: solr.StandardRequestHandler
[junit4] 2> 160879 T726 oasc.RequestHandlers.initHandlersFromConfig created /update: solr.UpdateRequestHandler
[junit4] 2> 160883 T726 oashl.XMLLoader.init xsltCacheLifetimeSeconds=60
[junit4] 2> 160885 T726 oasu.CommitTracker.<init> Hard AutoCommit: disabled
[junit4] 2> 160885 T726 oasu.CommitTracker.<init> Soft AutoCommit: disabled
[junit4] 2> 160886 T726 oass.SolrIndexSearcher.<init> Opening Searcher@4c7c865a main
[junit4] 2> 160886 T726 oasc.CoreContainer.registerCore registering core: collection1
[junit4] 2> 160888 T725 oas.SolrTestCaseJ4.initCore ####initCore end
[junit4] 2> 160890 T727 oasc.SolrCore.registerSearcher [collection1] Registered new searcher Searcher@4c7c865a main{StandardDirectoryReader(segments_1:1)}
[junit4] 2> ASYNC NEW_CORE C24 name=collection1 org.apache.solr.core.SolrCore@2da8a5e4
[junit4] 2> 160892 T725 C24 oasc.SolrDeletionPolicy.onInit SolrDeletionPolicy.onInit: commits: num=1
[junit4] 2> commit{dir=C:\Users\JenkinsSlave\workspace\Lucene-Solr-4.x-Windows\solr\build\solr-core\test\J0\solrtest-TestNonNRTOpen-1387174383852\index,segFN=segments_1,generation=1}
[junit4] 2> 160893 T725 C24 oasc.SolrDeletionPolicy.updateCommits newest commit generation = 1
[junit4] 2> 160896 T725 C24 oasup.LogUpdateProcessor.finish [collection1] webapp=null path=null params={} {add=[(null)]} 0 8
[junit4] 2> 160898 T725 C24 oasu.DirectUpdateHandler2.commit start commit{,optimize=false,openSearcher=true,waitSearcher=true,expungeDeletes=false,softCommit=false,prepareCommit=false}
[junit4] 2> 160916 T725 C24 oasc.SolrDeletionPolicy.onCommit SolrDeletionPolicy.onCommit: commits: num=2
[junit4] 2> commit{dir=C:\Users\JenkinsSlave\workspace\Lucene-Solr-4.x-Windows\solr\build\solr-core\test\J0\solrtest-TestNonNRTOpen-1387174383852\index,segFN=segments_1,generation=1}
[junit4] 2> commit{dir=C:\Users\JenkinsSlave\workspace\Lucene-Solr-4.x-Windows\solr\build\solr-core\test\J0\solrtest-TestNonNRTOpen-1387174383852\index,segFN=segments_2,generation=2}
[junit4] 2> 160916 T725 C24 oasc.SolrDeletionPolicy.updateCommits newest commit generation = 2
[junit4] 2> 160930 T725 C24 oass.SolrIndexSearcher.<init> Opening Searcher@64ac5240 main
[junit4] 2> 160931 T725 C24 oasu.DirectUpdateHandler2.commit end_commit_flush
[junit4] 2> 160932 T727 oasc.SolrCore.registerSearcher [collection1] Registered new searcher Searcher@64ac5240 main{StandardDirectoryReader(segments_2:3 _0(4.7):C1)}
[junit4] 2> 160932 T725 C24 oasup.LogUpdateProcessor.finish [collection1] webapp=null path=null params={} {commit=} 0 35
[junit4] 2> 160932 T725 oas.SolrTestCaseJ4.deleteCore ###deleteCore
[junit4] 2> 160932 T725 oasc.CoreContainer.shutdown Shutting down CoreContainer instance=1444753258
[junit4] 2> 160933 T725 oasc.SolrCore.close [collection1] CLOSING SolrCore org.apache.solr.core.SolrCore@2da8a5e4
[junit4] 2> 160933 T725 oasu.DirectUpdateHandler2.close closing DirectUpdateHandler2{commits=1,autocommits=0,soft autocommits=0,optimizes=0,rollbacks=0,expungeDeletes=0,docsPending=0,adds=0,deletesById=0,deletesByQuery=0,errors=0,cumulative_adds=1,cumulative_deletesById=0,cumulative_deletesByQuery=0,cumulative_errors=0}
[junit4] 2> 160933 T725 oasu.SolrCoreState.decrefSolrCoreState Closing SolrCoreState
[junit4] 2> 160933 T725 oasu.DefaultSolrCoreState.closeIndexWriter SolrCoreState ref count has reached 0 - closing IndexWriter
[junit4] 2> 160933 T725 oasu.DefaultSolrCoreState.closeIndexWriter closing IndexWriter with IndexWriterCloser
[junit4] 2> 160936 T725 oasc.SolrCore.closeSearcher [collection1] Closing main searcher on request.
[junit4] 2> 160937 T725 oasc.CachingDirectoryFactory.close Closing StandardDirectoryFactory - 2 directories currently being tracked
[junit4] 2> 160938 T725 oasc.CachingDirectoryFactory.closeCacheValue looking to close C:\Users\JenkinsSlave\workspace\Lucene-Solr-4.x-Windows\solr\build\solr-core\test\J0\solrtest-TestNonNRTOpen-1387174383852 [CachedDir<<refCount=0;path=C:\Users\JenkinsSlave\workspace\Lucene-Solr-4.x-Windows\solr\build\solr-core\test\J0\solrtest-TestNonNRTOpen-1387174383852;done=false>>]
[junit4] 2> 160938 T725 oasc.CachingDirectoryFactory.close Closing directory: C:\Users\JenkinsSlave\workspace\Lucene-Solr-4.x-Windows\solr\build\solr-core\test\J0\solrtest-TestNonNRTOpen-1387174383852
[junit4] 2> 160938 T725 oasc.CachingDirectoryFactory.closeCacheValue looking to close C:\Users\JenkinsSlave\workspace\Lucene-Solr-4.x-Windows\solr\build\solr-core\test\J0\solrtest-TestNonNRTOpen-1387174383852\index [CachedDir<<refCount=0;path=C:\Users\JenkinsSlave\workspace\Lucene-Solr-4.x-Windows\solr\build\solr-core\test\J0\solrtest-TestNonNRTOpen-1387174383852\index;done=false>>]
[junit4] 2> 160938 T725 oasc.CachingDirectoryFactory.close Closing directory: C:\Users\JenkinsSlave\workspace\Lucene-Solr-4.x-Windows\solr\build\solr-core\test\J0\solrtest-TestNonNRTOpen-1387174383852\index
[junit4] 2> NOTE: per solr.test.leavedatadir, dataDir will not be removed: C:\Users\JenkinsSlave\workspace\Lucene-Solr-4.x-Windows\solr\build\solr-core\test\J0\.\solrtest-TestNonNRTOpen-1387174383852
[junit4] 2> 160940 T725 oas.SolrTestCaseJ4.initCore ####initCore
[junit4] 2> 160940 T725 oasc.SolrResourceLoader.<init> new SolrResourceLoader for directory: 'C:\Users\JenkinsSlave\workspace\Lucene-Solr-4.x-Windows\solr\build\solr-core\test-files\solr\collection1\'
[junit4] 2> 160941 T725 oasc.SolrResourceLoader.replaceClassLoader Adding 'file:/C:/Users/JenkinsSlave/workspace/Lucene-Solr-4.x-Windows/solr/build/solr-core/test-files/solr/collection1/lib/classes/' to classloader
[junit4] 2> 160943 T725 oasc.SolrResourceLoader.replaceClassLoader Adding 'file:/C:/Users/JenkinsSlave/workspace/Lucene-Solr-4.x-Windows/solr/build/solr-core/test-files/solr/collection1/lib/README' to classloader
[junit4] 2> 160993 T725 oasc.SolrConfig.<init> Using Lucene MatchVersion: LUCENE_47
[junit4] 2> 161000 T725 oasc.SolrConfig.<init> Loaded SolrConfig: solrconfig-basic.xml
[junit4] 2> 161000 T725 oass.IndexSchema.readSchema Reading Solr Schema from schema-minimal.xml
[junit4] 2> 161004 T725 oass.IndexSchema.readSchema [null] Schema name=minimal
[junit4] 2> 161009 T725 oass.IndexSchema.readSchema WARN no uniqueKey specified in schema.
[junit4] 2> 161010 T725 oasc.SolrResourceLoader.locateSolrHome JNDI not configured for solr (NoInitialContextEx)
[junit4] 2> 161010 T725 oasc.SolrResourceLoader.locateSolrHome using system property solr.solr.home: C:\Users\JenkinsSlave\workspace\Lucene-Solr-4.x-Windows\solr\build\solr-core\test-files\solr
[junit4] 2> 161010 T725 oasc.SolrResourceLoader.<init> new SolrResourceLoader for directory: 'C:\Users\JenkinsSlave\workspace\Lucene-Solr-4.x-Windows\solr\build\solr-core\test-files\solr\'
[junit4] 2> 161025 T725 oasc.SolrResourceLoader.locateSolrHome JNDI not configured for solr (NoInitialContextEx)
[junit4] 2> 161025 T725 oasc.SolrResourceLoader.locateSolrHome using system property solr.solr.home: C:\Users\JenkinsSlave\workspace\Lucene-Solr-4.x-Windows\solr\build\solr-core\test-files\solr
[junit4] 2> 161025 T725 oasc.SolrResourceLoader.<init> new SolrResourceLoader for deduced Solr Home: 'C:\Users\JenkinsSlave\workspace\Lucene-Solr-4.x-Windows\solr\build\solr-core\test-files\solr\'
[junit4] 2> 161060 T725 oasc.CoreContainer.<init> New CoreContainer 1481814921
[junit4] 2> 161060 T725 oasc.CoreContainer.load Loading cores into CoreContainer [instanceDir=C:\Users\JenkinsSlave\workspace\Lucene-Solr-4.x-Windows\solr\build\solr-core\test-files\solr\]
[junit4] 2> 161062 T725 oashc.HttpShardHandlerFactory.getParameter Setting socketTimeout to: 0
[junit4] 2> 161062 T725 oashc.HttpShardHandlerFactory.getParameter Setting urlScheme to: http://
[junit4] 2> 161062 T725 oashc.HttpShardHandlerFactory.getParameter Setting connTimeout to: 0
[junit4] 2> 161062 T725 oashc.HttpShardHandlerFactory.getParameter Setting maxConnectionsPerHost to: 20
[junit4] 2> 161062 T725 oashc.HttpShardHandlerFactory.getParameter Setting corePoolSize to: 0
[junit4] 2> 161062 T725 oashc.HttpShardHandlerFactory.getParameter Setting maximumPoolSize to: 2147483647
[junit4] 2> 161062 T725 oashc.HttpShardHandlerFactory.getParameter Setting maxThreadIdleTime to: 5
[junit4] 2> 161062 T725 oashc.HttpShardHandlerFactory.getParameter Setting sizeOfQueue to: -1
[junit4] 2> 161062 T725 oashc.HttpShardHandlerFactory.getParameter Setting fairnessPolicy to: false
[junit4] 2> 161072 T725 oasl.LogWatcher.createWatcher SLF4J impl is org.slf4j.impl.Log4jLoggerFactory
[junit4] 2> 161073 T725 oasl.LogWatcher.newRegisteredLogWatcher Registering Log Listener [Log4j (org.slf4j.impl.Log4jLoggerFactory)]
[junit4] 2> 161073 T725 oasc.CoreContainer.load Host Name:
[junit4] 2> 161076 T729 oasc.CoreContainer.create Creating SolrCore 'collection1' using instanceDir: C:\Users\JenkinsSlave\workspace\Lucene-Solr-4.x-Windows\solr\build\solr-core\test-files\solr\collection1
[junit4] 2> 161077 T729 oasc.SolrResourceLoader.<init> new SolrResourceLoader for directory: 'C:\Users\JenkinsSlave\workspace\Lucene-Solr-4.x-Windows\solr\build\solr-core\test-files\solr\collection1\'
[junit4] 2> 161077 T729 oasc.SolrResourceLoader.replaceClassLoader Adding 'file:/C:/Users/JenkinsSlave/workspace/Lucene-Solr-4.x-Windows/solr/build/solr-core/test-files/solr/collection1/lib/classes/' to classloader
[junit4] 2> 161077 T729 oasc.SolrResourceLoader.replaceClassLoader Adding 'file:/C:/Users/JenkinsSlave/workspace/Lucene-Solr-4.x-Windows/solr/build/solr-core/test-files/solr/collection1/lib/README' to classloader
[junit4] 2> 161111 T729 oasc.SolrConfig.<init> Using Lucene MatchVersion: LUCENE_47
[junit4] 2> 161118 T729 oasc.SolrConfig.<init> Loaded SolrConfig: solrconfig-basic.xml
[junit4] 2> 161118 T729 oass.IndexSchema.readSchema Reading Solr Schema from schema-minimal.xml
[junit4] 2> 161121 T729 oass.IndexSchema.readSchema [collection1] Schema name=minimal
[junit4] 2> 161123 T729 oass.IndexSchema.readSchema WARN no uniqueKey specified in schema.
[junit4] 2> 161123 T729 oasc.SolrCore.initDirectoryFactory solr.StandardDirectoryFactory
[junit4] 2> 161124 T729 oasc.SolrCore.<init> [collection1] Opening new SolrCore at C:\Users\JenkinsSlave\workspace\Lucene-Solr-4.x-Windows\solr\build\solr-core\test-files\solr\collection1\, dataDir=C:\Users\JenkinsSlave\workspace\Lucene-Solr-4.x-Windows\solr\build\solr-core\test\J0\.\solrtest-TestNonNRTOpen-1387174383852\
[junit4] 2> 161124 T729 oasc.SolrCore.<init> JMX monitoring not detected for core: collection1
[junit4] 2> 161124 T729 oasc.CachingDirectoryFactory.get return new directory for C:\Users\JenkinsSlave\workspace\Lucene-Solr-4.x-Windows\solr\build\solr-core\test\J0\solrtest-TestNonNRTOpen-1387174383852
[junit4] 2> 161124 T729 oasc.SolrCore.getNewIndexDir New index directory detected: old=null new=C:\Users\JenkinsSlave\workspace\Lucene-Solr-4.x-Windows\solr\build\solr-core\test\J0\.\solrtest-TestNonNRTOpen-1387174383852\index/
[junit4] 2> 161126 T729 oasc.SolrCore.loadUpdateProcessorChains no updateRequestProcessorChain defined as default, creating implicit default
[junit4] 2> 161126 T729 oasc.RequestHandlers.initHandlersFromConfig created standard: solr.StandardRequestHandler
[junit4] 2> 161127 T729 oasc.RequestHandlers.initHandlersFromConfig created /update: solr.UpdateRequestHandler
[junit4] 2> 161129 T729 oashl.XMLLoader.init xsltCacheLifetimeSeconds=60
[junit4] 2> 161132 T729 oasu.CommitTracker.<init> Hard AutoCommit: disabled
[junit4] 2> 161132 T729 oasu.CommitTracker.<init> Soft AutoCommit: disabled
[junit4] 2> 161132 T729 oasc.CachingDirectoryFactory.get return new directory for C:\Users\JenkinsSlave\workspace\Lucene-Solr-4.x-Windows\solr\build\solr-core\test\J0\solrtest-TestNonNRTOpen-1387174383852\index
[junit4] 2> 161136 T729 oass.SolrIndexSearcher.<init> Opening Searcher@6e4badf1 main
[junit4] 2> 161137 T730 oasc.SolrCore.registerSearcher [collection1] Registered new searcher Searcher@6e4badf1 main{StandardDirectoryReader(segments_2:3 _0(4.7):C1)}
[junit4] 2> 161137 T729 oasc.CoreContainer.registerCore registering core: collection1
[junit4] 2> 161139 T725 oas.SolrTestCaseJ4.initCore ####initCore end
[junit4] 2> 161143 T725 oas.SolrTestCaseJ4.setUp ###Starting testSharedCores
[junit4] 2> ASYNC NEW_CORE C25 name=collection1 org.apache.solr.core.SolrCore@717baefb
[junit4] 2> 161145 T725 C25 oasu.DirectUpdateHandler2.deleteAll [collection1] REMOVING ALL DOCUMENTS FROM INDEX
[junit4] 2> 161150 T725 C25 oasc.SolrDeletionPolicy.onInit SolrDeletionPolicy.onInit: commits: num=1
[junit4] 2> commit{dir=C:\Users\JenkinsSlave\workspace\Lucene-Solr-4.x-Windows\solr\build\solr-core\test\J0\solrtest-TestNonNRTOpen-1387174383852\index,segFN=segments_2,generation=2}
[junit4] 2> 161150 T725 C25 oasc.SolrDeletionPolicy.updateCommits newest commit generation = 2
[junit4] 2> 161151 T725 C25 oasup.LogUpdateProcessor.finish [collection1] webapp=null path=null params={} {deleteByQuery=*:*} 0 7
[junit4] 2> 161153 T725 C25 oasup.LogUpdateProcessor.finish [collection1] webapp=null path=null params={} {add=[(null)]} 0 0
[junit4] 2> 161157 T725 C25 oasu.DirectUpdateHandler2.commit start commit{,optimize=false,openSearcher=true,waitSearcher=true,expungeDeletes=false,softCommit=false,prepareCommit=false}
[junit4] 2> 161169 T725 C25 oasc.SolrDeletionPolicy.onCommit SolrDeletionPolicy.onCommit: commits: num=2
[junit4] 2> commit{dir=C:\Users\JenkinsSlave\workspace\Lucene-Solr-4.x-Windows\solr\build\solr-core\test\J0\solrtest-TestNonNRTOpen-1387174383852\index,segFN=segments_2,generation=2}
[junit4] 2> commit{dir=C:\Users\JenkinsSlave\workspace\Lucene-Solr-4.x-Windows\solr\build\solr-core\test\J0\solrtest-TestNonNRTOpen-1387174383852\index,segFN=segments_3,generation=3}
[junit4] 2> 161169 T725 C25 oasc.SolrDeletionPolicy.updateCommits newest commit generation = 3
[junit4] 2> 161185 T725 C25 oass.SolrIndexSearcher.<init> Opening Searcher@6831365a main
[junit4] 2> 161185 T725 C25 oasu.DirectUpdateHandler2.commit end_commit_flush
[junit4] 2> 161186 T730 oasc.SolrCore.registerSearcher [collection1] Registered new searcher Searcher@6831365a main{StandardDirectoryReader(segments_3:6 _1(4.7):C1)}
[junit4] 2> 161187 T725 C25 oasup.LogUpdateProcessor.finish [collection1] webapp=null path=null params={} {commit=} 0 30
[junit4] 2> 161189 T725 C25 oasu.DirectUpdateHandler2.commit start commit{,optimize=true,openSearcher=true,waitSearcher=true,expungeDeletes=false,softCommit=false,prepareCommit=false}
[junit4] 2> 161245 T725 C25 oasc.SolrDeletionPolicy.onCommit SolrDeletionPolicy.onCommit: commits: num=2
[junit4] 2> commit{dir=C:\Users\JenkinsSlave\workspace\Lucene-Solr-4.x-Windows\solr\build\solr-core\test\J0\solrtest-TestNonNRTOpen-1387174383852\index,segFN=segments_3,generation=3}
[junit4] 2> commit{dir=C:\Users\JenkinsSlave\workspace\Lucene-Solr-4.x-Windows\solr\build\solr-core\test\J0\solrtest-TestNonNRTOpen-1387174383852\index,segFN=segments_4,generation=4}
[junit4] 2> 161245 T725 C25 oasc.SolrDeletionPolicy.updateCommits newest commit generation = 4
[junit4] 2> 161263 T725 C25 oass.SolrIndexSearcher.<init> Opening Searcher@7e9447b2 main
[junit4] 2> 161263 T725 C25 oasu.DirectUpdateHandler2.commit end_commit_flush
[junit4] 2> 161264 T730 oasc.SolrCore.registerSearcher [collection1] Registered new searcher Searcher@7e9447b2 main{StandardDirectoryReader(segments_4:8 _2(4.7):C1)}
[junit4] 2> 161266 T725 C25 oasup.LogUpdateProcessor.finish [collection1] webapp=null path=null params={} {optimize=} 0 78
[junit4] 2> 161268 T725 C25 oasup.LogUpdateProcessor.finish [collection1] webapp=null path=null params={} {add=[(null)]} 0 1
[junit4] 2> 161270 T725 C25 oasu.DirectUpdateHandler2.commit start commit{,optimize=false,openSearcher=true,waitSearcher=true,expungeDeletes=false,softCommit=false,prepareCommit=false}
[junit4] 2> 161291 T725 C25 oasc.SolrDeletionPolicy.onCommit SolrDeletionPolicy.onCommit: commits: num=2
[junit4] 2> commit{dir=C:\Users\JenkinsSlave\workspace\Lucene-Solr-4.x-Windows\solr\build\solr-core\test\J0\solrtest-TestNonNRTOpen-1387174383852\index,segFN=segments_4,generation=4}
[junit4] 2> commit{dir=C:\Users\JenkinsSlave\workspace\Lucene-Solr-4.x-Windows\solr\build\solr-core\test\J0\solrtest-TestNonNRTOpen-1387174383852\index,segFN=segments_5,generation=5}
[junit4] 2> 161291 T725 C25 oasc.SolrDeletionPolicy.updateCommits newest commit generation = 5
[junit4] 2> 161301 T725 C25 oass.SolrIndexSearcher.<init> Opening Searcher@600cf4a4 main
[junit4] 2> 161301 T725 C25 oasu.DirectUpdateHandler2.commit end_commit_flush
[junit4] 2> 161301 T730 oasc.SolrCore.registerSearcher [collection1] Registered new searcher Searcher@600cf4a4 main{StandardDirectoryReader(segments_5:10 _2(4.7):C1 _3(4.7):C1)}
[junit4] 2> 161302 T725 C25 oasup.LogUpdateProcessor.finish [collection1] webapp=null path=null params={} {commit=} 0 32
[junit4] 2> 161305 T725 C25 oasup.LogUpdateProcessor.finish [collection1] webapp=null path=null params={} {add=[(null)]} 0 1
[junit4] 2> 161308 T725 C25 oasup.LogUpdateProcessor.finish [collection1] webapp=null path=null params={} {add=[(null)]} 0 2
[junit4] 2> 161309 T725 C25 oasu.DirectUpdateHandler2.commit start commit{,optimize=false,openSearcher=true,waitSearcher=true,expungeDeletes=false,softCommit=false,prepareCommit=false}
[junit4] 2> 161322 T725 C25 oasc.SolrDeletionPolicy.onCommit SolrDeletionPolicy.onCommit: commits: num=2
[junit4] 2> commit{dir=C:\Users\JenkinsSlave\workspace\Lucene-Solr-4.x-Windows\solr\build\solr-core\test\J0\solrtest-TestNonNRTOpen-1387174383852\index,segFN=segments_5,generation=5}
[junit4] 2> commit{dir=C:\Users\JenkinsSlave\workspace\Lucene-Solr-4.x-Windows\solr\build\solr-core\test\J0\solrtest-TestNonNRTOpen-1387174383852\index,segFN=segments_6,generation=6}
[junit4] 2> 161322 T725 C25 oasc.SolrDeletionPolicy.updateCommits newest commit generation = 6
[junit4] 2> 161333 T725 C25 oass.SolrIndexSearcher.<init> Opening Searcher@7473e79c main
[junit4] 2> 161333 T725 C25 oasu.DirectUpdateHandler2.commit end_commit_flush
[junit4] 2> 161333 T730 oasc.SolrCore.registerSearcher [collection1] Registered new searcher Searcher@7473e79c main{StandardDirectoryReader(segments_6:12 _2(4.7):C1 _3(4.7):C1 _4(4.7):C2)}
[junit4] 2> 161334 T725 C25 oasup.LogUpdateProcessor.finish [collection1] webapp=null path=null params={} {commit=} 0 26
[junit4] 2> 161336 T725 C25 oasup.LogUpdateProcessor.finish [collection1] webapp=null path=null params={} {deleteByQuery=foo2:doc} 0 2
[junit4] 2> 161337 T725 C25 oasu.DirectUpdateHandler2.commit start commit{,optimize=false,openSearcher=true,waitSearcher=true,expungeDeletes=false,softCommit=false,prepareCommit=false}
[junit4] 2> 161352 T725 C25 oasc.SolrDeletionPolicy.onCommit SolrDeletionPolicy.onCommit: commits: num=2
[junit4] 2> commit{dir=C:\Users\JenkinsSlave\workspace\Lucene-Solr-4.x-Windows\solr\build\solr-core\test\J0\solrtest-TestNonNRTOpen-1387174383852\index,segFN=segments_6,generation=6}
[junit4] 2> commit{dir=C:\Users\JenkinsSlave\workspace\Lucene-Solr-4.x-Windows\solr\build\solr-core\test\J0\solrtest-TestNonNRTOpen-1387174383852\index,segFN=segments_7,generation=7}
[junit4] 2> 161352 T725 C25 oasc.SolrDeletionPolicy.updateCommits newest commit generation = 7
[junit4] 2> 161366 T725 C25 oass.SolrIndexSearcher.<init> Opening Searcher@2e9ef606 main
[junit4] 2> 161366 T725 C25 oasu.DirectUpdateHandler2.commit end_commit_flush
[junit4] 2> 161367 T730 oasc.SolrCore.registerSearcher [collection1] Registered new searcher Searcher@2e9ef606 main{StandardDirectoryReader(segments_7:13 _2(4.7):C1 _3(4.7):C1 _4(4.7):C2/1:delGen=1)}
[junit4] 2> 161367 T725 C25 oasup.LogUpdateProcessor.finish [collection1] webapp=null path=null params={} {commit=} 0 31
[junit4] 2> 161368 T725 oas.SolrTestCaseJ4.tearDown ###Ending testSharedCores
[junit4] 2> 161372 T725 oas.SolrTestCaseJ4.setUp ###Starting testReaderIsNotNRT
[junit4] 2> 161373 T725 C25 oasu.DirectUpdateHandler2.deleteAll [collection1] REMOVING ALL DOCUMENTS FROM INDEX
[junit4] 2> 161374 T725 C25 oasup.LogUpdateProcessor.finish [collection1] webapp=null path=null params={} {deleteByQuery=*:*} 0 2
[junit4] 2> 161375 T725 C25 oasup.LogUpdateProcessor.finish [collection1] webapp=null path=null params={} {add=[(null)]} 0 0
[junit4] 2> 161379 T725 C25 oasu.DirectUpdateHandler2.commit start commit{,optimize=false,openSearcher=true,waitSearcher=true,expungeDeletes=false,softCommit=false,prepareCommit=false}
[junit4] 2> 161389 T725 C25 oasc.SolrDeletionPolicy.onCommit SolrDeletionPolicy.onCommit: commits: num=2
[junit4] 2> commit{dir=C:\Users\JenkinsSlave\workspace\Lucene-Solr-4.x-Windows\solr\build\solr-core\test\J0\solrtest-TestNonNRTOpen-1387174383852\index,segFN=segments_7,generation=7}
[junit4] 2> commit{dir=C:\Users\JenkinsSlave\workspace\Lucene-Solr-4.x-Windows\solr\build\solr-core\test\J0\solrtest-TestNonNRTOpen-1387174383852\index,segFN=segments_8,generation=8}
[junit4] 2> 161389 T725 C25 oasc.SolrDeletionPolicy.updateCommits newest commit generation = 8
[junit4] 2> 161414 T725 C25 oass.SolrIndexSearcher.<init> Opening Searcher@707abbbd main
[junit4] 2> 161414 T725 C25 oasu.DirectUpdateHandler2.commit end_commit_flush
[junit4] 2> 161414 T730 oasc.SolrCore.registerSearcher [collection1] Registered new searcher Searcher@707abbbd main{StandardDirectoryReader(segments_8:16 _5(4.7):C1)}
[junit4] 2> 161417 T725 C25 oasup.LogUpdateProcessor.finish [collection1] webapp=null path=null params={} {commit=} 0 38
[junit4] 2> 161419 T725 oasc.CoreContainer.reload Reloading SolrCore 'collection1' using instanceDir: C:\Users\JenkinsSlave\workspace\Lucene-Solr-4.x-Windows\solr\build\solr-core\test-files\solr\collection1
[junit4] 2> 161419 T725 oasc.SolrResourceLoader.<init> new SolrResourceLoader for directory: 'C:\Users\JenkinsSlave\workspace\Lucene-Solr-4.x-Windows\solr\build\solr-core\test-files\solr\collection1\'
[junit4] 2> 161421 T725 oasc.SolrResourceLoader.replaceClassLoader Adding 'file:/C:/Users/JenkinsSlave/workspace/Lucene-Solr-4.x-Windows/solr/build/solr-core/test-files/solr/collection1/lib/classes/' to classloader
[junit4] 2> 161422 T725 oasc.SolrResourceLoader.replaceClassLoader Adding 'file:/C:/Users/JenkinsSlave/workspace/Lucene-Solr-4.x-Windows/solr/build/solr-core/test-files/solr/collection1/lib/README' to classloader
[junit4] 2> 161507 T725 oasc.SolrConfig.<init> Using Lucene MatchVersion: LUCENE_47
[junit4] 2> 161513 T725 oasc.SolrConfig.<init> Loaded SolrConfig: solrconfig-basic.xml
[junit4] 2> 161514 T725 oass.IndexSchema.readSchema Reading Solr Schema from schema-minimal.xml
[junit4] 2> 161517 T725 oass.IndexSchema.readSchema [collection1] Schema name=minimal
[junit4] 2> 161521 T725 oass.IndexSchema.readSchema WARN no uniqueKey specified in schema.
[junit4] 2> 161523 T725 oasc.SolrCore.<init> [collection1] Opening new SolrCore at C:\Users\JenkinsSlave\workspace\Lucene-Solr-4.x-Windows\solr\build\solr-core\test-files\solr\collection1\, dataDir=C:\Users\JenkinsSlave\workspace\Lucene-Solr-4.x-Windows\solr\build\solr-core\test\J0\.\solrtest-TestNonNRTOpen-1387174383852\
[junit4] 2> 161523 T725 oasc.SolrCore.<init> JMX monitoring not detected for core: collection1
[junit4] 2> 161523 T725 oasc.SolrCore.getNewIndexDir New index directory detected: old=null new=C:\Users\JenkinsSlave\workspace\Lucene-Solr-4.x-Windows\solr\build\solr-core\test\J0\.\solrtest-TestNonNRTOpen-1387174383852\index/
[junit4] 2> 161524 T725 oasc.SolrCore.loadUpdateProcessorChains no updateRequestProcessorChain defined as default, creating implicit default
[junit4] 2> 161524 T725 oasc.RequestHandlers.initHandlersFromConfig created standard: solr.StandardRequestHandler
[junit4] 2> 161525 T725 oasc.RequestHandlers.initHandlersFromConfig created /update: solr.UpdateRequestHandler
[junit4] 2> 161529 T725 oashl.XMLLoader.init xsltCacheLifetimeSeconds=60
[junit4] 2> 161533 T725 oasu.CommitTracker.<init> Hard AutoCommit: disabled
[junit4] 2> 161533 T725 oasu.CommitTracker.<init> Soft AutoCommit: disabled
[junit4] 2> 161537 T725 oass.SolrIndexSearcher.<init> Opening Searcher@6a9dc347 main
[junit4] 2> 161537 T725 oasu.DefaultSolrCoreState.newIndexWriter Creating new IndexWriter...
[junit4] 2> 161538 T725 oasu.DefaultSolrCoreState.newIndexWriter Waiting until IndexWriter is unused... core=collection1
[junit4] 2> 161538 T725 oasu.DefaultSolrCoreState.newIndexWriter Closing old IndexWriter... core=collection1
[junit4] 2> 161554 T725 oasc.SolrDeletionPolicy.onInit SolrDeletionPolicy.onInit: commits: num=1
[junit4] 2> commit{dir=C:\Users\JenkinsSlave\workspace\Lucene-Solr-4.x-Windows\solr\build\solr-core\test\J0\solrtest-TestNonNRTOpen-1387174383852\index,segFN=segments_8,generation=8}
[junit4] 2> 161554 T725 oasc.SolrDeletionPolicy.updateCommits newest commit generation = 8
[junit4] 2> 161554 T725 oasu.DefaultSolrCoreState.newIndexWriter New IndexWriter is ready to be used.
[junit4] 2> 161554 T725 oasc.SolrCore.getSearcher WARN [collection1] PERFORMANCE WARNING: Overlapping onDeckSearchers=2
[junit4] 2> 161556 T725 oass.SolrIndexSearcher.<init> Opening Searcher@180724aa main
[junit4] 2> 161557 T733 oasc.SolrCore.registerSearcher [collection1] Registered new searcher Searcher@6a9dc347 main{StandardDirectoryReader(segments_8:16 _5(4.7):C1)}
[junit4] 2> 161557 T733 oasc.SolrCore.registerSearcher [collection1] Registered new searcher Searcher@180724aa main{StandardDirectoryReader(segments_8:16 _5(4.7):C1)}
[junit4] 2> 161558 T725 oasc.CoreContainer.registerCore replacing core: collection1
[junit4] 2> 161558 T725 oasc.SolrCore.close [collection1] CLOSING SolrCore org.apache.solr.core.SolrCore@717baefb
[junit4] 2> 161558 T725 oasu.DirectUpdateHandler2.close closing DirectUpdateHandler2{commits=5,autocommits=0,soft autocommits=0,optimizes=1,rollbacks=0,expungeDeletes=0,docsPending=0,adds=0,deletesById=0,deletesByQuery=0,errors=0,cumulative_adds=5,cumulative_deletesById=0,cumulative_deletesByQuery=3,cumulative_errors=0}
[junit4] 2> 161559 T725 oasc.SolrCore.closeSearcher [collection1] Closing main searcher on request.
[junit4] 2> ASYNC NEW_CORE C26 name=collection1 org.apache.solr.core.SolrCore@49298727
[junit4] 2> 161561 T725 C26 oasup.LogUpdateProcessor.finish [collection1] webapp=null path=null params={} {add=[(null)]} 0 1
[junit4] 2> 161563 T725 C26 oasu.DirectUpdateHandler2.commit start commit{,optimize=false,openSearcher=true,waitSearcher=true,expungeDeletes=false,softCommit=false,prepareCommit=false}
[junit4] 2> 161575 T725 C26 oasc.SolrDeletionPolicy.onCommit SolrDeletionPolicy.onCommit: commits: num=2
[junit4] 2> commit{dir=C:\Users\JenkinsSlave\workspace\Lucene-Solr-4.x-Windows\solr\build\solr-core\test\J0\solrtest-TestNonNRTOpen-1387174383852\index,segFN=segments_8,generation=8}
[junit4] 2> commit{dir=C:\Users\JenkinsSlave\workspace\Lucene-Solr-4.x-Windows\solr\build\solr-core\test\J0\solrtest-TestNonNRTOpen-1387174383852\index,segFN=segments_9,generation=9}
[junit4] 2> 161575 T725 C26 oasc.SolrDeletionPolicy.updateCommits newest commit generation = 9
[junit4] 2> 161586 T725 C26 oass.SolrIndexSearcher.<init> Opening Searcher@1be814c4 main
[junit4] 2> 161586 T725 C26 oasu.DirectUpdateHandler2.commit end_commit_flush
[junit4] 2> 161588 T733 oasc.SolrCore.registerSearcher [collection1] Registered new searcher Searcher@1be814c4 main{StandardDirectoryReader(segments_9:18 _5(4.7):C1 _6(4.7):C1)}
[junit4] 2> 161588 T725 C26 oasup.LogUpdateProcessor.finish [collection1] webapp=null path=null params={} {commit=} 0 27
[junit4] 2> 161589 T725 C26 oasup.LogUpdateProcessor.finish [collection1] webapp=null path=null params={} {add=[(null)]} 0 0
[junit4] 2> 161591 T725 oasc.CoreContainer.reload Reloading SolrCore 'collection1' using instanceDir: C:\Users\JenkinsSlave\workspace\Lucene-Solr-4.x-Windows\solr\build\solr-core\test-files\solr\collection1
[junit4] 2> 161591 T725 oasc.SolrResourceLoader.<init> new SolrResourceLoader for directory: 'C:\Users\JenkinsSlave\workspace\Lucene-Solr-4.x-Windows\solr\build\solr-core\test-files\solr\collection1\'
[junit4] 2> 161594 T725 oasc.SolrResourceLoader.replaceClassLoader Adding 'file:/C:/Users/JenkinsSlave/workspace/Lucene-Solr-4.x-Windows/solr/build/solr-core/test-files/solr/collection1/lib/classes/' to classloader
[junit4] 2> 161596 T725 oasc.SolrResourceLoader.replaceClassLoader Adding 'file:/C:/Users/JenkinsSlave/workspace/Lucene-Solr-4.x-Windows/solr/build/solr-core/test-files/solr/collection1/lib/README' to classloader
[junit4] 2> 161643 T725 oasc.SolrConfig.<init> Using Lucene MatchVersion: LUCENE_47
[junit4] 2> 161649 T725 oasc.SolrConfig.<init> Loaded SolrConfig: solrconfig-basic.xml
[junit4] 2> 161651 T725 oass.IndexSchema.readSchema Reading Solr Schema from schema-minimal.xml
[junit4] 2> 161654 T725 oass.IndexSchema.readSchema [collection1] Schema name=minimal
[junit4] 2> 161660 T725 oass.IndexSchema.readSchema WARN no uniqueKey specified in schema.
[junit4] 2> 161660 T725 oasc.SolrCore.<init> [collection1] Opening new SolrCore at C:\Users\JenkinsSlave\workspace\Lucene-Solr-4.x-Windows\solr\build\solr-core\test-files\solr\collection1\, dataDir=C:\Users\JenkinsSlave\workspace\Lucene-Solr-4.x-Windows\solr\build\solr-core\test\J0\.\solrtest-TestNonNRTOpen-1387174383852\
[junit4] 2> 161660 T725 oasc.SolrCore.<init> JMX monitoring not detected for core: collection1
[junit4] 2> 161660 T725 oasc.SolrCore.getNewIndexDir New index directory detected: old=null new=C:\Users\JenkinsSlave\workspace\Lucene-Solr-4.x-Windows\solr\build\solr-core\test\J0\.\solrtest-TestNonNRTOpen-1387174383852\index/
[junit4] 2> 161662 T725 oasc.SolrCore.loadUpdateProcessorChains no updateRequestProcessorChain defined as default, creating implicit default
[junit4] 2> 161663 T725 oasc.RequestHandlers.initHandlersFromConfig created standard: solr.StandardRequestHandler
[junit4] 2> 161663 T725 oasc.RequestHandlers.initHandlersFromConfig created /update: solr.UpdateRequestHandler
[junit4] 2> 161669 T725 oashl.XMLLoader.init xsltCacheLifetimeSeconds=60
[junit4] 2> 161670 T725 oasu.CommitTracker.<init> Hard AutoCommit: disabled
[junit4] 2> 161670 T725 oasu.CommitTracker.<init> Soft AutoCommit: disabled
[junit4] 2> 161681 T725 oass.SolrIndexSearcher.<init> Opening Searcher@2febd8c3 main
[junit4] 2> 161681 T725 oasu.DefaultSolrCoreState.newIndexWriter Creating new IndexWriter...
[junit4] 2> 161681 T725 oasu.DefaultSolrCoreState.newIndexWriter Waiting until IndexWriter is unused... core=collection1
[junit4] 2> 161681 T725 oasu.DefaultSolrCoreState.newIndexWriter Closing old IndexWriter... core=collection1
[junit4] 2> 161691 T734 oasc.SolrCore.registerSearcher [collection1] Registered new searcher Searcher@2febd8c3 main{StandardDirectoryReader(segments_9:18 _5(4.7):C1 _6(4.7):C1)}
[junit4] 2> 161698 T725 oasc.SolrDeletionPolicy.onCommit SolrDeletionPolicy.onCommit: commits: num=2
[junit4] 2> commit{dir=C:\Users\JenkinsSlave\workspace\Lucene-Solr-4.x-Windows\solr\build\solr-core\test\J0\solrtest-TestNonNRTOpen-1387174383852\index,segFN=segments_9,generation=9}
[junit4] 2> commit{dir=C:\Users\JenkinsSlave\workspace\Lucene-Solr-4.x-Windows\solr\build\solr-core\test\J0\solrtest-TestNonNRTOpen-1387174383852\index,segFN=segments_a,generation=10}
[junit4] 2> 161698 T725 oasc.SolrDeletionPolicy.updateCommits newest commit generation = 10
[junit4] 2> 161716 T725 oasc.SolrDeletionPolicy.onInit SolrDeletionPolicy.onInit: commits: num=1
[junit4] 2> commit{dir=C:\Users\JenkinsSlave\workspace\Lucene-Solr-4.x-Windows\solr\build\solr-core\test\J0\solrtest-TestNonNRTOpen-1387174383852\index,segFN=segments_a,generation=10}
[junit4] 2> 161716 T725 oasc.SolrDeletionPolicy.updateCommits newest commit generation = 10
[junit4] 2> 161717 T725 oasu.DefaultSolrCoreState.newIndexWriter New IndexWriter is ready to be used.
[junit4] 2> 161726 T725 oass.SolrIndexSearcher.<init> Opening Searcher@29d3f985 main
[junit4] 2> 161726 T725 oasc.CoreContainer.registerCore replacing core: collection1
[junit4] 2> 161726 T725 oasc.SolrCore.close [collection1] CLOSING SolrCore org.apache.solr.core.SolrCore@49298727
[junit4] 2> 161726 T725 oasu.DirectUpdateHandler2.close closing DirectUpdateHandler2{commits=1,autocommits=0,soft autocommits=0,optimizes=0,rollbacks=0,expungeDeletes=0,docsPending=1,adds=1,deletesById=0,deletesByQuery=0,errors=0,cumulative_adds=2,cumulative_deletesById=0,cumulative_deletesByQuery=0,cumulative_errors=0}
[junit4] 2> 161729 T725 oasc.SolrCore.closeSearcher [collection1] Closing main searcher on request.
[junit4] 2> 161733 T725 oas.SolrTestCaseJ4.tearDown ###Ending testReaderIsNotNRT
[junit4] 2> NOTE: reproduce with: ant test -Dtestcase=TestNonNRTOpen -Dtests.method=testReaderIsNotNRT -Dtests.seed=E763DD0E7D8A9CA8 -Dtests.slow=true -Dtests.locale=ar -Dtests.timezone=Asia/Qatar -Dtests.file.encoding=US-ASCII
[junit4] FAILURE 0.38s | TestNonNRTOpen.testReaderIsNotNRT <<<
[junit4] > Throwable #1: java.lang.AssertionError: expected:<3> but was:<2>
[junit4] > at __randomizedtesting.SeedInfo.seed([E763DD0E7D8A9CA8:52E5BC89C24B2E5C]:0)
[junit4] > at org.apache.solr.core.TestNonNRTOpen.assertNotNRT(TestNonNRTOpen.java:133)
[junit4] > at org.apache.solr.core.TestNonNRTOpen.testReaderIsNotNRT(TestNonNRTOpen.java:94)
[junit4] > at java.lang.Thread.run(Thread.java:744)
[junit4] 2> 161745 T725 oas.SolrTestCaseJ4.deleteCore ###deleteCore
[junit4] 2> 161745 T725 oasc.CoreContainer.shutdown Shutting down CoreContainer instance=1481814921
[junit4] 2> 161746 T725 oasc.SolrCore.close [collection1] CLOSING SolrCore org.apache.solr.core.SolrCore@258ebf49
[junit4] 2> 161746 T725 oasu.DirectUpdateHandler2.close closing DirectUpdateHandler2{commits=0,autocommits=0,soft autocommits=0,optimizes=0,rollbacks=0,expungeDeletes=0,docsPending=0,adds=0,deletesById=0,deletesByQuery=0,errors=0,cumulative_adds=0,cumulative_deletesById=0,cumulative_deletesByQuery=0,cumulative_errors=0}
[junit4] 2> 161746 T725 oasu.SolrCoreState.decrefSolrCoreState Closing SolrCoreState
[junit4] 2> 161746 T725 oasu.DefaultSolrCoreState.closeIndexWriter SolrCoreState ref count has reached 0 - closing IndexWriter
[junit4] 2> 161746 T725 oasu.DefaultSolrCoreState.closeIndexWriter closing IndexWriter with IndexWriterCloser
[junit4] 2> 161747 T734 oasc.SolrCore.registerSearcher [collection1] Registered new searcher Searcher@29d3f985 main{StandardDirectoryReader(segments_a:20 _5(4.7):C1 _6(4.7):C1 _7(4.7):C1)}
[junit4] 2> 161748 T725 oasc.SolrCore.closeSearcher [collection1] Closing main searcher on request.
[junit4] 2> 161751 T725 oasc.CachingDirectoryFactory.close Closing StandardDirectoryFactory - 2 directories currently being tracked
[junit4] 2> 161751 T725 oasc.CachingDirectoryFactory.closeCacheValue looking to close C:\Users\JenkinsSlave\workspace\Lucene-Solr-4.x-Windows\solr\build\solr-core\test\J0\solrtest-TestNonNRTOpen-1387174383852 [CachedDir<<refCount=0;path=C:\Users\JenkinsSlave\workspace\Lucene-Solr-4.x-Windows\solr\build\solr-core\test\J0\solrtest-TestNonNRTOpen-1387174383852;done=false>>]
[junit4] 2> 161751 T725 oasc.CachingDirectoryFactory.close Closing directory: C:\Users\JenkinsSlave\workspace\Lucene-Solr-4.x-Windows\solr\build\solr-core\test\J0\solrtest-TestNonNRTOpen-1387174383852
[junit4] 2> 161751 T725 oasc.CachingDirectoryFactory.closeCacheValue looking to close C:\Users\JenkinsSlave\workspace\Lucene-Solr-4.x-Windows\solr\build\solr-core\test\J0\solrtest-TestNonNRTOpen-1387174383852\index [CachedDir<<refCount=0;path=C:\Users\JenkinsSlave\workspace\Lucene-Solr-4.x-Windows\solr\build\solr-core\test\J0\solrtest-TestNonNRTOpen-1387174383852\index;done=false>>]
[junit4] 2> 161751 T725 oasc.CachingDirectoryFactory.close Closing directory: C:\Users\JenkinsSlave\workspace\Lucene-Solr-4.x-Windows\solr\build\solr-core\test\J0\solrtest-TestNonNRTOpen-1387174383852\index
[junit4] 2> NOTE: test params are: codec=Lucene3x, sim=RandomSimilarityProvider(queryNorm=false,coord=crazy): {}, locale=ar, timezone=Asia/Qatar
[junit4] 2> NOTE: Windows 7 6.1 amd64/Oracle Corporation 1.8.0-ea (64-bit)/cpus=2,threads=1,free=113111496,total=220200960
[junit4] 2> NOTE: All tests run in this JVM: [TestSchemaSimilarityResource, DocumentBuilderTest, TestCoreDiscovery, ZkControllerTest, FullSolrCloudDistribCmdsTest, HdfsLockFactoryTest, TestSolrDeletionPolicy1, TestSchemaResource, UUIDFieldTest, OverseerTest, StressHdfsTest, TestUtils, TestNonNRTOpen]
[junit4] Completed in 1.24s, 2 tests, 1 failure <<< FAILURES!
[...truncated 1045 lines...]
BUILD FAILED
C:\Users\JenkinsSlave\workspace\Lucene-Solr-4.x-Windows\build.xml:459: The following error occurred while executing this line:
C:\Users\JenkinsSlave\workspace\Lucene-Solr-4.x-Windows\build.xml:439: The following error occurred while executing this line:
C:\Users\JenkinsSlave\workspace\Lucene-Solr-4.x-Windows\build.xml:39: The following error occurred while executing this line:
C:\Users\JenkinsSlave\workspace\Lucene-Solr-4.x-Windows\extra-targets.xml:37: The following error occurred while executing this line:
C:\Users\JenkinsSlave\workspace\Lucene-Solr-4.x-Windows\solr\build.xml:189: The following error occurred while executing this line:
C:\Users\JenkinsSlave\workspace\Lucene-Solr-4.x-Windows\solr\common-build.xml:491: The following error occurred while executing this line:
C:\Users\JenkinsSlave\workspace\Lucene-Solr-4.x-Windows\lucene\common-build.xml:1307: The following error occurred while executing this line:
C:\Users\JenkinsSlave\workspace\Lucene-Solr-4.x-Windows\lucene\common-build.xml:940: There were test failures: 347 suites, 1516 tests, 1 failure, 39 ignored (11 assumptions)
Total time: 71 minutes 3 seconds
Build step 'Invoke Ant' marked build as failure
Description set: Java: 64bit/jdk1.8.0-ea-b119 -XX:+UseCompressedOops -XX:+UseParallelGC
Archiving artifacts
Recording test results
Email was triggered for: Failure
Sending email for trigger: Failure