You are viewing a plain text version of this content. The canonical link for it is here.
Posted to builds@lucene.apache.org by Policeman Jenkins Server <je...@thetaphi.de> on 2019/10/22 15:08:00 UTC
[JENKINS] Lucene-Solr-master-Linux (64bit/jdk-12.0.1) - Build #
24933 - Unstable!
Build: https://jenkins.thetaphi.de/job/Lucene-Solr-master-Linux/24933/
Java: 64bit/jdk-12.0.1 -XX:-UseCompressedOops -XX:+UseG1GC
1 tests failed.
FAILED: org.apache.solr.cloud.SyncSliceTest.test
Error Message:
expected:<5> but was:<4>
Stack Trace:
java.lang.AssertionError: expected:<5> but was:<4>
at __randomizedtesting.SeedInfo.seed([8F0203D7A8942E0D:7563C0D066843F5]:0)
at org.junit.Assert.fail(Assert.java:88)
at org.junit.Assert.failNotEquals(Assert.java:834)
at org.junit.Assert.assertEquals(Assert.java:645)
at org.junit.Assert.assertEquals(Assert.java:631)
at org.apache.solr.cloud.SyncSliceTest.test(SyncSliceTest.java:150)
at java.base/jdk.internal.reflect.NativeMethodAccessorImpl.invoke0(Native Method)
at java.base/jdk.internal.reflect.NativeMethodAccessorImpl.invoke(NativeMethodAccessorImpl.java:62)
at java.base/jdk.internal.reflect.DelegatingMethodAccessorImpl.invoke(DelegatingMethodAccessorImpl.java:43)
at java.base/java.lang.reflect.Method.invoke(Method.java:567)
at com.carrotsearch.randomizedtesting.RandomizedRunner.invoke(RandomizedRunner.java:1750)
at com.carrotsearch.randomizedtesting.RandomizedRunner$8.evaluate(RandomizedRunner.java:938)
at com.carrotsearch.randomizedtesting.RandomizedRunner$9.evaluate(RandomizedRunner.java:974)
at com.carrotsearch.randomizedtesting.RandomizedRunner$10.evaluate(RandomizedRunner.java:988)
at org.apache.solr.BaseDistributedSearchTestCase$ShardsRepeatRule$ShardsFixedStatement.callStatement(BaseDistributedSearchTestCase.java:1082)
at org.apache.solr.BaseDistributedSearchTestCase$ShardsRepeatRule$ShardsStatement.evaluate(BaseDistributedSearchTestCase.java:1054)
at com.carrotsearch.randomizedtesting.rules.SystemPropertiesRestoreRule$1.evaluate(SystemPropertiesRestoreRule.java:57)
at org.apache.lucene.util.TestRuleSetupTeardownChained$1.evaluate(TestRuleSetupTeardownChained.java:49)
at org.apache.lucene.util.AbstractBeforeAfterRule$1.evaluate(AbstractBeforeAfterRule.java:45)
at org.apache.lucene.util.TestRuleThreadAndTestName$1.evaluate(TestRuleThreadAndTestName.java:48)
at org.apache.lucene.util.TestRuleIgnoreAfterMaxFailures$1.evaluate(TestRuleIgnoreAfterMaxFailures.java:64)
at org.apache.lucene.util.TestRuleMarkFailure$1.evaluate(TestRuleMarkFailure.java:47)
at com.carrotsearch.randomizedtesting.rules.StatementAdapter.evaluate(StatementAdapter.java:36)
at com.carrotsearch.randomizedtesting.ThreadLeakControl$StatementRunner.run(ThreadLeakControl.java:368)
at com.carrotsearch.randomizedtesting.ThreadLeakControl.forkTimeoutingTask(ThreadLeakControl.java:817)
at com.carrotsearch.randomizedtesting.ThreadLeakControl$3.evaluate(ThreadLeakControl.java:468)
at com.carrotsearch.randomizedtesting.RandomizedRunner.runSingleTest(RandomizedRunner.java:947)
at com.carrotsearch.randomizedtesting.RandomizedRunner$5.evaluate(RandomizedRunner.java:832)
at com.carrotsearch.randomizedtesting.RandomizedRunner$6.evaluate(RandomizedRunner.java:883)
at com.carrotsearch.randomizedtesting.RandomizedRunner$7.evaluate(RandomizedRunner.java:894)
at com.carrotsearch.randomizedtesting.rules.StatementAdapter.evaluate(StatementAdapter.java:36)
at com.carrotsearch.randomizedtesting.rules.SystemPropertiesRestoreRule$1.evaluate(SystemPropertiesRestoreRule.java:57)
at org.apache.lucene.util.AbstractBeforeAfterRule$1.evaluate(AbstractBeforeAfterRule.java:45)
at com.carrotsearch.randomizedtesting.rules.StatementAdapter.evaluate(StatementAdapter.java:36)
at org.apache.lucene.util.TestRuleStoreClassName$1.evaluate(TestRuleStoreClassName.java:41)
at com.carrotsearch.randomizedtesting.rules.NoShadowingOrOverridesOnMethodsRule$1.evaluate(NoShadowingOrOverridesOnMethodsRule.java:40)
at com.carrotsearch.randomizedtesting.rules.NoShadowingOrOverridesOnMethodsRule$1.evaluate(NoShadowingOrOverridesOnMethodsRule.java:40)
at com.carrotsearch.randomizedtesting.rules.StatementAdapter.evaluate(StatementAdapter.java:36)
at com.carrotsearch.randomizedtesting.rules.StatementAdapter.evaluate(StatementAdapter.java:36)
at org.apache.lucene.util.TestRuleAssertionsRequired$1.evaluate(TestRuleAssertionsRequired.java:53)
at org.apache.lucene.util.TestRuleMarkFailure$1.evaluate(TestRuleMarkFailure.java:47)
at org.apache.lucene.util.TestRuleIgnoreAfterMaxFailures$1.evaluate(TestRuleIgnoreAfterMaxFailures.java:64)
at org.apache.lucene.util.TestRuleIgnoreTestSuites$1.evaluate(TestRuleIgnoreTestSuites.java:54)
at com.carrotsearch.randomizedtesting.rules.StatementAdapter.evaluate(StatementAdapter.java:36)
at com.carrotsearch.randomizedtesting.ThreadLeakControl$StatementRunner.run(ThreadLeakControl.java:368)
at java.base/java.lang.Thread.run(Thread.java:835)
Build Log:
[...truncated 13534 lines...]
[junit4] Suite: org.apache.solr.cloud.SyncSliceTest
[junit4] 2> 593870 INFO (SUITE-SyncSliceTest-seed#[8F0203D7A8942E0D]-worker) [ ] o.a.s.SolrTestCaseJ4 Created dataDir: /home/jenkins/workspace/Lucene-Solr-master-Linux/solr/build/solr-core/test/J1/temp/solr.cloud.SyncSliceTest_8F0203D7A8942E0D-001/data-dir-50-001
[junit4] 2> 593870 WARN (SUITE-SyncSliceTest-seed#[8F0203D7A8942E0D]-worker) [ ] o.a.s.SolrTestCaseJ4 startTrackingSearchers: numOpens=6 numCloses=6
[junit4] 2> 593870 INFO (SUITE-SyncSliceTest-seed#[8F0203D7A8942E0D]-worker) [ ] o.a.s.SolrTestCaseJ4 Using PointFields (NUMERIC_POINTS_SYSPROP=true) w/NUMERIC_DOCVALUES_SYSPROP=true
[junit4] 2> 593871 INFO (SUITE-SyncSliceTest-seed#[8F0203D7A8942E0D]-worker) [ ] o.a.s.SolrTestCaseJ4 Randomized ssl (true) and clientAuth (true) via: @org.apache.solr.util.RandomizeSSL(reason="", ssl=0.0/0.0, value=0.0/0.0, clientAuth=0.0/0.0)
[junit4] 2> 593872 INFO (SUITE-SyncSliceTest-seed#[8F0203D7A8942E0D]-worker) [ ] o.a.s.SolrTestCaseJ4 SecureRandom sanity checks: test.solr.allowed.securerandom=null & java.security.egd=file:/dev/./urandom
[junit4] 2> 593872 INFO (SUITE-SyncSliceTest-seed#[8F0203D7A8942E0D]-worker) [ ] o.a.s.BaseDistributedSearchTestCase Setting hostContext system property: /
[junit4] 2> 593876 INFO (TEST-SyncSliceTest.test-seed#[8F0203D7A8942E0D]) [ ] o.a.s.c.ZkTestServer STARTING ZK TEST SERVER
[junit4] 2> 593876 INFO (ZkTestServer Run Thread) [ ] o.a.s.c.ZkTestServer client port:0.0.0.0/0.0.0.0:0
[junit4] 2> 593876 INFO (ZkTestServer Run Thread) [ ] o.a.s.c.ZkTestServer Starting server
[junit4] 2> 593976 INFO (TEST-SyncSliceTest.test-seed#[8F0203D7A8942E0D]) [ ] o.a.s.c.ZkTestServer start zk server on port:37493
[junit4] 2> 593976 INFO (TEST-SyncSliceTest.test-seed#[8F0203D7A8942E0D]) [ ] o.a.s.c.ZkTestServer waitForServerUp: 127.0.0.1:37493
[junit4] 2> 593976 INFO (TEST-SyncSliceTest.test-seed#[8F0203D7A8942E0D]) [ ] o.a.s.c.ZkTestServer parse host and port list: 127.0.0.1:37493
[junit4] 2> 593976 INFO (TEST-SyncSliceTest.test-seed#[8F0203D7A8942E0D]) [ ] o.a.s.c.ZkTestServer connecting to 127.0.0.1 37493
[junit4] 2> 593978 INFO (TEST-SyncSliceTest.test-seed#[8F0203D7A8942E0D]) [ ] o.a.s.c.c.ConnectionManager Waiting for client to connect to ZooKeeper
[junit4] 2> 593980 INFO (zkConnectionManagerCallback-2625-thread-1) [ ] o.a.s.c.c.ConnectionManager zkClient has connected
[junit4] 2> 593980 INFO (TEST-SyncSliceTest.test-seed#[8F0203D7A8942E0D]) [ ] o.a.s.c.c.ConnectionManager Client is connected to ZooKeeper
[junit4] 2> 593986 INFO (TEST-SyncSliceTest.test-seed#[8F0203D7A8942E0D]) [ ] o.a.s.c.c.ConnectionManager Waiting for client to connect to ZooKeeper
[junit4] 2> 593987 INFO (zkConnectionManagerCallback-2627-thread-1) [ ] o.a.s.c.c.ConnectionManager zkClient has connected
[junit4] 2> 593987 INFO (TEST-SyncSliceTest.test-seed#[8F0203D7A8942E0D]) [ ] o.a.s.c.c.ConnectionManager Client is connected to ZooKeeper
[junit4] 2> 593994 INFO (TEST-SyncSliceTest.test-seed#[8F0203D7A8942E0D]) [ ] o.a.s.c.ZkTestServer put /home/jenkins/workspace/Lucene-Solr-master-Linux/solr/core/src/test-files/solr/collection1/conf/solrconfig-tlog.xml to /configs/conf1/solrconfig.xml
[junit4] 2> 593996 INFO (TEST-SyncSliceTest.test-seed#[8F0203D7A8942E0D]) [ ] o.a.s.c.ZkTestServer put /home/jenkins/workspace/Lucene-Solr-master-Linux/solr/core/src/test-files/solr/collection1/conf/schema.xml to /configs/conf1/schema.xml
[junit4] 2> 593997 INFO (TEST-SyncSliceTest.test-seed#[8F0203D7A8942E0D]) [ ] o.a.s.c.ZkTestServer put /home/jenkins/workspace/Lucene-Solr-master-Linux/solr/core/src/test-files/solr/collection1/conf/solrconfig.snippet.randomindexconfig.xml to /configs/conf1/solrconfig.snippet.randomindexconfig.xml
[junit4] 2> 593997 INFO (TEST-SyncSliceTest.test-seed#[8F0203D7A8942E0D]) [ ] o.a.s.c.ZkTestServer put /home/jenkins/workspace/Lucene-Solr-master-Linux/solr/core/src/test-files/solr/collection1/conf/stopwords.txt to /configs/conf1/stopwords.txt
[junit4] 2> 593998 INFO (TEST-SyncSliceTest.test-seed#[8F0203D7A8942E0D]) [ ] o.a.s.c.ZkTestServer put /home/jenkins/workspace/Lucene-Solr-master-Linux/solr/core/src/test-files/solr/collection1/conf/protwords.txt to /configs/conf1/protwords.txt
[junit4] 2> 593999 INFO (TEST-SyncSliceTest.test-seed#[8F0203D7A8942E0D]) [ ] o.a.s.c.ZkTestServer put /home/jenkins/workspace/Lucene-Solr-master-Linux/solr/core/src/test-files/solr/collection1/conf/currency.xml to /configs/conf1/currency.xml
[junit4] 2> 593999 INFO (TEST-SyncSliceTest.test-seed#[8F0203D7A8942E0D]) [ ] o.a.s.c.ZkTestServer put /home/jenkins/workspace/Lucene-Solr-master-Linux/solr/core/src/test-files/solr/collection1/conf/enumsConfig.xml to /configs/conf1/enumsConfig.xml
[junit4] 2> 594000 INFO (TEST-SyncSliceTest.test-seed#[8F0203D7A8942E0D]) [ ] o.a.s.c.ZkTestServer put /home/jenkins/workspace/Lucene-Solr-master-Linux/solr/core/src/test-files/solr/collection1/conf/open-exchange-rates.json to /configs/conf1/open-exchange-rates.json
[junit4] 2> 594000 INFO (TEST-SyncSliceTest.test-seed#[8F0203D7A8942E0D]) [ ] o.a.s.c.ZkTestServer put /home/jenkins/workspace/Lucene-Solr-master-Linux/solr/core/src/test-files/solr/collection1/conf/mapping-ISOLatin1Accent.txt to /configs/conf1/mapping-ISOLatin1Accent.txt
[junit4] 2> 594001 INFO (TEST-SyncSliceTest.test-seed#[8F0203D7A8942E0D]) [ ] o.a.s.c.ZkTestServer put /home/jenkins/workspace/Lucene-Solr-master-Linux/solr/core/src/test-files/solr/collection1/conf/old_synonyms.txt to /configs/conf1/old_synonyms.txt
[junit4] 2> 594001 INFO (TEST-SyncSliceTest.test-seed#[8F0203D7A8942E0D]) [ ] o.a.s.c.ZkTestServer put /home/jenkins/workspace/Lucene-Solr-master-Linux/solr/core/src/test-files/solr/collection1/conf/synonyms.txt to /configs/conf1/synonyms.txt
[junit4] 2> 594007 INFO (TEST-SyncSliceTest.test-seed#[8F0203D7A8942E0D]) [ ] o.a.s.c.c.ConnectionManager Waiting for client to connect to ZooKeeper
[junit4] 2> 594010 INFO (zkConnectionManagerCallback-2631-thread-1) [ ] o.a.s.c.c.ConnectionManager zkClient has connected
[junit4] 2> 594010 INFO (TEST-SyncSliceTest.test-seed#[8F0203D7A8942E0D]) [ ] o.a.s.c.c.ConnectionManager Client is connected to ZooKeeper
[junit4] 2> 594111 INFO (TEST-SyncSliceTest.test-seed#[8F0203D7A8942E0D]) [ ] o.a.s.c.AbstractFullDistribZkTestBase Will use NRT replicas unless explicitly asked otherwise
[junit4] 2> 594211 WARN (TEST-SyncSliceTest.test-seed#[8F0203D7A8942E0D]) [ ] o.e.j.s.AbstractConnector Ignoring deprecated socket close linger time
[junit4] 2> 594212 INFO (TEST-SyncSliceTest.test-seed#[8F0203D7A8942E0D]) [ ] o.a.s.c.s.e.JettySolrRunner Start Jetty (configured port=0, binding port=0)
[junit4] 2> 594212 INFO (TEST-SyncSliceTest.test-seed#[8F0203D7A8942E0D]) [ ] o.a.s.c.s.e.JettySolrRunner Trying to start Jetty on port 0 try number 1 ...
[junit4] 2> 594212 INFO (TEST-SyncSliceTest.test-seed#[8F0203D7A8942E0D]) [ ] o.e.j.s.Server jetty-9.4.19.v20190610; built: 2019-06-10T16:30:51.723Z; git: afcf563148970e98786327af5e07c261fda175d3; jvm 12.0.1+12
[junit4] 2> 594212 INFO (TEST-SyncSliceTest.test-seed#[8F0203D7A8942E0D]) [ ] o.e.j.s.session DefaultSessionIdManager workerName=node0
[junit4] 2> 594212 INFO (TEST-SyncSliceTest.test-seed#[8F0203D7A8942E0D]) [ ] o.e.j.s.session No SessionScavenger set, using defaults
[junit4] 2> 594212 INFO (TEST-SyncSliceTest.test-seed#[8F0203D7A8942E0D]) [ ] o.e.j.s.session node0 Scavenging every 660000ms
[junit4] 2> 594213 INFO (TEST-SyncSliceTest.test-seed#[8F0203D7A8942E0D]) [ ] o.e.j.s.h.ContextHandler Started o.e.j.s.ServletContextHandler@707bcb2c{/,null,AVAILABLE}
[junit4] 2> 594214 INFO (TEST-SyncSliceTest.test-seed#[8F0203D7A8942E0D]) [ ] o.e.j.s.AbstractConnector Started ServerConnector@dee1eeb{ssl,[ssl, alpn, http/1.1, h2]}{127.0.0.1:38511}
[junit4] 2> 594214 INFO (TEST-SyncSliceTest.test-seed#[8F0203D7A8942E0D]) [ ] o.e.j.s.Server Started @594251ms
[junit4] 2> 594214 INFO (TEST-SyncSliceTest.test-seed#[8F0203D7A8942E0D]) [ ] o.a.s.c.s.e.JettySolrRunner Jetty properties: {hostContext=/, solr.data.dir=/home/jenkins/workspace/Lucene-Solr-master-Linux/solr/build/solr-core/test/J1/temp/solr.cloud.SyncSliceTest_8F0203D7A8942E0D-001/tempDir-001/control/data, hostPort=38511, coreRootDirectory=/home/jenkins/workspace/Lucene-Solr-master-Linux/solr/build/solr-core/test/J1/../../../../../../../../../home/jenkins/workspace/Lucene-Solr-master-Linux/solr/build/solr-core/test/J1/temp/solr.cloud.SyncSliceTest_8F0203D7A8942E0D-001/control-001/cores}
[junit4] 2> 594214 ERROR (TEST-SyncSliceTest.test-seed#[8F0203D7A8942E0D]) [ ] o.a.s.u.StartupLoggingUtils Missing Java Option solr.log.dir. Logging may be missing or incomplete.
[junit4] 2> 594214 INFO (TEST-SyncSliceTest.test-seed#[8F0203D7A8942E0D]) [ ] o.a.s.s.SolrDispatchFilter Using logger factory org.apache.logging.slf4j.Log4jLoggerFactory
[junit4] 2> 594214 INFO (TEST-SyncSliceTest.test-seed#[8F0203D7A8942E0D]) [ ] o.a.s.s.SolrDispatchFilter ___ _ Welcome to Apache Solr™ version 9.0.0
[junit4] 2> 594214 INFO (TEST-SyncSliceTest.test-seed#[8F0203D7A8942E0D]) [ ] o.a.s.s.SolrDispatchFilter / __| ___| |_ _ Starting in cloud mode on port null
[junit4] 2> 594214 INFO (TEST-SyncSliceTest.test-seed#[8F0203D7A8942E0D]) [ ] o.a.s.s.SolrDispatchFilter \__ \/ _ \ | '_| Install dir: null
[junit4] 2> 594214 INFO (TEST-SyncSliceTest.test-seed#[8F0203D7A8942E0D]) [ ] o.a.s.s.SolrDispatchFilter |___/\___/_|_| Start time: 2019-10-22T14:17:11.646539Z
[junit4] 2> 594215 INFO (TEST-SyncSliceTest.test-seed#[8F0203D7A8942E0D]) [ ] o.a.s.c.c.ConnectionManager Waiting for client to connect to ZooKeeper
[junit4] 2> 594216 INFO (zkConnectionManagerCallback-2633-thread-1) [ ] o.a.s.c.c.ConnectionManager zkClient has connected
[junit4] 2> 594216 INFO (TEST-SyncSliceTest.test-seed#[8F0203D7A8942E0D]) [ ] o.a.s.c.c.ConnectionManager Client is connected to ZooKeeper
[junit4] 2> 594317 INFO (TEST-SyncSliceTest.test-seed#[8F0203D7A8942E0D]) [ ] o.a.s.s.SolrDispatchFilter Loading solr.xml from SolrHome (not found in ZooKeeper)
[junit4] 2> 594317 INFO (TEST-SyncSliceTest.test-seed#[8F0203D7A8942E0D]) [ ] o.a.s.c.SolrXmlConfig Loading container configuration from /home/jenkins/workspace/Lucene-Solr-master-Linux/solr/build/solr-core/test/J1/temp/solr.cloud.SyncSliceTest_8F0203D7A8942E0D-001/control-001/solr.xml
[junit4] 2> 594322 INFO (TEST-SyncSliceTest.test-seed#[8F0203D7A8942E0D]) [ ] o.a.s.c.SolrXmlConfig Configuration parameter autoReplicaFailoverWorkLoopDelay is ignored
[junit4] 2> 594322 INFO (TEST-SyncSliceTest.test-seed#[8F0203D7A8942E0D]) [ ] o.a.s.c.SolrXmlConfig Configuration parameter autoReplicaFailoverBadNodeExpiration is ignored
[junit4] 2> 594326 INFO (TEST-SyncSliceTest.test-seed#[8F0203D7A8942E0D]) [ ] o.a.s.c.SolrXmlConfig MBean server found: com.sun.jmx.mbeanserver.JmxMBeanServer@6b331ff7, but no JMX reporters were configured - adding default JMX reporter.
[junit4] 2> 594543 INFO (TEST-SyncSliceTest.test-seed#[8F0203D7A8942E0D]) [ ] o.a.s.h.c.HttpShardHandlerFactory Host whitelist initialized: WhitelistHostChecker [whitelistHosts=null, whitelistHostCheckingEnabled=false]
[junit4] 2> 594545 WARN (TEST-SyncSliceTest.test-seed#[8F0203D7A8942E0D]) [ ] o.e.j.u.s.S.config Trusting all certificates configured for Client@19851e3a[provider=null,keyStore=null,trustStore=null]
[junit4] 2> 594545 WARN (TEST-SyncSliceTest.test-seed#[8F0203D7A8942E0D]) [ ] o.e.j.u.s.S.config No Client EndPointIdentificationAlgorithm configured for Client@19851e3a[provider=null,keyStore=null,trustStore=null]
[junit4] 2> 594549 WARN (TEST-SyncSliceTest.test-seed#[8F0203D7A8942E0D]) [ ] o.e.j.u.s.S.config Trusting all certificates configured for Client@135a083b[provider=null,keyStore=null,trustStore=null]
[junit4] 2> 594549 WARN (TEST-SyncSliceTest.test-seed#[8F0203D7A8942E0D]) [ ] o.e.j.u.s.S.config No Client EndPointIdentificationAlgorithm configured for Client@135a083b[provider=null,keyStore=null,trustStore=null]
[junit4] 2> 594550 INFO (TEST-SyncSliceTest.test-seed#[8F0203D7A8942E0D]) [ ] o.a.s.c.ZkContainer Zookeeper client=127.0.0.1:37493/solr
[junit4] 2> 594555 INFO (TEST-SyncSliceTest.test-seed#[8F0203D7A8942E0D]) [ ] o.a.s.c.c.ConnectionManager Waiting for client to connect to ZooKeeper
[junit4] 2> 594557 INFO (zkConnectionManagerCallback-2640-thread-1) [ ] o.a.s.c.c.ConnectionManager zkClient has connected
[junit4] 2> 594559 INFO (TEST-SyncSliceTest.test-seed#[8F0203D7A8942E0D]) [ ] o.a.s.c.c.ConnectionManager Client is connected to ZooKeeper
[junit4] 2> 594662 INFO (TEST-SyncSliceTest.test-seed#[8F0203D7A8942E0D]) [n:127.0.0.1:38511_ ] o.a.s.c.c.ConnectionManager Waiting for client to connect to ZooKeeper
[junit4] 2> 594663 INFO (zkConnectionManagerCallback-2642-thread-1) [ ] o.a.s.c.c.ConnectionManager zkClient has connected
[junit4] 2> 594663 INFO (TEST-SyncSliceTest.test-seed#[8F0203D7A8942E0D]) [n:127.0.0.1:38511_ ] o.a.s.c.c.ConnectionManager Client is connected to ZooKeeper
[junit4] 2> 594720 INFO (TEST-SyncSliceTest.test-seed#[8F0203D7A8942E0D]) [n:127.0.0.1:38511_ ] o.a.s.c.OverseerElectionContext I am going to be the leader 127.0.0.1:38511_
[junit4] 2> 594720 INFO (TEST-SyncSliceTest.test-seed#[8F0203D7A8942E0D]) [n:127.0.0.1:38511_ ] o.a.s.c.Overseer Overseer (id=72351927552835589-127.0.0.1:38511_-n_0000000000) starting
[junit4] 2> 594730 INFO (OverseerStateUpdate-72351927552835589-127.0.0.1:38511_-n_0000000000) [n:127.0.0.1:38511_ ] o.a.s.c.Overseer Starting to work on the main queue : 127.0.0.1:38511_
[junit4] 2> 594732 INFO (TEST-SyncSliceTest.test-seed#[8F0203D7A8942E0D]) [n:127.0.0.1:38511_ ] o.a.s.c.ZkController Register node as live in ZooKeeper:/live_nodes/127.0.0.1:38511_
[junit4] 2> 594744 INFO (zkCallback-2641-thread-1) [ ] o.a.s.c.c.ZkStateReader Updated live nodes from ZooKeeper... (0) -> (1)
[junit4] 2> 594762 INFO (TEST-SyncSliceTest.test-seed#[8F0203D7A8942E0D]) [n:127.0.0.1:38511_ ] o.a.s.h.a.MetricsHistoryHandler No .system collection, keeping metrics history in memory.
[junit4] 2> 594775 INFO (TEST-SyncSliceTest.test-seed#[8F0203D7A8942E0D]) [n:127.0.0.1:38511_ ] o.a.s.m.r.SolrJmxReporter JMX monitoring for 'solr.node' (registry 'solr.node') enabled at server: com.sun.jmx.mbeanserver.JmxMBeanServer@6b331ff7
[junit4] 2> 594781 INFO (TEST-SyncSliceTest.test-seed#[8F0203D7A8942E0D]) [n:127.0.0.1:38511_ ] o.a.s.m.r.SolrJmxReporter JMX monitoring for 'solr.jvm' (registry 'solr.jvm') enabled at server: com.sun.jmx.mbeanserver.JmxMBeanServer@6b331ff7
[junit4] 2> 594781 INFO (TEST-SyncSliceTest.test-seed#[8F0203D7A8942E0D]) [n:127.0.0.1:38511_ ] o.a.s.m.r.SolrJmxReporter JMX monitoring for 'solr.jetty' (registry 'solr.jetty') enabled at server: com.sun.jmx.mbeanserver.JmxMBeanServer@6b331ff7
[junit4] 2> 594782 INFO (TEST-SyncSliceTest.test-seed#[8F0203D7A8942E0D]) [n:127.0.0.1:38511_ ] o.a.s.c.CorePropertiesLocator Found 0 core definitions underneath /home/jenkins/workspace/Lucene-Solr-master-Linux/solr/build/solr-core/test/J1/../../../../../../../../../home/jenkins/workspace/Lucene-Solr-master-Linux/solr/build/solr-core/test/J1/temp/solr.cloud.SyncSliceTest_8F0203D7A8942E0D-001/control-001/cores
[junit4] 2> 594798 INFO (TEST-SyncSliceTest.test-seed#[8F0203D7A8942E0D]) [ ] o.a.s.c.c.ConnectionManager Waiting for client to connect to ZooKeeper
[junit4] 2> 594802 INFO (zkConnectionManagerCallback-2651-thread-1) [ ] o.a.s.c.c.ConnectionManager zkClient has connected
[junit4] 2> 594802 INFO (TEST-SyncSliceTest.test-seed#[8F0203D7A8942E0D]) [ ] o.a.s.c.c.ConnectionManager Client is connected to ZooKeeper
[junit4] 2> 594803 INFO (TEST-SyncSliceTest.test-seed#[8F0203D7A8942E0D]) [ ] o.a.s.c.c.ZkStateReader Updated live nodes from ZooKeeper... (0) -> (1)
[junit4] 2> 594803 INFO (TEST-SyncSliceTest.test-seed#[8F0203D7A8942E0D]) [ ] o.a.s.c.s.i.ZkClientClusterStateProvider Cluster at 127.0.0.1:37493/solr ready
[junit4] 2> 594824 INFO (qtp1214423196-8023) [n:127.0.0.1:38511_ ] o.a.s.h.a.CollectionsHandler Invoked Collection Action :create with params collection.configName=conf1&name=control_collection&nrtReplicas=1&action=CREATE&numShards=1&createNodeSet=127.0.0.1:38511_&wt=javabin&version=2 and sendToOCPQueue=true
[junit4] 2> 594831 INFO (OverseerThreadFactory-2918-thread-1-processing-n:127.0.0.1:38511_) [n:127.0.0.1:38511_ ] o.a.s.c.a.c.CreateCollectionCmd Create collection control_collection
[junit4] 2> 594947 INFO (qtp1214423196-8022) [n:127.0.0.1:38511_ x:control_collection_shard1_replica_n1 ] o.a.s.h.a.CoreAdminOperation core create command qt=/admin/cores&collection.configName=conf1&newCollection=true&name=control_collection_shard1_replica_n1&action=CREATE&numShards=1&collection=control_collection&shard=shard1&wt=javabin&version=2&replicaType=NRT
[junit4] 2> 594947 INFO (qtp1214423196-8022) [n:127.0.0.1:38511_ x:control_collection_shard1_replica_n1 ] o.a.s.c.TransientSolrCoreCacheDefault Allocating transient cache for 4 transient cores
[junit4] 2> 595972 INFO (qtp1214423196-8022) [n:127.0.0.1:38511_ c:control_collection s:shard1 x:control_collection_shard1_replica_n1 ] o.a.s.c.SolrConfig Using Lucene MatchVersion: 9.0.0
[junit4] 2> 595994 INFO (qtp1214423196-8022) [n:127.0.0.1:38511_ c:control_collection s:shard1 x:control_collection_shard1_replica_n1 ] o.a.s.s.IndexSchema [control_collection_shard1_replica_n1] Schema name=test
[junit4] 2> 596244 INFO (qtp1214423196-8022) [n:127.0.0.1:38511_ c:control_collection s:shard1 x:control_collection_shard1_replica_n1 ] o.a.s.s.IndexSchema Loaded schema test/1.0 with uniqueid field id
[junit4] 2> 596261 INFO (qtp1214423196-8022) [n:127.0.0.1:38511_ c:control_collection s:shard1 x:control_collection_shard1_replica_n1 ] o.a.s.c.CoreContainer Creating SolrCore 'control_collection_shard1_replica_n1' using configuration from collection control_collection, trusted=true
[junit4] 2> 596262 INFO (qtp1214423196-8022) [n:127.0.0.1:38511_ c:control_collection s:shard1 x:control_collection_shard1_replica_n1 ] o.a.s.m.r.SolrJmxReporter JMX monitoring for 'solr.core.control_collection.shard1.replica_n1' (registry 'solr.core.control_collection.shard1.replica_n1') enabled at server: com.sun.jmx.mbeanserver.JmxMBeanServer@6b331ff7
[junit4] 2> 596262 INFO (qtp1214423196-8022) [n:127.0.0.1:38511_ c:control_collection s:shard1 x:control_collection_shard1_replica_n1 ] o.a.s.c.SolrCore [[control_collection_shard1_replica_n1] ] Opening new SolrCore at [/home/jenkins/workspace/Lucene-Solr-master-Linux/solr/build/solr-core/test/J1/temp/solr.cloud.SyncSliceTest_8F0203D7A8942E0D-001/control-001/cores/control_collection_shard1_replica_n1], dataDir=[/home/jenkins/workspace/Lucene-Solr-master-Linux/solr/build/solr-core/test/J1/../../../../../../../../../home/jenkins/workspace/Lucene-Solr-master-Linux/solr/build/solr-core/test/J1/temp/solr.cloud.SyncSliceTest_8F0203D7A8942E0D-001/control-001/cores/control_collection_shard1_replica_n1/data/]
[junit4] 2> 596265 INFO (qtp1214423196-8022) [n:127.0.0.1:38511_ c:control_collection s:shard1 x:control_collection_shard1_replica_n1 ] o.a.s.u.RandomMergePolicy RandomMergePolicy wrapping class org.apache.lucene.index.LogByteSizeMergePolicy: [LogByteSizeMergePolicy: minMergeSize=1677721, mergeFactor=36, maxMergeSize=2147483648, maxMergeSizeForForcedMerge=9223372036854775807, calibrateSizeByDeletes=true, maxMergeDocs=2147483647, maxCFSSegmentSizeMB=8.796093022207999E12, noCFSRatio=0.5728291526760024]
[junit4] 2> 596267 WARN (qtp1214423196-8022) [n:127.0.0.1:38511_ c:control_collection s:shard1 x:control_collection_shard1_replica_n1 ] o.a.s.c.RequestHandlers INVALID paramSet a in requestHandler {type = requestHandler,name = /dump,class = DumpRequestHandler,attributes = {initParams=a, name=/dump, class=DumpRequestHandler},args = {defaults={a=A,b=B}}}
[junit4] 2> 596312 INFO (qtp1214423196-8022) [n:127.0.0.1:38511_ c:control_collection s:shard1 x:control_collection_shard1_replica_n1 ] o.a.s.u.UpdateHandler Using UpdateLog implementation: org.apache.solr.update.UpdateLog
[junit4] 2> 596312 INFO (qtp1214423196-8022) [n:127.0.0.1:38511_ c:control_collection s:shard1 x:control_collection_shard1_replica_n1 ] o.a.s.u.UpdateLog Initializing UpdateLog: dataDir= defaultSyncLevel=FLUSH numRecordsToKeep=100 maxNumLogsToKeep=10 numVersionBuckets=65536
[junit4] 2> 596313 INFO (qtp1214423196-8022) [n:127.0.0.1:38511_ c:control_collection s:shard1 x:control_collection_shard1_replica_n1 ] o.a.s.u.CommitTracker Hard AutoCommit: disabled
[junit4] 2> 596313 INFO (qtp1214423196-8022) [n:127.0.0.1:38511_ c:control_collection s:shard1 x:control_collection_shard1_replica_n1 ] o.a.s.u.CommitTracker Soft AutoCommit: disabled
[junit4] 2> 596314 INFO (qtp1214423196-8022) [n:127.0.0.1:38511_ c:control_collection s:shard1 x:control_collection_shard1_replica_n1 ] o.a.s.u.RandomMergePolicy RandomMergePolicy wrapping class org.apache.lucene.index.LogByteSizeMergePolicy: [LogByteSizeMergePolicy: minMergeSize=1677721, mergeFactor=41, maxMergeSize=2147483648, maxMergeSizeForForcedMerge=9223372036854775807, calibrateSizeByDeletes=false, maxMergeDocs=2147483647, maxCFSSegmentSizeMB=8.796093022207999E12, noCFSRatio=1.0]
[junit4] 2> 596315 INFO (qtp1214423196-8022) [n:127.0.0.1:38511_ c:control_collection s:shard1 x:control_collection_shard1_replica_n1 ] o.a.s.s.SolrIndexSearcher Opening [Searcher@3a5f4e9a[control_collection_shard1_replica_n1] main]
[junit4] 2> 596316 INFO (qtp1214423196-8022) [n:127.0.0.1:38511_ c:control_collection s:shard1 x:control_collection_shard1_replica_n1 ] o.a.s.r.ManagedResourceStorage Configured ZooKeeperStorageIO with znodeBase: /configs/conf1
[junit4] 2> 596316 INFO (qtp1214423196-8022) [n:127.0.0.1:38511_ c:control_collection s:shard1 x:control_collection_shard1_replica_n1 ] o.a.s.r.ManagedResourceStorage Loaded null at path _rest_managed.json using ZooKeeperStorageIO:path=/configs/conf1
[junit4] 2> 596316 INFO (qtp1214423196-8022) [n:127.0.0.1:38511_ c:control_collection s:shard1 x:control_collection_shard1_replica_n1 ] o.a.s.h.ReplicationHandler Commits will be reserved for 10000ms.
[junit4] 2> 596317 INFO (qtp1214423196-8022) [n:127.0.0.1:38511_ c:control_collection s:shard1 x:control_collection_shard1_replica_n1 ] o.a.s.u.UpdateLog Could not find max version in index or recent updates, using new clock 1648103347977191424
[junit4] 2> 596319 INFO (searcherExecutor-2923-thread-1-processing-n:127.0.0.1:38511_ x:control_collection_shard1_replica_n1 c:control_collection s:shard1) [n:127.0.0.1:38511_ c:control_collection s:shard1 x:control_collection_shard1_replica_n1 ] o.a.s.c.SolrCore [control_collection_shard1_replica_n1] Registered new searcher Searcher@3a5f4e9a[control_collection_shard1_replica_n1] main{ExitableDirectoryReader(UninvertingDirectoryReader())}
[junit4] 2> 596324 INFO (qtp1214423196-8022) [n:127.0.0.1:38511_ c:control_collection s:shard1 x:control_collection_shard1_replica_n1 ] o.a.s.c.ZkShardTerms Successful update of terms at /collections/control_collection/terms/shard1 to Terms{values={core_node2=0}, version=0}
[junit4] 2> 596324 INFO (qtp1214423196-8022) [n:127.0.0.1:38511_ c:control_collection s:shard1 x:control_collection_shard1_replica_n1 ] o.a.s.c.ShardLeaderElectionContextBase make sure parent is created /collections/control_collection/leaders/shard1
[junit4] 2> 596326 INFO (qtp1214423196-8022) [n:127.0.0.1:38511_ c:control_collection s:shard1 x:control_collection_shard1_replica_n1 ] o.a.s.c.ShardLeaderElectionContext Enough replicas found to continue.
[junit4] 2> 596326 INFO (qtp1214423196-8022) [n:127.0.0.1:38511_ c:control_collection s:shard1 x:control_collection_shard1_replica_n1 ] o.a.s.c.ShardLeaderElectionContext I may be the new leader - try and sync
[junit4] 2> 596327 INFO (qtp1214423196-8022) [n:127.0.0.1:38511_ c:control_collection s:shard1 x:control_collection_shard1_replica_n1 ] o.a.s.c.SyncStrategy Sync replicas to https://127.0.0.1:38511/control_collection_shard1_replica_n1/
[junit4] 2> 596330 INFO (qtp1214423196-8022) [n:127.0.0.1:38511_ c:control_collection s:shard1 x:control_collection_shard1_replica_n1 ] o.a.s.c.SyncStrategy Sync Success - now sync replicas to me
[junit4] 2> 596330 INFO (qtp1214423196-8022) [n:127.0.0.1:38511_ c:control_collection s:shard1 x:control_collection_shard1_replica_n1 ] o.a.s.c.SyncStrategy https://127.0.0.1:38511/control_collection_shard1_replica_n1/ has no replicas
[junit4] 2> 596330 INFO (qtp1214423196-8022) [n:127.0.0.1:38511_ c:control_collection s:shard1 x:control_collection_shard1_replica_n1 ] o.a.s.c.ShardLeaderElectionContextBase Creating leader registration node /collections/control_collection/leaders/shard1/leader after winning as /collections/control_collection/leader_elect/shard1/election/72351927552835589-core_node2-n_0000000000
[junit4] 2> 596332 INFO (qtp1214423196-8022) [n:127.0.0.1:38511_ c:control_collection s:shard1 x:control_collection_shard1_replica_n1 ] o.a.s.c.ShardLeaderElectionContext I am the new leader: https://127.0.0.1:38511/control_collection_shard1_replica_n1/ shard1
[junit4] 2> 596433 INFO (zkCallback-2641-thread-1) [ ] o.a.s.c.c.ZkStateReader A cluster state change: [WatchedEvent state:SyncConnected type:NodeDataChanged path:/collections/control_collection/state.json] for collection [control_collection] has occurred - updating... (live nodes size: [1])
[junit4] 2> 596434 INFO (qtp1214423196-8022) [n:127.0.0.1:38511_ c:control_collection s:shard1 x:control_collection_shard1_replica_n1 ] o.a.s.c.ZkController I am the leader, no recovery necessary
[junit4] 2> 596442 INFO (zkCallback-2641-thread-2) [ ] o.a.s.c.c.ZkStateReader A cluster state change: [WatchedEvent state:SyncConnected type:NodeDataChanged path:/collections/control_collection/state.json] for collection [control_collection] has occurred - updating... (live nodes size: [1])
[junit4] 2> 596543 INFO (zkCallback-2641-thread-1) [ ] o.a.s.c.c.ZkStateReader A cluster state change: [WatchedEvent state:SyncConnected type:NodeDataChanged path:/collections/control_collection/state.json] for collection [control_collection] has occurred - updating... (live nodes size: [1])
[junit4] 2> 596543 INFO (zkCallback-2641-thread-2) [ ] o.a.s.c.c.ZkStateReader A cluster state change: [WatchedEvent state:SyncConnected type:NodeDataChanged path:/collections/control_collection/state.json] for collection [control_collection] has occurred - updating... (live nodes size: [1])
[junit4] 2> 596543 INFO (zkCallback-2641-thread-3) [ ] o.a.s.c.c.ZkStateReader A cluster state change: [WatchedEvent state:SyncConnected type:NodeDataChanged path:/collections/control_collection/state.json] for collection [control_collection] has occurred - updating... (live nodes size: [1])
[junit4] 2> 596568 INFO (qtp1214423196-8022) [n:127.0.0.1:38511_ c:control_collection s:shard1 x:control_collection_shard1_replica_n1 ] o.a.s.s.HttpSolrCall [admin] webapp=null path=/admin/cores params={qt=/admin/cores&collection.configName=conf1&newCollection=true&name=control_collection_shard1_replica_n1&action=CREATE&numShards=1&collection=control_collection&shard=shard1&wt=javabin&version=2&replicaType=NRT} status=0 QTime=1621
[junit4] 2> 596570 INFO (qtp1214423196-8023) [n:127.0.0.1:38511_ ] o.a.s.h.a.CollectionsHandler Wait for new collection to be active for at most 45 seconds. Check all shard replicas
[junit4] 2> 596570 INFO (qtp1214423196-8023) [n:127.0.0.1:38511_ ] o.a.s.s.HttpSolrCall [admin] webapp=null path=/admin/collections params={collection.configName=conf1&name=control_collection&nrtReplicas=1&action=CREATE&numShards=1&createNodeSet=127.0.0.1:38511_&wt=javabin&version=2} status=0 QTime=1746
[junit4] 2> 596570 INFO (TEST-SyncSliceTest.test-seed#[8F0203D7A8942E0D]) [ ] o.a.s.c.AbstractFullDistribZkTestBase Waiting to see 1 active replicas in collection: control_collection
[junit4] 2> 596681 INFO (TEST-SyncSliceTest.test-seed#[8F0203D7A8942E0D]) [ ] o.a.s.c.c.ConnectionManager Waiting for client to connect to ZooKeeper
[junit4] 2> 596681 INFO (zkConnectionManagerCallback-2657-thread-1) [ ] o.a.s.c.c.ConnectionManager zkClient has connected
[junit4] 2> 596681 INFO (TEST-SyncSliceTest.test-seed#[8F0203D7A8942E0D]) [ ] o.a.s.c.c.ConnectionManager Client is connected to ZooKeeper
[junit4] 2> 596682 INFO (TEST-SyncSliceTest.test-seed#[8F0203D7A8942E0D]) [ ] o.a.s.c.c.ZkStateReader Updated live nodes from ZooKeeper... (0) -> (1)
[junit4] 2> 596684 INFO (TEST-SyncSliceTest.test-seed#[8F0203D7A8942E0D]) [ ] o.a.s.c.s.i.ZkClientClusterStateProvider Cluster at 127.0.0.1:37493/solr ready
[junit4] 2> 596684 INFO (TEST-SyncSliceTest.test-seed#[8F0203D7A8942E0D]) [ ] o.a.s.c.ChaosMonkey monkey: init - expire sessions:false cause connection loss:false
[junit4] 2> 596702 INFO (qtp1214423196-8024) [n:127.0.0.1:38511_ ] o.a.s.h.a.CollectionsHandler Invoked Collection Action :create with params collection.configName=conf1&name=collection1&nrtReplicas=1&action=CREATE&numShards=1&createNodeSet=&stateFormat=2&wt=javabin&version=2 and sendToOCPQueue=true
[junit4] 2> 596731 INFO (OverseerCollectionConfigSetProcessor-72351927552835589-127.0.0.1:38511_-n_0000000000) [n:127.0.0.1:38511_ ] o.a.s.c.OverseerTaskQueue Response ZK path: /overseer/collection-queue-work/qnr-0000000000 doesn't exist. Requestor may have disconnected from ZooKeeper
[junit4] 2> 596731 INFO (OverseerThreadFactory-2918-thread-2-processing-n:127.0.0.1:38511_) [n:127.0.0.1:38511_ ] o.a.s.c.a.c.CreateCollectionCmd Create collection collection1
[junit4] 2> 596934 WARN (OverseerThreadFactory-2918-thread-2-processing-n:127.0.0.1:38511_) [n:127.0.0.1:38511_ ] o.a.s.c.a.c.CreateCollectionCmd It is unusual to create a collection (collection1) without cores.
[junit4] 2> 596937 INFO (qtp1214423196-8024) [n:127.0.0.1:38511_ ] o.a.s.h.a.CollectionsHandler Wait for new collection to be active for at most 45 seconds. Check all shard replicas
[junit4] 2> 596938 INFO (qtp1214423196-8024) [n:127.0.0.1:38511_ ] o.a.s.s.HttpSolrCall [admin] webapp=null path=/admin/collections params={collection.configName=conf1&name=collection1&nrtReplicas=1&action=CREATE&numShards=1&createNodeSet=&stateFormat=2&wt=javabin&version=2} status=0 QTime=236
[junit4] 2> 596954 INFO (TEST-SyncSliceTest.test-seed#[8F0203D7A8942E0D]) [ ] o.a.s.c.SolrCloudTestCase active slice count: 1 expected:1
[junit4] 2> 596954 INFO (TEST-SyncSliceTest.test-seed#[8F0203D7A8942E0D]) [ ] o.a.s.c.SolrCloudTestCase active replica count: 0 expected replica count: 0
[junit4] 2> 596954 INFO (TEST-SyncSliceTest.test-seed#[8F0203D7A8942E0D]) [ ] o.a.s.c.SolrCloudTestCase active slice count: 1 expected:1
[junit4] 2> 596954 INFO (TEST-SyncSliceTest.test-seed#[8F0203D7A8942E0D]) [ ] o.a.s.c.SolrCloudTestCase active replica count: 0 expected replica count: 0
[junit4] 2> 596955 INFO (TEST-SyncSliceTest.test-seed#[8F0203D7A8942E0D]) [ ] o.a.s.c.SolrCloudTestCase active slice count: 1 expected:1
[junit4] 2> 596955 INFO (TEST-SyncSliceTest.test-seed#[8F0203D7A8942E0D]) [ ] o.a.s.c.SolrCloudTestCase active replica count: 0 expected replica count: 0
[junit4] 2> 596955 INFO (TEST-SyncSliceTest.test-seed#[8F0203D7A8942E0D]) [ ] o.a.s.c.AbstractFullDistribZkTestBase Creating jetty instances pullReplicaCount=0 numOtherReplicas=4
[junit4] 2> 597127 INFO (TEST-SyncSliceTest.test-seed#[8F0203D7A8942E0D]) [ ] o.a.s.c.AbstractFullDistribZkTestBase create jetty 1 in directory /home/jenkins/workspace/Lucene-Solr-master-Linux/solr/build/solr-core/test/J1/temp/solr.cloud.SyncSliceTest_8F0203D7A8942E0D-001/shard-1-001 of type NRT
[junit4] 2> 597149 WARN (closeThreadPool-2658-thread-1) [ ] o.e.j.s.AbstractConnector Ignoring deprecated socket close linger time
[junit4] 2> 597149 INFO (closeThreadPool-2658-thread-1) [ ] o.a.s.c.s.e.JettySolrRunner Start Jetty (configured port=0, binding port=0)
[junit4] 2> 597149 INFO (closeThreadPool-2658-thread-1) [ ] o.a.s.c.s.e.JettySolrRunner Trying to start Jetty on port 0 try number 1 ...
[junit4] 2> 597149 INFO (closeThreadPool-2658-thread-1) [ ] o.e.j.s.Server jetty-9.4.19.v20190610; built: 2019-06-10T16:30:51.723Z; git: afcf563148970e98786327af5e07c261fda175d3; jvm 12.0.1+12
[junit4] 2> 597214 INFO (closeThreadPool-2658-thread-1) [ ] o.e.j.s.session DefaultSessionIdManager workerName=node0
[junit4] 2> 597214 INFO (closeThreadPool-2658-thread-1) [ ] o.e.j.s.session No SessionScavenger set, using defaults
[junit4] 2> 597214 INFO (closeThreadPool-2658-thread-1) [ ] o.e.j.s.session node0 Scavenging every 660000ms
[junit4] 2> 597222 INFO (closeThreadPool-2658-thread-1) [ ] o.e.j.s.h.ContextHandler Started o.e.j.s.ServletContextHandler@1357961e{/,null,AVAILABLE}
[junit4] 2> 597237 INFO (closeThreadPool-2658-thread-1) [ ] o.e.j.s.AbstractConnector Started ServerConnector@6d8e67f2{ssl,[ssl, alpn, http/1.1, h2]}{127.0.0.1:35937}
[junit4] 2> 597237 INFO (closeThreadPool-2658-thread-1) [ ] o.e.j.s.Server Started @597275ms
[junit4] 2> 597238 INFO (closeThreadPool-2658-thread-1) [ ] o.a.s.c.s.e.JettySolrRunner Jetty properties: {hostContext=/, solrconfig=solrconfig.xml, solr.data.dir=/home/jenkins/workspace/Lucene-Solr-master-Linux/solr/build/solr-core/test/J1/temp/solr.cloud.SyncSliceTest_8F0203D7A8942E0D-001/tempDir-001/jetty1, hostPort=35937, coreRootDirectory=/home/jenkins/workspace/Lucene-Solr-master-Linux/solr/build/solr-core/test/J1/../../../../../../../../../home/jenkins/workspace/Lucene-Solr-master-Linux/solr/build/solr-core/test/J1/temp/solr.cloud.SyncSliceTest_8F0203D7A8942E0D-001/shard-1-001/cores}
[junit4] 2> 597238 ERROR (closeThreadPool-2658-thread-1) [ ] o.a.s.u.StartupLoggingUtils Missing Java Option solr.log.dir. Logging may be missing or incomplete.
[junit4] 2> 597238 INFO (closeThreadPool-2658-thread-1) [ ] o.a.s.s.SolrDispatchFilter Using logger factory org.apache.logging.slf4j.Log4jLoggerFactory
[junit4] 2> 597238 INFO (closeThreadPool-2658-thread-1) [ ] o.a.s.s.SolrDispatchFilter ___ _ Welcome to Apache Solr™ version 9.0.0
[junit4] 2> 597238 INFO (closeThreadPool-2658-thread-1) [ ] o.a.s.s.SolrDispatchFilter / __| ___| |_ _ Starting in cloud mode on port null
[junit4] 2> 597238 INFO (closeThreadPool-2658-thread-1) [ ] o.a.s.s.SolrDispatchFilter \__ \/ _ \ | '_| Install dir: null
[junit4] 2> 597238 INFO (closeThreadPool-2658-thread-1) [ ] o.a.s.s.SolrDispatchFilter |___/\___/_|_| Start time: 2019-10-22T14:17:14.670470Z
[junit4] 2> 597266 INFO (closeThreadPool-2658-thread-1) [ ] o.a.s.c.c.ConnectionManager Waiting for client to connect to ZooKeeper
[junit4] 2> 597269 INFO (TEST-SyncSliceTest.test-seed#[8F0203D7A8942E0D]) [ ] o.a.s.c.AbstractFullDistribZkTestBase create jetty 2 in directory /home/jenkins/workspace/Lucene-Solr-master-Linux/solr/build/solr-core/test/J1/temp/solr.cloud.SyncSliceTest_8F0203D7A8942E0D-001/shard-2-001 of type NRT
[junit4] 2> 597280 WARN (closeThreadPool-2658-thread-2) [ ] o.e.j.s.AbstractConnector Ignoring deprecated socket close linger time
[junit4] 2> 597280 INFO (closeThreadPool-2658-thread-2) [ ] o.a.s.c.s.e.JettySolrRunner Start Jetty (configured port=0, binding port=0)
[junit4] 2> 597280 INFO (closeThreadPool-2658-thread-2) [ ] o.a.s.c.s.e.JettySolrRunner Trying to start Jetty on port 0 try number 1 ...
[junit4] 2> 597280 INFO (closeThreadPool-2658-thread-2) [ ] o.e.j.s.Server jetty-9.4.19.v20190610; built: 2019-06-10T16:30:51.723Z; git: afcf563148970e98786327af5e07c261fda175d3; jvm 12.0.1+12
[junit4] 2> 597282 INFO (zkConnectionManagerCallback-2660-thread-1) [ ] o.a.s.c.c.ConnectionManager zkClient has connected
[junit4] 2> 597282 INFO (closeThreadPool-2658-thread-1) [ ] o.a.s.c.c.ConnectionManager Client is connected to ZooKeeper
[junit4] 2> 597383 INFO (closeThreadPool-2658-thread-2) [ ] o.e.j.s.session DefaultSessionIdManager workerName=node0
[junit4] 2> 597383 INFO (closeThreadPool-2658-thread-2) [ ] o.e.j.s.session No SessionScavenger set, using defaults
[junit4] 2> 597383 INFO (closeThreadPool-2658-thread-2) [ ] o.e.j.s.session node0 Scavenging every 600000ms
[junit4] 2> 597383 INFO (closeThreadPool-2658-thread-1) [ ] o.a.s.s.SolrDispatchFilter Loading solr.xml from SolrHome (not found in ZooKeeper)
[junit4] 2> 597383 INFO (closeThreadPool-2658-thread-1) [ ] o.a.s.c.SolrXmlConfig Loading container configuration from /home/jenkins/workspace/Lucene-Solr-master-Linux/solr/build/solr-core/test/J1/temp/solr.cloud.SyncSliceTest_8F0203D7A8942E0D-001/shard-1-001/solr.xml
[junit4] 2> 597391 INFO (closeThreadPool-2658-thread-1) [ ] o.a.s.c.SolrXmlConfig Configuration parameter autoReplicaFailoverWorkLoopDelay is ignored
[junit4] 2> 597391 INFO (closeThreadPool-2658-thread-1) [ ] o.a.s.c.SolrXmlConfig Configuration parameter autoReplicaFailoverBadNodeExpiration is ignored
[junit4] 2> 597392 INFO (closeThreadPool-2658-thread-1) [ ] o.a.s.c.SolrXmlConfig MBean server found: com.sun.jmx.mbeanserver.JmxMBeanServer@6b331ff7, but no JMX reporters were configured - adding default JMX reporter.
[junit4] 2> 597399 INFO (closeThreadPool-2658-thread-2) [ ] o.e.j.s.h.ContextHandler Started o.e.j.s.ServletContextHandler@62d77dbd{/,null,AVAILABLE}
[junit4] 2> 597400 INFO (closeThreadPool-2658-thread-2) [ ] o.e.j.s.AbstractConnector Started ServerConnector@9dccd6e{ssl,[ssl, alpn, http/1.1, h2]}{127.0.0.1:44493}
[junit4] 2> 597400 INFO (closeThreadPool-2658-thread-2) [ ] o.e.j.s.Server Started @597437ms
[junit4] 2> 597400 INFO (closeThreadPool-2658-thread-2) [ ] o.a.s.c.s.e.JettySolrRunner Jetty properties: {hostContext=/, solrconfig=solrconfig.xml, solr.data.dir=/home/jenkins/workspace/Lucene-Solr-master-Linux/solr/build/solr-core/test/J1/temp/solr.cloud.SyncSliceTest_8F0203D7A8942E0D-001/tempDir-001/jetty2, hostPort=44493, coreRootDirectory=/home/jenkins/workspace/Lucene-Solr-master-Linux/solr/build/solr-core/test/J1/../../../../../../../../../home/jenkins/workspace/Lucene-Solr-master-Linux/solr/build/solr-core/test/J1/temp/solr.cloud.SyncSliceTest_8F0203D7A8942E0D-001/shard-2-001/cores}
[junit4] 2> 597400 ERROR (closeThreadPool-2658-thread-2) [ ] o.a.s.u.StartupLoggingUtils Missing Java Option solr.log.dir. Logging may be missing or incomplete.
[junit4] 2> 597400 INFO (closeThreadPool-2658-thread-2) [ ] o.a.s.s.SolrDispatchFilter Using logger factory org.apache.logging.slf4j.Log4jLoggerFactory
[junit4] 2> 597405 INFO (closeThreadPool-2658-thread-2) [ ] o.a.s.s.SolrDispatchFilter ___ _ Welcome to Apache Solr™ version 9.0.0
[junit4] 2> 597405 INFO (closeThreadPool-2658-thread-2) [ ] o.a.s.s.SolrDispatchFilter / __| ___| |_ _ Starting in cloud mode on port null
[junit4] 2> 597405 INFO (closeThreadPool-2658-thread-2) [ ] o.a.s.s.SolrDispatchFilter \__ \/ _ \ | '_| Install dir: null
[junit4] 2> 597405 INFO (closeThreadPool-2658-thread-2) [ ] o.a.s.s.SolrDispatchFilter |___/\___/_|_| Start time: 2019-10-22T14:17:14.837577Z
[junit4] 2> 597450 INFO (closeThreadPool-2658-thread-2) [ ] o.a.s.c.c.ConnectionManager Waiting for client to connect to ZooKeeper
[junit4] 2> 597456 INFO (zkConnectionManagerCallback-2663-thread-1) [ ] o.a.s.c.c.ConnectionManager zkClient has connected
[junit4] 2> 597456 INFO (closeThreadPool-2658-thread-2) [ ] o.a.s.c.c.ConnectionManager Client is connected to ZooKeeper
[junit4] 2> 597467 INFO (TEST-SyncSliceTest.test-seed#[8F0203D7A8942E0D]) [ ] o.a.s.c.AbstractFullDistribZkTestBase create jetty 3 in directory /home/jenkins/workspace/Lucene-Solr-master-Linux/solr/build/solr-core/test/J1/temp/solr.cloud.SyncSliceTest_8F0203D7A8942E0D-001/shard-3-001 of type NRT
[junit4] 2> 597490 WARN (closeThreadPool-2658-thread-3) [ ] o.e.j.s.AbstractConnector Ignoring deprecated socket close linger time
[junit4] 2> 597490 INFO (closeThreadPool-2658-thread-3) [ ] o.a.s.c.s.e.JettySolrRunner Start Jetty (configured port=0, binding port=0)
[junit4] 2> 597490 INFO (closeThreadPool-2658-thread-3) [ ] o.a.s.c.s.e.JettySolrRunner Trying to start Jetty on port 0 try number 1 ...
[junit4] 2> 597490 INFO (closeThreadPool-2658-thread-3) [ ] o.e.j.s.Server jetty-9.4.19.v20190610; built: 2019-06-10T16:30:51.723Z; git: afcf563148970e98786327af5e07c261fda175d3; jvm 12.0.1+12
[junit4] 2> 597557 INFO (closeThreadPool-2658-thread-2) [ ] o.a.s.s.SolrDispatchFilter Loading solr.xml from SolrHome (not found in ZooKeeper)
[junit4] 2> 597557 INFO (closeThreadPool-2658-thread-2) [ ] o.a.s.c.SolrXmlConfig Loading container configuration from /home/jenkins/workspace/Lucene-Solr-master-Linux/solr/build/solr-core/test/J1/temp/solr.cloud.SyncSliceTest_8F0203D7A8942E0D-001/shard-2-001/solr.xml
[junit4] 2> 597560 INFO (closeThreadPool-2658-thread-2) [ ] o.a.s.c.SolrXmlConfig Configuration parameter autoReplicaFailoverWorkLoopDelay is ignored
[junit4] 2> 597560 INFO (closeThreadPool-2658-thread-2) [ ] o.a.s.c.SolrXmlConfig Configuration parameter autoReplicaFailoverBadNodeExpiration is ignored
[junit4] 2> 597561 INFO (closeThreadPool-2658-thread-2) [ ] o.a.s.c.SolrXmlConfig MBean server found: com.sun.jmx.mbeanserver.JmxMBeanServer@6b331ff7, but no JMX reporters were configured - adding default JMX reporter.
[junit4] 2> 597586 INFO (closeThreadPool-2658-thread-3) [ ] o.e.j.s.session DefaultSessionIdManager workerName=node0
[junit4] 2> 597586 INFO (closeThreadPool-2658-thread-3) [ ] o.e.j.s.session No SessionScavenger set, using defaults
[junit4] 2> 597586 INFO (closeThreadPool-2658-thread-3) [ ] o.e.j.s.session node0 Scavenging every 660000ms
[junit4] 2> 597594 INFO (closeThreadPool-2658-thread-3) [ ] o.e.j.s.h.ContextHandler Started o.e.j.s.ServletContextHandler@28658058{/,null,AVAILABLE}
[junit4] 2> 597595 INFO (closeThreadPool-2658-thread-3) [ ] o.e.j.s.AbstractConnector Started ServerConnector@51933046{ssl,[ssl, alpn, http/1.1, h2]}{127.0.0.1:41197}
[junit4] 2> 597595 INFO (closeThreadPool-2658-thread-3) [ ] o.e.j.s.Server Started @597633ms
[junit4] 2> 597595 INFO (closeThreadPool-2658-thread-3) [ ] o.a.s.c.s.e.JettySolrRunner Jetty properties: {hostContext=/, solrconfig=solrconfig.xml, solr.data.dir=/home/jenkins/workspace/Lucene-Solr-master-Linux/solr/build/solr-core/test/J1/temp/solr.cloud.SyncSliceTest_8F0203D7A8942E0D-001/tempDir-001/jetty3, hostPort=41197, coreRootDirectory=/home/jenkins/workspace/Lucene-Solr-master-Linux/solr/build/solr-core/test/J1/../../../../../../../../../home/jenkins/workspace/Lucene-Solr-master-Linux/solr/build/solr-core/test/J1/temp/solr.cloud.SyncSliceTest_8F0203D7A8942E0D-001/shard-3-001/cores}
[junit4] 2> 597596 ERROR (closeThreadPool-2658-thread-3) [ ] o.a.s.u.StartupLoggingUtils Missing Java Option solr.log.dir. Logging may be missing or incomplete.
[junit4] 2> 597596 INFO (closeThreadPool-2658-thread-3) [ ] o.a.s.s.SolrDispatchFilter Using logger factory org.apache.logging.slf4j.Log4jLoggerFactory
[junit4] 2> 597596 INFO (closeThreadPool-2658-thread-3) [ ] o.a.s.s.SolrDispatchFilter ___ _ Welcome to Apache Solr™ version 9.0.0
[junit4] 2> 597596 INFO (closeThreadPool-2658-thread-3) [ ] o.a.s.s.SolrDispatchFilter / __| ___| |_ _ Starting in cloud mode on port null
[junit4] 2> 597596 INFO (closeThreadPool-2658-thread-3) [ ] o.a.s.s.SolrDispatchFilter \__ \/ _ \ | '_| Install dir: null
[junit4] 2> 597596 INFO (closeThreadPool-2658-thread-3) [ ] o.a.s.s.SolrDispatchFilter |___/\___/_|_| Start time: 2019-10-22T14:17:15.028377Z
[junit4] 2> 597606 INFO (closeThreadPool-2658-thread-3) [ ] o.a.s.c.c.ConnectionManager Waiting for client to connect to ZooKeeper
[junit4] 2> 597612 INFO (TEST-SyncSliceTest.test-seed#[8F0203D7A8942E0D]) [ ] o.a.s.c.AbstractFullDistribZkTestBase create jetty 4 in directory /home/jenkins/workspace/Lucene-Solr-master-Linux/solr/build/solr-core/test/J1/temp/solr.cloud.SyncSliceTest_8F0203D7A8942E0D-001/shard-4-001 of type NRT
[junit4] 2> 597612 INFO (zkConnectionManagerCallback-2666-thread-1) [ ] o.a.s.c.c.ConnectionManager zkClient has connected
[junit4] 2> 597612 INFO (closeThreadPool-2658-thread-3) [ ] o.a.s.c.c.ConnectionManager Client is connected to ZooKeeper
[junit4] 2> 597617 WARN (closeThreadPool-2658-thread-4) [ ] o.e.j.s.AbstractConnector Ignoring deprecated socket close linger time
[junit4] 2> 597617 INFO (closeThreadPool-2658-thread-4) [ ] o.a.s.c.s.e.JettySolrRunner Start Jetty (configured port=0, binding port=0)
[junit4] 2> 597617 INFO (closeThreadPool-2658-thread-4) [ ] o.a.s.c.s.e.JettySolrRunner Trying to start Jetty on port 0 try number 1 ...
[junit4] 2> 597617 INFO (closeThreadPool-2658-thread-4) [ ] o.e.j.s.Server jetty-9.4.19.v20190610; built: 2019-06-10T16:30:51.723Z; git: afcf563148970e98786327af5e07c261fda175d3; jvm 12.0.1+12
[junit4] 2> 597648 INFO (closeThreadPool-2658-thread-1) [ ] o.a.s.h.c.HttpShardHandlerFactory Host whitelist initialized: WhitelistHostChecker [whitelistHosts=null, whitelistHostCheckingEnabled=false]
[junit4] 2> 597709 WARN (closeThreadPool-2658-thread-1) [ ] o.e.j.u.s.S.config Trusting all certificates configured for Client@5da32e6d[provider=null,keyStore=null,trustStore=null]
[junit4] 2> 597709 WARN (closeThreadPool-2658-thread-1) [ ] o.e.j.u.s.S.config No Client EndPointIdentificationAlgorithm configured for Client@5da32e6d[provider=null,keyStore=null,trustStore=null]
[junit4] 2> 597713 INFO (closeThreadPool-2658-thread-3) [ ] o.a.s.s.SolrDispatchFilter Loading solr.xml from SolrHome (not found in ZooKeeper)
[junit4] 2> 597713 INFO (closeThreadPool-2658-thread-3) [ ] o.a.s.c.SolrXmlConfig Loading container configuration from /home/jenkins/workspace/Lucene-Solr-master-Linux/solr/build/solr-core/test/J1/temp/solr.cloud.SyncSliceTest_8F0203D7A8942E0D-001/shard-3-001/solr.xml
[junit4] 2> 597747 INFO (closeThreadPool-2658-thread-4) [ ] o.e.j.s.session DefaultSessionIdManager workerName=node0
[junit4] 2> 597747 INFO (closeThreadPool-2658-thread-4) [ ] o.e.j.s.session No SessionScavenger set, using defaults
[junit4] 2> 597747 INFO (closeThreadPool-2658-thread-4) [ ] o.e.j.s.session node0 Scavenging every 600000ms
[junit4] 2> 597750 INFO (closeThreadPool-2658-thread-3) [ ] o.a.s.c.SolrXmlConfig Configuration parameter autoReplicaFailoverWorkLoopDelay is ignored
[junit4] 2> 597750 INFO (closeThreadPool-2658-thread-3) [ ] o.a.s.c.SolrXmlConfig Configuration parameter autoReplicaFailoverBadNodeExpiration is ignored
[junit4] 2> 597751 INFO (closeThreadPool-2658-thread-3) [ ] o.a.s.c.SolrXmlConfig MBean server found: com.sun.jmx.mbeanserver.JmxMBeanServer@6b331ff7, but no JMX reporters were configured - adding default JMX reporter.
[junit4] 2> 597809 WARN (closeThreadPool-2658-thread-1) [ ] o.e.j.u.s.S.config Trusting all certificates configured for Client@149bbc7[provider=null,keyStore=null,trustStore=null]
[junit4] 2> 597809 WARN (closeThreadPool-2658-thread-1) [ ] o.e.j.u.s.S.config No Client EndPointIdentificationAlgorithm configured for Client@149bbc7[provider=null,keyStore=null,trustStore=null]
[junit4] 2> 597811 INFO (closeThreadPool-2658-thread-1) [ ] o.a.s.c.ZkContainer Zookeeper client=127.0.0.1:37493/solr
[junit4] 2> 597818 INFO (closeThreadPool-2658-thread-4) [ ] o.e.j.s.h.ContextHandler Started o.e.j.s.ServletContextHandler@3321504b{/,null,AVAILABLE}
[junit4] 2> 597819 INFO (closeThreadPool-2658-thread-4) [ ] o.e.j.s.AbstractConnector Started ServerConnector@5043aa6d{ssl,[ssl, alpn, http/1.1, h2]}{127.0.0.1:45043}
[junit4] 2> 597819 INFO (closeThreadPool-2658-thread-4) [ ] o.e.j.s.Server Started @597857ms
[junit4] 2> 597819 INFO (closeThreadPool-2658-thread-4) [ ] o.a.s.c.s.e.JettySolrRunner Jetty properties: {hostContext=/, solrconfig=solrconfig.xml, solr.data.dir=/home/jenkins/workspace/Lucene-Solr-master-Linux/solr/build/solr-core/test/J1/temp/solr.cloud.SyncSliceTest_8F0203D7A8942E0D-001/tempDir-001/jetty4, hostPort=45043, coreRootDirectory=/home/jenkins/workspace/Lucene-Solr-master-Linux/solr/build/solr-core/test/J1/../../../../../../../../../home/jenkins/workspace/Lucene-Solr-master-Linux/solr/build/solr-core/test/J1/temp/solr.cloud.SyncSliceTest_8F0203D7A8942E0D-001/shard-4-001/cores}
[junit4] 2> 597820 ERROR (closeThreadPool-2658-thread-4) [ ] o.a.s.u.StartupLoggingUtils Missing Java Option solr.log.dir. Logging may be missing or incomplete.
[junit4] 2> 597820 INFO (closeThreadPool-2658-thread-4) [ ] o.a.s.s.SolrDispatchFilter Using logger factory org.apache.logging.slf4j.Log4jLoggerFactory
[junit4] 2> 597820 INFO (closeThreadPool-2658-thread-4) [ ] o.a.s.s.SolrDispatchFilter ___ _ Welcome to Apache Solr™ version 9.0.0
[junit4] 2> 597820 INFO (closeThreadPool-2658-thread-4) [ ] o.a.s.s.SolrDispatchFilter / __| ___| |_ _ Starting in cloud mode on port null
[junit4] 2> 597820 INFO (closeThreadPool-2658-thread-4) [ ] o.a.s.s.SolrDispatchFilter \__ \/ _ \ | '_| Install dir: null
[junit4] 2> 597820 INFO (closeThreadPool-2658-thread-4) [ ] o.a.s.s.SolrDispatchFilter |___/\___/_|_| Start time: 2019-10-22T14:17:15.252188Z
[junit4] 2> 597835 INFO (closeThreadPool-2658-thread-1) [ ] o.a.s.c.c.ConnectionManager Waiting for client to connect to ZooKeeper
[junit4] 2> 597855 INFO (closeThreadPool-2658-thread-4) [ ] o.a.s.c.c.ConnectionManager Waiting for client to connect to ZooKeeper
[junit4] 2> 597859 INFO (closeThreadPool-2658-thread-3) [ ] o.a.s.h.c.HttpShardHandlerFactory Host whitelist initialized: WhitelistHostChecker [whitelistHosts=null, whitelistHostCheckingEnabled=false]
[junit4] 2> 597865 INFO (zkConnectionManagerCallback-2673-thread-1) [ ] o.a.s.c.c.ConnectionManager zkClient has connected
[junit4] 2> 597865 INFO (closeThreadPool-2658-thread-1) [ ] o.a.s.c.c.ConnectionManager Client is connected to ZooKeeper
[junit4] 2> 597872 WARN (closeThreadPool-2658-thread-3) [ ] o.e.j.u.s.S.config Trusting all certificates configured for Client@2febeef2[provider=null,keyStore=null,trustStore=null]
[junit4] 2> 597872 WARN (closeThreadPool-2658-thread-3) [ ] o.e.j.u.s.S.config No Client EndPointIdentificationAlgorithm configured for Client@2febeef2[provider=null,keyStore=null,trustStore=null]
[junit4] 2> 597874 INFO (zkConnectionManagerCallback-2675-thread-1) [ ] o.a.s.c.c.ConnectionManager zkClient has connected
[junit4] 2> 597874 INFO (closeThreadPool-2658-thread-4) [ ] o.a.s.c.c.ConnectionManager Client is connected to ZooKeeper
[junit4] 2> 597926 WARN (closeThreadPool-2658-thread-3) [ ] o.e.j.u.s.S.config Trusting all certificates configured for Client@13ac57ce[provider=null,keyStore=null,trustStore=null]
[junit4] 2> 597926 WARN (closeThreadPool-2658-thread-3) [ ] o.e.j.u.s.S.config No Client EndPointIdentificationAlgorithm configured for Client@13ac57ce[provider=null,keyStore=null,trustStore=null]
[junit4] 2> 597927 INFO (closeThreadPool-2658-thread-3) [ ] o.a.s.c.ZkContainer Zookeeper client=127.0.0.1:37493/solr
[junit4] 2> 597964 INFO (closeThreadPool-2658-thread-3) [ ] o.a.s.c.c.ConnectionManager Waiting for client to connect to ZooKeeper
[junit4] 2> 597970 INFO (zkConnectionManagerCallback-2681-thread-1) [ ] o.a.s.c.c.ConnectionManager zkClient has connected
[junit4] 2> 597970 INFO (closeThreadPool-2658-thread-3) [ ] o.a.s.c.c.ConnectionManager Client is connected to ZooKeeper
[junit4] 2> 597982 INFO (closeThreadPool-2658-thread-1) [n:127.0.0.1:35937_ ] o.a.s.c.c.ConnectionManager Waiting for client to connect to ZooKeeper
[junit4] 2> 598002 INFO (zkConnectionManagerCallback-2683-thread-1) [ ] o.a.s.c.c.ConnectionManager zkClient has connected
[junit4] 2> 598002 INFO (closeThreadPool-2658-thread-1) [n:127.0.0.1:35937_ ] o.a.s.c.c.ConnectionManager Client is connected to ZooKeeper
[junit4] 2> 598006 INFO (closeThreadPool-2658-thread-1) [n:127.0.0.1:35937_ ] o.a.s.c.c.ZkStateReader Updated live nodes from ZooKeeper... (0) -> (1)
[junit4] 2> 598008 INFO (closeThreadPool-2658-thread-1) [n:127.0.0.1:35937_ ] o.a.s.c.ZkController Publish node=127.0.0.1:35937_ as DOWN
[junit4] 2> 598009 INFO (closeThreadPool-2658-thread-1) [n:127.0.0.1:35937_ ] o.a.s.c.TransientSolrCoreCacheDefault Allocating transient cache for 4 transient cores
[junit4] 2> 598009 INFO (closeThreadPool-2658-thread-1) [n:127.0.0.1:35937_ ] o.a.s.c.ZkController Register node as live in ZooKeeper:/live_nodes/127.0.0.1:35937_
[junit4] 2> 598010 INFO (zkCallback-2641-thread-4) [ ] o.a.s.c.c.ZkStateReader Updated live nodes from ZooKeeper... (1) -> (2)
[junit4] 2> 598018 INFO (zkCallback-2656-thread-1) [ ] o.a.s.c.c.ZkStateReader Updated live nodes from ZooKeeper... (1) -> (2)
[junit4] 2> 598023 INFO (zkCallback-2682-thread-1) [ ] o.a.s.c.c.ZkStateReader Updated live nodes from ZooKeeper... (1) -> (2)
[junit4] 2> 598036 INFO (closeThreadPool-2658-thread-1) [n:127.0.0.1:35937_ ] o.a.s.h.a.MetricsHistoryHandler No .system collection, keeping metrics history in memory.
[junit4] 2> 598058 INFO (closeThreadPool-2658-thread-1) [n:127.0.0.1:35937_ ] o.a.s.m.r.SolrJmxReporter JMX monitoring for 'solr.node' (registry 'solr.node') enabled at server: com.sun.jmx.mbeanserver.JmxMBeanServer@6b331ff7
[junit4] 2> 598066 INFO (closeThreadPool-2658-thread-4) [ ] o.a.s.s.SolrDispatchFilter Loading solr.xml from SolrHome (not found in ZooKeeper)
[junit4] 2> 598066 INFO (closeThreadPool-2658-thread-4) [ ] o.a.s.c.SolrXmlConfig Loading container configuration from /home/jenkins/workspace/Lucene-Solr-master-Linux/solr/build/solr-core/test/J1/temp/solr.cloud.SyncSliceTest_8F0203D7A8942E0D-001/shard-4-001/solr.xml
[junit4] 2> 598069 INFO (closeThreadPool-2658-thread-4) [ ] o.a.s.c.SolrXmlConfig Configuration parameter autoReplicaFailoverWorkLoopDelay is ignored
[junit4] 2> 598069 INFO (closeThreadPool-2658-thread-4) [ ] o.a.s.c.SolrXmlConfig Configuration parameter autoReplicaFailoverBadNodeExpiration is ignored
[junit4] 2> 598069 INFO (closeThreadPool-2658-thread-1) [n:127.0.0.1:35937_ ] o.a.s.m.r.SolrJmxReporter JMX monitoring for 'solr.jvm' (registry 'solr.jvm') enabled at server: com.sun.jmx.mbeanserver.JmxMBeanServer@6b331ff7
[junit4] 2> 598069 INFO (closeThreadPool-2658-thread-1) [n:127.0.0.1:35937_ ] o.a.s.m.r.SolrJmxReporter JMX monitoring for 'solr.jetty' (registry 'solr.jetty') enabled at server: com.sun.jmx.mbeanserver.JmxMBeanServer@6b331ff7
[junit4] 2> 598070 INFO (closeThreadPool-2658-thread-4) [ ] o.a.s.c.SolrXmlConfig MBean server found: com.sun.jmx.mbeanserver.JmxMBeanServer@6b331ff7, but no JMX reporters were configured - adding default JMX reporter.
[junit4] 2> 598070 INFO (closeThreadPool-2658-thread-1) [n:127.0.0.1:35937_ ] o.a.s.c.CorePropertiesLocator Found 0 core definitions underneath /home/jenkins/workspace/Lucene-Solr-master-Linux/solr/build/solr-core/test/J1/../../../../../../../../../home/jenkins/workspace/Lucene-Solr-master-Linux/solr/build/solr-core/test/J1/temp/solr.cloud.SyncSliceTest_8F0203D7A8942E0D-001/shard-1-001/cores
[junit4] 2> 598092 INFO (closeThreadPool-2658-thread-1) [ ] o.a.s.c.AbstractFullDistribZkTestBase waitForLiveNode: 127.0.0.1:35937_
[junit4] 2> 598186 INFO (closeThreadPool-2658-thread-3) [n:127.0.0.1:41197_ ] o.a.s.c.c.ConnectionManager Waiting for client to connect to ZooKeeper
[junit4] 2> 598188 INFO (closeThreadPool-2658-thread-4) [ ] o.a.s.h.c.HttpShardHandlerFactory Host whitelist initialized: WhitelistHostChecker [whitelistHosts=null, whitelistHostCheckingEnabled=false]
[junit4] 2> 598189 WARN (closeThreadPool-2658-thread-4) [ ] o.e.j.u.s.S.config Trusting all certificates configured for Client@51e0ef78[provider=null,keyStore=null,trustStore=null]
[junit4] 2> 598189 WARN (closeThreadPool-2658-thread-4) [ ] o.e.j.u.s.S.config No Client EndPointIdentificationAlgorithm configured for Client@51e0ef78[provider=null,keyStore=null,trustStore=null]
[junit4] 2> 598194 INFO (zkConnectionManagerCallback-2690-thread-1) [ ] o.a.s.c.c.ConnectionManager zkClient has connected
[junit4] 2> 598194 INFO (closeThreadPool-2658-thread-3) [n:127.0.0.1:41197_ ] o.a.s.c.c.ConnectionManager Client is connected to ZooKeeper
[junit4] 2> 598197 INFO (closeThreadPool-2658-thread-3) [n:127.0.0.1:41197_ ] o.a.s.c.c.ZkStateReader Updated live nodes from ZooKeeper... (0) -> (2)
[junit4] 2> 598199 INFO (closeThreadPool-2658-thread-3) [n:127.0.0.1:41197_ ] o.a.s.c.ZkController Publish node=127.0.0.1:41197_ as DOWN
[junit4] 2> 598200 INFO (closeThreadPool-2658-thread-3) [n:127.0.0.1:41197_ ] o.a.s.c.TransientSolrCoreCacheDefault Allocating transient cache for 4 transient cores
[junit4] 2> 598200 INFO (closeThreadPool-2658-thread-3) [n:127.0.0.1:41197_ ] o.a.s.c.ZkController Register node as live in ZooKeeper:/live_nodes/127.0.0.1:41197_
[junit4] 2> 598202 INFO (zkCallback-2682-thread-1) [ ] o.a.s.c.c.ZkStateReader Updated live nodes from ZooKeeper... (2) -> (3)
[junit4] 2> 598202 INFO (zkCallback-2656-thread-1) [ ] o.a.s.c.c.ZkStateReader Updated live nodes from ZooKeeper... (2) -> (3)
[junit4] 2> 598202 INFO (zkCallback-2641-thread-4) [ ] o.a.s.c.c.ZkStateReader Updated live nodes from ZooKeeper... (2) -> (3)
[junit4] 2> 598239 WARN (closeThreadPool-2658-thread-4) [ ] o.e.j.u.s.S.config Trusting all certificates configured for Client@de40e75[provider=null,keyStore=null,trustStore=null]
[junit4] 2> 598239 WARN (closeThreadPool-2658-thread-4) [ ] o.e.j.u.s.S.config No Client EndPointIdentificationAlgorithm configured for Client@de40e75[provider=null,keyStore=null,trustStore=null]
[junit4] 2> 598240 INFO (closeThreadPool-2658-thread-4) [ ] o.a.s.c.ZkContainer Zookeeper client=127.0.0.1:37493/solr
[junit4] 2> 598250 INFO (zkCallback-2689-thread-1) [ ] o.a.s.c.c.ZkStateReader Updated live nodes from ZooKeeper... (2) -> (3)
[junit4] 2> 598270 INFO (closeThreadPool-2658-thread-4) [ ] o.a.s.c.c.ConnectionManager Waiting for client to connect to ZooKeeper
[junit4] 2> 598273 INFO (closeThreadPool-2658-thread-2) [ ] o.a.s.h.c.HttpShardHandlerFactory Host whitelist initialized: WhitelistHostChecker [whitelistHosts=null, whitelistHostCheckingEnabled=false]
[junit4] 2> 598304 WARN (closeThreadPool-2658-thread-2) [ ] o.e.j.u.s.S.config Trusting all certificates configured for Client@5b8e61f[provider=null,keyStore=null,trustStore=null]
[junit4] 2> 598304 WARN (closeThreadPool-2658-thread-2) [ ] o.e.j.u.s.S.config No Client EndPointIdentificationAlgorithm configured for Client@5b8e61f[provider=null,keyStore=null,trustStore=null]
[junit4] 2> 598308 INFO (zkConnectionManagerCallback-2700-thread-1) [ ] o.a.s.c.c.ConnectionManager zkClient has connected
[junit4] 2> 598308 INFO (closeThreadPool-2658-thread-3) [n:127.0.0.1:41197_ ] o.a.s.h.a.MetricsHistoryHandler No .system collection, keeping metrics history in memory.
[junit4] 2> 598308 INFO (closeThreadPool-2658-thread-4) [ ] o.a.s.c.c.ConnectionManager Client is connected to ZooKeeper
[junit4] 2> 598327 INFO (closeThreadPool-2658-thread-3) [n:127.0.0.1:41197_ ] o.a.s.m.r.SolrJmxReporter JMX monitoring for 'solr.node' (registry 'solr.node') enabled at server: com.sun.jmx.mbeanserver.JmxMBeanServer@6b331ff7
[junit4] 2> 598339 INFO (closeThreadPool-2658-thread-3) [n:127.0.0.1:41197_ ] o.a.s.m.r.SolrJmxReporter JMX monitoring for 'solr.jvm' (registry 'solr.jvm') enabled at server: com.sun.jmx.mbeanserver.JmxMBeanServer@6b331ff7
[junit4] 2> 598339 INFO (closeThreadPool-2658-thread-3) [n:127.0.0.1:41197_ ] o.a.s.m.r.SolrJmxReporter JMX monitoring for 'solr.jetty' (registry 'solr.jetty') enabled at server: com.sun.jmx.mbeanserver.JmxMBeanServer@6b331ff7
[junit4] 2> 598340 INFO (closeThreadPool-2658-thread-3) [n:127.0.0.1:41197_ ] o.a.s.c.CorePropertiesLocator Found 0 core definitions underneath /home/jenkins/workspace/Lucene-Solr-master-Linux/solr/build/solr-core/test/J1/../../../../../../../../../home/jenkins/workspace/Lucene-Solr-master-Linux/solr/build/solr-core/test/J1/temp/solr.cloud.SyncSliceTest_8F0203D7A8942E0D-001/shard-3-001/cores
[junit4] 2> 598342 WARN (closeThreadPool-2658-thread-2) [ ] o.e.j.u.s.S.config Trusting all certificates configured for Client@338dcce1[provider=null,keyStore=null,trustStore=null]
[junit4] 2> 598342 WARN (closeThreadPool-2658-thread-2) [ ] o.e.j.u.s.S.config No Client EndPointIdentificationAlgorithm configured for Client@338dcce1[provider=null,keyStore=null,trustStore=null]
[junit4] 2> 598343 INFO (closeThreadPool-2658-thread-2) [ ] o.a.s.c.ZkContainer Zookeeper client=127.0.0.1:37493/solr
[junit4] 2> 598344 INFO (closeThreadPool-2658-thread-2) [ ] o.a.s.c.c.ConnectionManager Waiting for client to connect to ZooKeeper
[junit4] 2> 598344 INFO (zkConnectionManagerCallback-2706-thread-1) [ ] o.a.s.c.c.ConnectionManager zkClient has connected
[junit4] 2> 598344 INFO (closeThreadPool-2658-thread-2) [ ] o.a.s.c.c.ConnectionManager Client is connected to ZooKeeper
[junit4] 2> 598422 INFO (closeThreadPool-2658-thread-4) [n:127.0.0.1:45043_ ] o.a.s.c.c.ConnectionManager Waiting for client to connect to ZooKeeper
[junit4] 2> 598426 INFO (zkConnectionManagerCallback-2708-thread-1) [ ] o.a.s.c.c.ConnectionManager zkClient has connected
[junit4] 2> 598426 INFO (closeThreadPool-2658-thread-4) [n:127.0.0.1:45043_ ] o.a.s.c.c.ConnectionManager Client is connected to ZooKeeper
[junit4] 2> 598440 INFO (closeThreadPool-2658-thread-3) [ ] o.a.s.c.AbstractFullDistribZkTestBase waitForLiveNode: 127.0.0.1:41197_
[junit4] 2> 598523 INFO (closeThreadPool-2658-thread-2) [n:127.0.0.1:44493_ ] o.a.s.c.c.ConnectionManager Waiting for client to connect to ZooKeeper
[junit4] 2> 598524 INFO (zkConnectionManagerCallback-2710-thread-1) [ ] o.a.s.c.c.ConnectionManager zkClient has connected
[junit4] 2> 598524 INFO (closeThreadPool-2658-thread-2) [n:127.0.0.1:44493_ ] o.a.s.c.c.ConnectionManager Client is connected to ZooKeeper
[junit4] 2> 598526 INFO (closeThreadPool-2658-thread-4) [n:127.0.0.1:45043_ ] o.a.s.c.c.ZkStateReader Updated live nodes from ZooKeeper... (0) -> (3)
[junit4] 2> 598527 INFO (closeThreadPool-2658-thread-2) [n:127.0.0.1:44493_ ] o.a.s.c.c.ZkStateReader Updated live nodes from ZooKeeper... (0) -> (3)
[junit4] 2> 598529 INFO (closeThreadPool-2658-thread-4) [n:127.0.0.1:45043_ ] o.a.s.c.ZkController Publish node=127.0.0.1:45043_ as DOWN
[junit4] 2> 598529 INFO (closeThreadPool-2658-thread-4) [n:127.0.0.1:45043_ ] o.a.s.c.TransientSolrCoreCacheDefault Allocating transient cache for 4 transient cores
[junit4] 2> 598529 INFO (closeThreadPool-2658-thread-4) [n:127.0.0.1:45043_ ] o.a.s.c.ZkController Register node as live in ZooKeeper:/live_nodes/127.0.0.1:45043_
[junit4] 2> 598530 INFO (zkCallback-2656-thread-1) [ ] o.a.s.c.c.ZkStateReader Updated live nodes from ZooKeeper... (3) -> (4)
[junit4] 2> 598531 INFO (zkCallback-2682-thread-1) [ ] o.a.s.c.c.ZkStateReader Updated live nodes from ZooKeeper... (3) -> (4)
[junit4] 2> 598531 INFO (zkCallback-2641-thread-3) [ ] o.a.s.c.c.ZkStateReader Updated live nodes from ZooKeeper... (3) -> (4)
[junit4] 2> 598538 INFO (zkCallback-2707-thread-1) [ ] o.a.s.c.c.ZkStateReader Updated live nodes from ZooKeeper... (3) -> (4)
[junit4] 2> 598538 INFO (zkCallback-2689-thread-1) [ ] o.a.s.c.c.ZkStateReader Updated live nodes from ZooKeeper... (3) -> (4)
[junit4] 2> 598538 INFO (zkCallback-2709-thread-1) [ ] o.a.s.c.c.ZkStateReader Updated live nodes from ZooKeeper... (3) -> (4)
[junit4] 2> 598540 INFO (closeThreadPool-2658-thread-2) [n:127.0.0.1:44493_ ] o.a.s.c.ZkController Publish node=127.0.0.1:44493_ as DOWN
[junit4] 2> 598540 INFO (closeThreadPool-2658-thread-2) [n:127.0.0.1:44493_ ] o.a.s.c.TransientSolrCoreCacheDefault Allocating transient cache for 4 transient cores
[junit4] 2> 598540 INFO (closeThreadPool-2658-thread-2) [n:127.0.0.1:44493_ ] o.a.s.c.ZkController Register node as live in ZooKeeper:/live_nodes/127.0.0.1:44493_
[junit4] 2> 598541 INFO (zkCallback-2689-thread-1) [ ] o.a.s.c.c.ZkStateReader Updated live nodes from ZooKeeper... (4) -> (5)
[junit4] 2> 598541 INFO (zkCallback-2709-thread-1) [ ] o.a.s.c.c.ZkStateReader Updated live nodes from ZooKeeper... (4) -> (5)
[junit4] 2> 598541 INFO (zkCallback-2656-thread-1) [ ] o.a.s.c.c.ZkStateReader Updated live nodes from ZooKeeper... (4) -> (5)
[junit4] 2> 598541 INFO (zkCallback-2641-thread-3) [ ] o.a.s.c.c.ZkStateReader Updated live nodes from ZooKeeper... (4) -> (5)
[junit4] 2> 598541 INFO (zkCallback-2707-thread-1) [ ] o.a.s.c.c.ZkStateReader Updated live nodes from ZooKeeper... (4) -> (5)
[junit4] 2> 598541 INFO (zkCallback-2682-thread-1) [ ] o.a.s.c.c.ZkStateReader Updated live nodes from ZooKeeper... (4) -> (5)
[junit4] 2> 598543 INFO (closeThreadPool-2658-thread-4) [n:127.0.0.1:45043_ ] o.a.s.h.a.MetricsHistoryHandler No .system collection, keeping metrics history in memory.
[junit4] 2> 598550 INFO (closeThreadPool-2658-thread-2) [n:127.0.0.1:44493_ ] o.a.s.h.a.MetricsHistoryHandler No .system collection, keeping metrics history in memory.
[junit4] 2> 598559 WARN (closeThreadPool-2658-thread-4) [n:127.0.0.1:45043_ ] o.a.s.m.r.j.JmxMetricsReporter Unable to register timer
[junit4] 2> => javax.management.InstanceNotFoundException: solr:dom1=node,category=UPDATE,scope=updateShardHandler,name=threadPool.updateOnlyExecutor.idle
[junit4] 2> at java.management/com.sun.jmx.interceptor.DefaultMBeanServerInterceptor.getMBean(DefaultMBeanServerInterceptor.java:1083)
[junit4] 2> javax.management.InstanceNotFoundException: solr:dom1=node,category=UPDATE,scope=updateShardHandler,name=threadPool.updateOnlyExecutor.idle
[junit4] 2> at com.sun.jmx.interceptor.DefaultMBeanServerInterceptor.getMBean(DefaultMBeanServerInterceptor.java:1083) ~[?:?]
[junit4] 2> at com.sun.jmx.interceptor.DefaultMBeanServerInterceptor.exclusiveUnregisterMBean(DefaultMBeanServerInterceptor.java:423) ~[?:?]
[junit4] 2> at com.sun.jmx.interceptor.DefaultMBeanServerInterceptor.unregisterMBean(DefaultMBeanServerInterceptor.java:411) ~[?:?]
[junit4] 2> at com.sun.jmx.mbeanserver.JmxMBeanServer.unregisterMBean(JmxMBeanServer.java:546) ~[?:?]
[junit4] 2> at org.apache.solr.metrics.reporters.jmx.JmxMetricsReporter$JmxListener.registerMBean(JmxMetricsReporter.java:530) ~[java/:?]
[junit4] 2> at org.apache.solr.metrics.reporters.jmx.JmxMetricsReporter$JmxListener.onTimerAdded(JmxMetricsReporter.java:673) ~[java/:?]
[junit4] 2> at org.apache.solr.metrics.reporters.jmx.JmxMetricsReporter.lambda$start$0(JmxMetricsReporter.java:739) ~[java/:?]
[junit4] 2> at java.util.HashMap.forEach(HashMap.java:1333) ~[?:?]
[junit4] 2> at org.apache.solr.metrics.reporters.jmx.JmxMetricsReporter.start(JmxMetricsReporter.java:731) ~[java/:?]
[junit4] 2> at org.apache.solr.metrics.reporters.SolrJmxReporter.doInit(SolrJmxReporter.java:109) ~[java/:?]
[junit4] 2> at org.apache.solr.metrics.SolrMetricReporter.init(SolrMetricReporter.java:70) ~[java/:?]
[junit4] 2> at org.apache.solr.metrics.SolrMetricManager.loadReporter(SolrMetricManager.java:964) ~[java/:?]
[junit4] 2> at org.apache.solr.metrics.SolrMetricManager.loadReporters(SolrMetricManager.java:890) ~[java/:?]
[junit4] 2> at org.apache.solr.core.CoreContainer.load(CoreContainer.java:683) ~[java/:?]
[junit4] 2> at org.apache.solr.servlet.SolrDispatchFilter.createCoreContainer(SolrDispatchFilter.java:262) ~[java/:?]
[junit4] 2> at org.apache.solr.servlet.SolrDispatchFilter.init(SolrDispatchFilter.java:182) ~[java/:?]
[junit4] 2> at org.eclipse.jetty.servlet.FilterHolder.initialize(FilterHolder.java:136) ~[jetty-servlet-9.4.19.v20190610.jar:9.4.19.v20190610]
[junit4] 2> at org.eclipse.jetty.servlet.ServletHandler.lambda$initialize$0(ServletHandler.java:750) ~[jetty-servlet-9.4.19.v20190610.jar:9.4.19.v20190610]
[junit4] 2> at java.util.Spliterators$ArraySpliterator.forEachRemaining(Spliterators.java:948) ~[?:?]
[junit4] 2> at java.util.stream.Streams$ConcatSpliterator.forEachRemaining(Streams.java:734) ~[?:?]
[junit4] 2> at java.util.stream.Streams$ConcatSpliterator.forEachRemaining(Streams.java:734) ~[?:?]
[junit4] 2> at java.util.stream.ReferencePipeline$Head.forEach(ReferencePipeline.java:658) ~[?:?]
[junit4] 2> at org.eclipse.jetty.servlet.ServletHandler.initialize(ServletHandler.java:744) ~[jetty-servlet-9.4.19.v20190610.jar:9.4.19.v20190610]
[junit4] 2> at org.eclipse.jetty.servlet.ServletHandler.updateMappings(ServletHandler.java:1449) ~[jetty-servlet-9.4.19.v20190610.jar:9.4.19.v20190610]
[junit4] 2> at org.eclipse.jetty.servlet.ServletHandler.setFilterMappings(ServletHandler.java:1513) ~[jetty-servlet-9.4.19.v20190610.jar:9.4.19.v20190610]
[junit4] 2> at org.eclipse.jetty.servlet.ServletHandler.addFilterMapping(ServletHandler.java:1158) ~[jetty-servlet-9.4.19.v20190610.jar:9.4.19.v20190610]
[junit4] 2> at org.eclipse.jetty.servlet.ServletHandler.addFilterWithMapping(ServletHandler.java:995) ~[jetty-servlet-9.4.19.v20190610.jar:9.4.19.v20190610]
[junit4] 2> at org.eclipse.jetty.servlet.ServletContextHandler.addFilter(ServletContextHandler.java:468) ~[jetty-servlet-9.4.19.v20190610.jar:9.4.19.v20190610]
[junit4] 2> at org.apache.solr.client.solrj.embedded.JettySolrRunner$1.lifeCycleStarted(JettySolrRunner.java:384) ~[java/:?]
[junit4] 2> at org.eclipse.jetty.util.component.AbstractLifeCycle.setStarted(AbstractLifeCycle.java:179) ~[jetty-util-9.4.19.v20190610.jar:9.4.19.v20190610]
[junit4] 2> at org.eclipse.jetty.util.component.AbstractLifeCycle.start(AbstractLifeCycle.java:69) ~[jetty-util-9.4.19.v20190610.jar:9.4.19.v20190610]
[junit4] 2> at org.apache.solr.client.solrj.embedded.JettySolrRunner.retryOnPortBindFailure(JettySolrRunner.java:567) ~[java/:?]
[junit4] 2> at org.apache.solr.client.solrj.embedded.JettySolrRunner.start(JettySolrRunner.java:506) ~[java/:?]
[junit4] 2> at org.apache.solr.client.solrj.embedded.JettySolrRunner.start(JettySolrRunner.java:474) ~[java/:?]
[junit4] 2> at org.apache.solr.cloud.AbstractFullDistribZkTestBase.lambda$createJettys$1(AbstractFullDistribZkTestBase.java:473) ~[java/:?]
[junit4] 2> at java.util.concurrent.Executors$RunnableAdapter.call(Executors.java:515) ~[?:?]
[junit4] 2> at java.util.concurrent.FutureTask.run(FutureTask.java:264) ~[?:?]
[junit4] 2> at org.apache.solr.common.util.ExecutorUtil$MDCAwareThreadPoolExecutor.lambda$execute$0(ExecutorUtil.java:210) ~[java/:?]
[junit4] 2> at java.util.concurrent.ThreadPoolExecutor.runWorker(ThreadPoolExecutor.java:1128) ~[?:?]
[junit4] 2> at java.util.concurrent.ThreadPoolExecutor$Worker.run(ThreadPoolExecutor.java:628) ~[?:?]
[junit4] 2> at java.lang.Thread.run(Thread.java:835) [?:?]
[junit4] 2> 598559 WARN (closeThreadPool-2658-thread-4) [n:127.0.0.1:45043_ ] o.a.s.m.r.j.JmxMetricsReporter Unable to register meter
[junit4] 2> => javax.management.InstanceNotFoundException: solr:dom1=node,category=QUERY,scope=/admin/metrics/history,name=serverErrors
[junit4] 2> at java.management/com.sun.jmx.interceptor.DefaultMBeanServerInterceptor.getMBean(DefaultMBeanServerInterceptor.java:1083)
[junit4] 2> javax.management.InstanceNotFoundException: solr:dom1=node,category=QUERY,scope=/admin/metrics/history,name=serverErrors
[junit4] 2> at com.sun.jmx.interceptor.DefaultMBeanServerInterceptor.getMBean(DefaultMBeanServerInterceptor.java:1083) ~[?:?]
[junit4] 2> at com.sun.jmx.interceptor.DefaultMBeanServerInterceptor.exclusiveUnregisterMBean(DefaultMBeanServerInterceptor.java:423) ~[?:?]
[junit4] 2> at com.sun.jmx.interceptor.DefaultMBeanServerInterceptor.unregisterMBean(DefaultMBeanServerInterceptor.java:411) ~[?:?]
[junit4] 2> at com.sun.jmx.mbeanserver.JmxMBeanServer.unregisterMBean(JmxMBeanServer.java:546) ~[?:?]
[junit4] 2> at org.apache.solr.metrics.reporters.jmx.JmxMetricsReporter$JmxListener.registerMBean(JmxMetricsReporter.java:530) ~[java/:?]
[junit4] 2> at org.apache.solr.metrics.reporters.jmx.JmxMetricsReporter$JmxListener.onMeterAdded(JmxMetricsReporter.java:647) ~[java/:?]
[junit4] 2> at org.apache.solr.metrics.reporters.jmx.JmxMetricsReporter.lambda$start$0(JmxMetricsReporter.java:735) ~[java/:?]
[junit4] 2> at java.util.HashMap.forEach(HashMap.java:1333) ~[?:?]
[junit4] 2> at org.apache.solr.metrics.reporters.jmx.JmxMetricsReporter.start(JmxMetricsReporter.java:731) ~[java/:?]
[junit4] 2> at org.apache.solr.metrics.reporters.SolrJmxReporter.doInit(SolrJmxReporter.java:109) ~[java/:?]
[junit4] 2> at org.apache.solr.metrics.SolrMetricReporter.init(SolrMetricReporter.java:70) ~[java/:?]
[junit4] 2> at org.apache.solr.metrics.SolrMetricManager.loadReporter(SolrMetricManager.java:964) ~[java/:?]
[junit4] 2> at org.apache.solr.metrics.SolrMetricManager.loadReporters(SolrMetricManager.java:890) ~[java/:?]
[junit4] 2> at org.apache.solr.core.CoreContainer.load(CoreContainer.java:683) ~[java/:?]
[junit4] 2> at org.apache.solr.servlet.SolrDispatchFilter.createCoreContainer(SolrDispatchFilter.java:262) ~[java/:?]
[junit4] 2> at org.apache.solr.servlet.SolrDispatchFilter.init(SolrDispatchFilter.java:182) ~[java/:?]
[junit4] 2> at org.eclipse.jetty.servlet.FilterHolder.initialize(FilterHolder.java:136) ~[jetty-servlet-9.4.19.v20190610.jar:9.4.19.v20190610]
[junit4] 2> at org.eclipse.jetty.servlet.ServletHandler.lambda$initialize$0(ServletHandler.java:750) ~[jetty-servlet-9.4.19.v20190610.jar:9.4.19.v20190610]
[junit4] 2> at java.util.Spliterators$ArraySpliterator.forEachRemaining(Spliterators.java:948) ~[?:?]
[junit4] 2> at java.util.stream.Streams$ConcatSpliterator.forEachRemaining(Streams.java:734) ~[?:?]
[junit4] 2> at java.util.stream.Streams$ConcatSpliterator.forEachRemaining(Streams.java:734) ~[?:?]
[junit4] 2> at java.util.stream.ReferencePipeline$Head.forEach(ReferencePipeline.java:658) ~[?:?]
[junit4] 2> at org.eclipse.jetty.servlet.ServletHandler.initialize(ServletHandler.java:744) ~[jetty-servlet-9.4.19.v20190610.jar:9.4.19.v20190610]
[junit4] 2> at org.eclipse.jetty.servlet.ServletHandler.updateMappings(ServletHandler.java:1449) ~[jetty-servlet-9.4.19.v20190610.jar:9.4.19.v20190610]
[junit4] 2> at org.eclipse.jetty.servlet.ServletHandler.setFilterMappings(ServletHandler.java:1513) ~[jetty-servlet-9.4.19.v20190610.jar:9.4.19.v20190610]
[junit4] 2> at org.eclipse.jetty.servlet.ServletHandler.addFilterMapping(ServletHandler.java:1158) ~[jetty-servlet-9.4.19.v20190610.jar:9.4.19.v20190610]
[junit4] 2> at org.eclipse.jetty.servlet.ServletHandler.addFilterWithMapping(ServletHandler.java:995) ~[jetty-servlet-9.4.19.v20190610.jar:9.4.19.v20190610]
[junit4] 2> at org.eclipse.jetty.servlet.ServletContextHandler.addFilter(ServletContextHandler.java:468) ~[jetty-servlet-9.4.19.v20190610.jar:9.4.19.v20190610]
[junit4] 2> at org.apache.solr.client.solrj.embedded.JettySolrRunner$1.lifeCycleStarted(JettySolrRunner.java:384) ~[java/:?]
[junit4] 2> at org.eclipse.jetty.util.component.AbstractLifeCycle.setStarted(AbstractLifeCycle.java:179) ~[jetty-util-9.4.19.v20190610.jar:9.4.19.v20190610]
[junit4] 2> at org.eclipse.jetty.util.component.AbstractLifeCycle.start(AbstractLifeCycle.java:69) ~[jetty-util-9.4.19.v20190610.jar:9.4.19.v20190610]
[junit4] 2> at org.apache.solr.client.solrj.embedded.JettySolrRunner.retryOnPortBindFailure(JettySolrRunner.java:567) ~[java/:?]
[junit4] 2> at org.apache.solr.client.solrj.embedded.JettySolrRunner.start(JettySolrRunner.java:506) ~[java/:?]
[junit4] 2> at org.apache.solr.client.solrj.embedded.JettySolrRunner.start(JettySolrRunner.java:474) ~[java/:?]
[junit4] 2> at org.apache.solr.cloud.AbstractFullDistribZkTestBase.lambda$createJettys$1(AbstractFullDistribZkTestBase.java:473) ~[java/:?]
[junit4] 2> at java.util.concurrent.Executors$RunnableAdapter.call(Executors.java:515) ~[?:?]
[junit4] 2> at java.util.concurrent.FutureTask.run(FutureTask.java:264) ~[?:?]
[junit4] 2> at org.apache.solr.common.util.ExecutorUtil$MDCAwareThreadPoolExecutor.lambda$execute$0(ExecutorUtil.java:210) ~[java/:?]
[junit4] 2> at java.util.concurrent.ThreadPoolExecutor.runWorker(ThreadPoolExecutor.java:1128) ~[?:?]
[junit4] 2> at java.util.concurrent.ThreadPoolExecutor$Worker.run(ThreadPoolExecutor.java:628) ~[?:?]
[junit4] 2> at java.lang.Thread.run(Thread.java:835) [?:?]
[junit4] 2> 598559 WARN (closeThreadPool-2658-thread-4) [n:127.0.0.1:45043_ ] o.a.s.m.r.j.JmxMetricsReporter Unable to register timer
[junit4] 2> => javax.management.InstanceNotFoundException: solr:dom1=node,category=ADMIN,scope=/admin/metrics,name=requestTimes
[junit4] 2> at java.management/com.sun.jmx.interceptor.DefaultMBeanServerInterceptor.getMBean(DefaultMBeanServerInterceptor.java:1083)
[junit4] 2> javax.management.InstanceNotFoundException: solr:dom1=node,category=ADMIN,scope=/admin/metrics,name=requestTimes
[junit4] 2> at com.sun.jmx.interceptor.DefaultMBeanServerInterceptor.getMBean(DefaultMBeanServerInterceptor.java:1083) ~[?:?]
[junit4] 2> at com.sun.jmx.interceptor.DefaultMBeanServerInterceptor.exclusiveUnregisterMBean(DefaultMBeanServerInterceptor.java:423) ~[?:?]
[junit4] 2> at com.sun.jmx.interceptor.DefaultMBeanServerInterceptor.unregisterMBean(DefaultMBeanServerInterceptor.java:411) ~[?:?]
[junit4] 2> at com.sun.jmx.mbeanserver.JmxMBeanServer.unregisterMBean(JmxMBeanServer.java:546) ~[?:?]
[junit4] 2> at org.apache.solr.metrics.reporters.jmx.JmxMetricsReporter$JmxListener.registerMBean(JmxMetricsReporter.java:530) ~[java/:?]
[junit4] 2> at org.apache.solr.metrics.reporters.jmx.JmxMetricsReporter$JmxListener.onTimerAdded(JmxMetricsReporter.java:673) ~[java/:?]
[junit4] 2> at org.apache.solr.metrics.reporters.jmx.JmxMetricsReporter.lambda$start$0(JmxMetricsReporter.java:739) ~[java/:?]
[junit4] 2> at java.util.HashMap.forEach(HashMap.java:1333) ~[?:?]
[junit4] 2> at org.apache.solr.metrics.reporters.jmx.JmxMetricsReporter.start(JmxMetricsReporter.java:731) ~[java/:?]
[junit4] 2> at org.apache.solr.metrics.reporters.SolrJmxReporter.doInit(SolrJmxReporter.java:109) ~[java/:?]
[junit4] 2> at org.apache.solr.metrics.SolrMetricReporter.init(SolrMetricReporter.java:70) ~[java/:?]
[junit4] 2> at org.apache.solr.metrics.SolrMetricManager.loadReporter(SolrMetricManager.java:964) ~[java/:?]
[junit4] 2> at org.apache.solr.metrics.SolrMetricManager.loadReporters(SolrMetricManager.java:890) ~[java/:?]
[junit4] 2> at org.apache.solr.core.CoreContainer.load(CoreContainer.java:683) ~[java/:?]
[junit4] 2> at org.apache.solr.servlet.SolrDispatchFilter.createCoreContainer(SolrDispatchFilter.java:262) ~[java/:?]
[junit4] 2> at org.apache.solr.servlet.SolrDispatchFilter.init(SolrDispatchFilter.java:182) ~[java/:?]
[junit4] 2> at org.eclipse.jetty.servlet.FilterHolder.initialize(FilterHolder.java:136) ~[jetty-servlet-9.4.19.v20190610.jar:9.4.19.v20190610]
[junit4] 2> at org.eclipse.jetty.servlet.ServletHandler.lambda$initialize$0(ServletHandler.java:750) ~[jetty-servlet-9.4.19.v20190610.jar:9.4.19.v20190610]
[junit4] 2> at java.util.Spliterators$ArraySpliterator.forEachRemaining(Spliterators.java:948) ~[?:?]
[junit4] 2> at java.util.stream.Streams$ConcatSpliterator.forEachRemaining(Streams.java:734) ~[?:?]
[junit4] 2> at java.util.stream.Streams$ConcatSpliterator.forEachRemaining(Streams.java:734) ~[?:?]
[junit4] 2> at java.util.stream.ReferencePipeline$Head.forEach(ReferencePipeline.java:658) ~[?:?]
[junit4] 2> at org.eclipse.jetty.servlet.ServletHandler.initialize(ServletHandler.java:744) ~[jetty-servlet-9.4.19.v20190610.jar:9.4.19.v20190610]
[junit4] 2> at org.eclipse.jetty.servlet.ServletHandler.updateMappings(ServletHandler.java:1449) ~[jetty-servlet-9.4.19.v20190610.jar:9.4.19.v20190610]
[junit4] 2> at org.eclipse.jetty.servlet.ServletHandler.setFilterMappings(ServletHandler.java:1513) ~[jetty-servlet-9.4.19.v20190610.jar:9.4.19.v20190610]
[junit4] 2> at org.eclipse.jetty.servlet.ServletHandler.addFilterMapping(ServletHandler.java:1158) ~[jetty-servlet-9.4.19.v20190610.jar:9.4.19.v20190610]
[junit4] 2> at org.eclipse.jetty.servlet.ServletHandler.addFilterWithMapping(ServletHandler.java:995) ~[jetty-servlet-9.4.19.v20190610.jar:9.4.19.v20190610]
[junit4] 2> at org.eclipse.jetty.servlet.ServletContextHandler.addFilter(ServletContextHandler.java:468) ~[jetty-servlet-9.4.19.v20190610.jar:9.4.19.v20190610]
[junit4] 2> at org.apache.solr.client.solrj.embedded.JettySolrRunner$1.lifeCycleStarted(JettySolrRunner.java:384) ~[java/:?]
[junit4] 2> at org.eclipse.jetty.util.component.AbstractLifeCycle.setStarted(AbstractLifeCycle.java:179) ~[jetty-util-9.4.19.v20190610.jar:9.4.19.v20190610]
[junit4] 2> at org.eclipse.jetty.util.component.AbstractLifeCycle.start(AbstractLifeCycle.java:69) ~[jetty-util-9.4.19.v20190610.jar:9.4.19.v20190610]
[junit4] 2> at org.apache.solr.client.solrj.embedded.JettySolrRunner.retryOnPortBindFailure(JettySolrRunner.java:567) ~[java/:?]
[junit4] 2> at org.apache.solr.client.solrj.embedded.JettySolrRunner.start(JettySolrRunner.java:506) ~[java/:?]
[junit4] 2> at org.apache.solr.client.solrj.embedded.JettySolrRunner.start(JettySolrRunner.java:474) ~[java/:?]
[junit4] 2> at org.apache.solr.cloud.AbstractFullDistribZkTestBase.lambda$createJettys$1(AbstractFullDistribZkTestBase.java:473) ~[java/:?]
[junit4] 2> at java.util.concurrent.Executors$RunnableAdapter.call(Executors.java:515) ~[?:?]
[junit4] 2> at java.util.concurrent.FutureTask.run(FutureTask.java:264) ~[?:?]
[junit4] 2> at org.apache.solr.common.util.ExecutorUtil$MDCAwareThreadPoolExecutor.lambda$execute$0(ExecutorUtil.java:210) ~[java/:?]
[junit4] 2> at java.util.concurrent.ThreadPoolExecutor.runWorker(ThreadPoolExecutor.java:1128) ~[?:?]
[junit4] 2> at java.util.concurrent.ThreadPoolExecutor$Worker.run(ThreadPoolExecutor.java:628) ~[?:?]
[junit4] 2> at java.lang.Thread.run(Thread.java:835) [?:?]
[junit4] 2> 598559 WARN (closeThreadPool-2658-thread-2) [n:127.0.0.1:44493_ ] o.a.s.m.r.j.JmxMetricsReporter Unable to register counter
[junit4] 2> => javax.management.InstanceNotFoundException: solr:dom1=node,category=ADMIN,scope=/admin/metrics,name=totalTime
[junit4] 2> at java.management/com.sun.jmx.interceptor.DefaultMBeanServerInterceptor.getMBean(DefaultMBeanServerInterceptor.java:1083)
[junit4] 2> javax.management.InstanceNotFoundException: solr:do
[...truncated too long message...]
1913910890}}
[junit4] 1> /solr/autoscaling/events (2)
[junit4] 1> /solr/autoscaling/events/.scheduled_maintenance (0)
[junit4] 1> /solr/autoscaling/events/.auto_add_replicas (0)
[junit4] 1> /solr/autoscaling.json (0)
[junit4] 1> DATA:
[junit4] 1> {
[junit4] 1> "triggers":{
[junit4] 1> ".auto_add_replicas":{
[junit4] 1> "name":".auto_add_replicas",
[junit4] 1> "event":"nodeLost",
[junit4] 1> "waitFor":10,
[junit4] 1> "enabled":true,
[junit4] 1> "actions":[
[junit4] 1> {
[junit4] 1> "name":"auto_add_replicas_plan",
[junit4] 1> "class":"solr.AutoAddReplicasPlanAction"},
[junit4] 1> {
[junit4] 1> "name":"execute_plan",
[junit4] 1> "class":"solr.ExecutePlanAction"}]},
[junit4] 1> ".scheduled_maintenance":{
[junit4] 1> "name":".scheduled_maintenance",
[junit4] 1> "event":"scheduled",
[junit4] 1> "startTime":"NOW",
[junit4] 1> "every":"+1DAY",
[junit4] 1> "enabled":true,
[junit4] 1> "actions":[
[junit4] 1> {
[junit4] 1> "name":"inactive_shard_plan",
[junit4] 1> "class":"solr.InactiveShardPlanAction"},
[junit4] 1> {
[junit4] 1> "name":"inactive_markers_plan",
[junit4] 1> "class":"solr.InactiveMarkersPlanAction"},
[junit4] 1> {
[junit4] 1> "name":"execute_plan",
[junit4] 1> "class":"solr.ExecutePlanAction"}]}},
[junit4] 1> "listeners":{
[junit4] 1> ".auto_add_replicas.system":{
[junit4] 1> "beforeAction":[],
[junit4] 1> "afterAction":[],
[junit4] 1> "stage":[
[junit4] 1> "STARTED",
[junit4] 1> "ABORTED",
[junit4] 1> "SUCCEEDED",
[junit4] 1> "FAILED",
[junit4] 1> "BEFORE_ACTION",
[junit4] 1> "AFTER_ACTION",
[junit4] 1> "IGNORED"],
[junit4] 1> "trigger":".auto_add_replicas",
[junit4] 1> "class":"org.apache.solr.cloud.autoscaling.SystemLogListener"},
[junit4] 1> ".scheduled_maintenance.system":{
[junit4] 1> "beforeAction":[],
[junit4] 1> "afterAction":[],
[junit4] 1> "stage":[
[junit4] 1> "STARTED",
[junit4] 1> "ABORTED",
[junit4] 1> "SUCCEEDED",
[junit4] 1> "FAILED",
[junit4] 1> "BEFORE_ACTION",
[junit4] 1> "AFTER_ACTION",
[junit4] 1> "IGNORED"],
[junit4] 1> "trigger":".scheduled_maintenance",
[junit4] 1> "class":"org.apache.solr.cloud.autoscaling.SystemLogListener"}},
[junit4] 1> "properties":{}}
[junit4] 1> /solr/clusterprops.json (0)
[junit4] 1> DATA:
[junit4] 1> {
[junit4] 1> "legacyCloud":"true",
[junit4] 1> "urlScheme":"https"}
[junit4] 1>
[junit4] 2> 620607 INFO (TEST-SyncSliceTest.test-seed#[8F0203D7A8942E0D]) [ ] o.a.s.c.ZkTestServer Shutting down ZkTestServer.
[junit4] 2> 620810 WARN (ZkTestServer Run Thread) [ ] o.a.s.c.ZkTestServer Watch limit violations:
[junit4] 2> Maximum concurrent create/delete watches above limit:
[junit4] 2>
[junit4] 2> 18 /solr/collections/collection1/terms/shard1
[junit4] 2> 7 /solr/aliases.json
[junit4] 2> 5 /solr/security.json
[junit4] 2> 5 /solr/configs/conf1
[junit4] 2> 4 /solr/collections/collection1/collectionprops.json
[junit4] 2> 3 /solr/collections/control_collection/terms/shard1
[junit4] 2>
[junit4] 2> Maximum concurrent data watches above limit:
[junit4] 2>
[junit4] 2> 122 /solr/collections/collection1/state.json
[junit4] 2> 12 /solr/collections/control_collection/state.json
[junit4] 2> 7 /solr/clusterprops.json
[junit4] 2> 7 /solr/clusterstate.json
[junit4] 2> 2 /solr/overseer_elect/election/72351927552835599-127.0.0.1:41197_-n_0000000002
[junit4] 2> 2 /solr/collections/collection1/leader_elect/shard1/election/72351927552835598-core_node4-n_0000000001
[junit4] 2> 2 /solr/overseer_elect/election/72351927552835598-127.0.0.1:35937_-n_0000000001
[junit4] 2>
[junit4] 2> Maximum concurrent children watches above limit:
[junit4] 2>
[junit4] 2> 50 /solr/overseer/queue
[junit4] 2> 38 /solr/live_nodes
[junit4] 2> 20 /solr/overseer/collection-queue-work
[junit4] 2> 7 /solr/collections
[junit4] 2>
[junit4] 2> 620811 INFO (TEST-SyncSliceTest.test-seed#[8F0203D7A8942E0D]) [ ] o.a.s.c.ZkTestServer waitForServerDown: 127.0.0.1:37493
[junit4] 2> 620811 INFO (TEST-SyncSliceTest.test-seed#[8F0203D7A8942E0D]) [ ] o.a.s.c.ZkTestServer parse host and port list: 127.0.0.1:37493
[junit4] 2> 620811 INFO (TEST-SyncSliceTest.test-seed#[8F0203D7A8942E0D]) [ ] o.a.s.c.ZkTestServer connecting to 127.0.0.1 37493
[junit4] 2> NOTE: reproduce with: ant test -Dtestcase=SyncSliceTest -Dtests.method=test -Dtests.seed=8F0203D7A8942E0D -Dtests.multiplier=3 -Dtests.slow=true -Dtests.locale=hsb-DE -Dtests.timezone=Asia/Atyrau -Dtests.asserts=true -Dtests.file.encoding=UTF-8
[junit4] FAILURE 26.9s J1 | SyncSliceTest.test <<<
[junit4] > Throwable #1: java.lang.AssertionError: expected:<5> but was:<4>
[junit4] > at __randomizedtesting.SeedInfo.seed([8F0203D7A8942E0D:7563C0D066843F5]:0)
[junit4] > at org.apache.solr.cloud.SyncSliceTest.test(SyncSliceTest.java:150)
[junit4] > at java.base/jdk.internal.reflect.NativeMethodAccessorImpl.invoke0(Native Method)
[junit4] > at java.base/jdk.internal.reflect.NativeMethodAccessorImpl.invoke(NativeMethodAccessorImpl.java:62)
[junit4] > at java.base/jdk.internal.reflect.DelegatingMethodAccessorImpl.invoke(DelegatingMethodAccessorImpl.java:43)
[junit4] > at java.base/java.lang.reflect.Method.invoke(Method.java:567)
[junit4] > at org.apache.solr.BaseDistributedSearchTestCase$ShardsRepeatRule$ShardsFixedStatement.callStatement(BaseDistributedSearchTestCase.java:1082)
[junit4] > at org.apache.solr.BaseDistributedSearchTestCase$ShardsRepeatRule$ShardsStatement.evaluate(BaseDistributedSearchTestCase.java:1054)
[junit4] > at java.base/java.lang.Thread.run(Thread.java:835)
[junit4] 2> NOTE: leaving temporary files on disk at: /home/jenkins/workspace/Lucene-Solr-master-Linux/solr/build/solr-core/test/J1/temp/solr.cloud.SyncSliceTest_8F0203D7A8942E0D-001
[junit4] 2> NOTE: test params are: codec=Asserting(Lucene80), sim=Asserting(org.apache.lucene.search.similarities.AssertingSimilarity@63f61c99), locale=hsb-DE, timezone=Asia/Atyrau
[junit4] 2> NOTE: Linux 5.0.0-25-generic amd64/AdoptOpenJDK 12.0.1 (64-bit)/cpus=8,threads=1,free=289295488,total=445644800
[junit4] 2> NOTE: All tests run in this JVM: [TestInfoStreamLogging, TestReload, CurrencyRangeFacetCloudTest, DistributedQueryComponentCustomSortTest, TestReplicationHandlerBackup, FieldAnalysisRequestHandlerTest, ShardSplitTest, TestManagedSchemaAPI, AddReplicaTest, BJQParserTest, AddBlockUpdateTest, SimplePostToolTest, CollectionTooManyReplicasTest, JWTAuthPluginIntegrationTest, WrapperMergePolicyFactoryTest, SolrLogAuditLoggerPluginTest, TestRandomFaceting, SplitHandlerTest, TestSearcherReuse, TestMultiWordSynonyms, BinaryUpdateRequestHandlerTest, Tagger2Test, TestRemoteStreaming, TestManagedSynonymGraphFilterFactory, TestPointFields, RulesTest, DateMathParserTest, TestHttpServletCarrier, UniqFieldsUpdateProcessorFactoryTest, BJQFilterAccessibleTest, PhrasesIdentificationComponentTest, TestConfigSetImmutable, TermVectorComponentDistributedTest, TestCoreBackup, TestExclusionRuleCollectionAccess, SolrJmxReporterCloudTest, TestCloudSearcherWarming, DistribDocExpirationUpdateProcessorTest, DataDrivenBlockJoinTest, TriLevelCompositeIdRoutingTest, PreAnalyzedFieldManagedSchemaCloudTest, TestGraphMLResponseWriter, CurrencyFieldTypeTest, DisMaxRequestHandlerTest, TestLMDirichletSimilarityFactory, OverseerCollectionConfigSetProcessorTest, TestLegacyFieldReuse, SolrIndexConfigTest, JavaBinAtomicUpdateMultivalueTest, TestRuleBasedAuthorizationPlugin, XsltUpdateRequestHandlerTest, SyncSliceTest]
[junit4] Completed [180/887 (1!)] on J1 in 27.06s, 1 test, 1 failure <<< FAILURES!
[...truncated 47146 lines...]
[repro] Jenkins log URL: https://jenkins.thetaphi.de/job/Lucene-Solr-master-Linux/24933/consoleText
[repro] Revision: c68470e57764f9c954008887d302a07a8bf6ae14
[repro] Ant options: "-Dargs=-XX:-UseCompressedOops -XX:+UseG1GC"
[repro] Repro line: ant test -Dtestcase=SyncSliceTest -Dtests.method=test -Dtests.seed=8F0203D7A8942E0D -Dtests.multiplier=3 -Dtests.slow=true -Dtests.locale=hsb-DE -Dtests.timezone=Asia/Atyrau -Dtests.asserts=true -Dtests.file.encoding=UTF-8
[repro] ant clean
[...truncated 6 lines...]
[repro] Test suites by module:
[repro] solr/core
[repro] SyncSliceTest
[repro] ant compile-test
[...truncated 3327 lines...]
[repro] ant test-nocompile -Dtests.dups=5 -Dtests.maxfailures=5 -Dtests.class="*.SyncSliceTest" -Dtests.showOutput=onerror "-Dargs=-XX:-UseCompressedOops -XX:+UseG1GC" -Dtests.seed=8F0203D7A8942E0D -Dtests.multiplier=3 -Dtests.slow=true -Dtests.locale=hsb-DE -Dtests.timezone=Asia/Atyrau -Dtests.asserts=true -Dtests.file.encoding=UTF-8
[...truncated 75 lines...]
[repro] Failures:
[repro] 0/5 failed: org.apache.solr.cloud.SyncSliceTest
[repro] Exiting with code 0
[...truncated 43 lines...]