You are viewing a plain text version of this content. The canonical link for it is here.
Posted to commits@tomee.apache.org by Apache Jenkins Server <je...@builds.apache.org> on 2026/06/29 12:21:08 UTC

Build failed in Jenkins: TomEE » tomee-jakartaee-api-master #1618

See <https://ci-builds.apache.org/job/Tomee/job/tomee-jakartaee-api-master/1618/display/redirect>

Changes:


------------------------------------------
Started by timer
Running as SYSTEM
[EnvInject] - Loading node environment variables.
Building remotely on builds22 (ubuntu) in workspace <https://ci-builds.apache.org/job/Tomee/job/tomee-jakartaee-api-master/ws/>
The recommended git tool is: NONE
No credentials specified
 > git rev-parse --resolve-git-dir <https://ci-builds.apache.org/job/Tomee/job/tomee-jakartaee-api-master/ws/.git> # timeout=10
Fetching changes from the remote Git repository
 > git config remote.origin.url https://github.com/apache/tomee-jakartaee-api # timeout=10
Cleaning workspace
 > git rev-parse --verify HEAD # timeout=10
Resetting working tree
 > git reset --hard # timeout=10
 > git clean -fdx # timeout=10
Fetching upstream changes from https://github.com/apache/tomee-jakartaee-api
 > git --version # timeout=10
 > git --version # 'git version 2.34.1'
 > git fetch --tags --force --progress -- https://github.com/apache/tomee-jakartaee-api +refs/heads/*:refs/remotes/origin/* # timeout=10
 > git rev-parse refs/remotes/origin/main^{commit} # timeout=10
Checking out Revision c531599fb0d0f9bdb326e28cff23baaaf65af5f5 (refs/remotes/origin/main)
 > git config core.sparsecheckout # timeout=10
 > git checkout -f c531599fb0d0f9bdb326e28cff23baaaf65af5f5 # timeout=10
Commit message: "[maven-release-plugin] prepare for next development iteration"
 > git rev-list --no-walk c531599fb0d0f9bdb326e28cff23baaaf65af5f5 # timeout=10
Parsing POMs
Established TCP socket on 34727
maven35-agent.jar already up to date
maven35-interceptor.jar already up to date
maven3-interceptor-commons.jar already up to date
[tomee-jakartaee-api-master] $ /home/jenkins/tools/java/latest11/bin/java -Xmx1536m -cp /home/jenkins/jenkins-agent/maven35-agent.jar:/home/jenkins/tools/maven/latest/boot/plexus-classworlds-2.9.0.jar:/home/jenkins/tools/maven/latest/conf/logging jenkins.maven3.agent.Maven35Main /home/jenkins/tools/maven/latest /home/jenkins/jenkins-agent/agent.jar /home/jenkins/jenkins-agent/maven35-interceptor.jar /home/jenkins/jenkins-agent/maven3-interceptor-commons.jar 34727
<===[JENKINS REMOTING CAPACITY]===>   channel started
Jun 29, 2026 12:19:25 PM hudson.remoting.UserRequest perform
WARNING: LinkageError while performing UserRequest:hudson.maven.AbstractMavenProcessFactory$ConfigureOriginalJDK@1c1cf369
java.lang.UnsupportedClassVersionError: Failed to load hudson.maven.AbstractMavenProcessFactory$ConfigureOriginalJDK
	at hudson.remoting.RemoteClassLoader.loadClassFile(RemoteClassLoader.java:472)
	at hudson.remoting.RemoteClassLoader.loadRemoteClass(RemoteClassLoader.java:301)
	at hudson.remoting.RemoteClassLoader.loadWithMultiClassLoader(RemoteClassLoader.java:277)
	at hudson.remoting.RemoteClassLoader.findClass(RemoteClassLoader.java:236)
	at java.base/java.lang.ClassLoader.loadClass(ClassLoader.java:594)
	at java.base/java.lang.ClassLoader.loadClass(ClassLoader.java:527)
	at java.base/java.lang.Class.forName0(Native Method)
	at java.base/java.lang.Class.forName(Class.java:398)
	at hudson.remoting.MultiClassLoaderSerializer$Input.resolveClass(MultiClassLoaderSerializer.java:133)
	at java.base/java.io.ObjectInputStream.readNonProxyDesc(ObjectInputStream.java:2003)
	at java.base/java.io.ObjectInputStream.readClassDesc(ObjectInputStream.java:1870)
	at java.base/java.io.ObjectInputStream.readOrdinaryObject(ObjectInputStream.java:2201)
	at java.base/java.io.ObjectInputStream.readObject0(ObjectInputStream.java:1687)
	at java.base/java.io.ObjectInputStream.readObject(ObjectInputStream.java:489)
	at java.base/java.io.ObjectInputStream.readObject(ObjectInputStream.java:447)
	at hudson.remoting.UserRequest.deserialize(UserRequest.java:312)
	at hudson.remoting.UserRequest.perform(UserRequest.java:196)
	at hudson.remoting.UserRequest.perform(UserRequest.java:50)
	at hudson.remoting.Request$2.run(Request.java:391)
	at hudson.remoting.InterceptingExecutorService.lambda$wrap$0(InterceptingExecutorService.java:81)
	at java.base/java.util.concurrent.FutureTask.run(FutureTask.java:264)
	at java.base/java.util.concurrent.ThreadPoolExecutor.runWorker(ThreadPoolExecutor.java:1128)
	at java.base/java.util.concurrent.ThreadPoolExecutor$Worker.run(ThreadPoolExecutor.java:628)
	at java.base/java.lang.Thread.run(Thread.java:829)
Caused by: java.lang.UnsupportedClassVersionError: Failed to load jenkins.security.MasterToSlaveCallable
	at hudson.remoting.RemoteClassLoader.loadClassFile(RemoteClassLoader.java:472)
	at hudson.remoting.RemoteClassLoader.loadRemoteClass(RemoteClassLoader.java:301)
	at hudson.remoting.RemoteClassLoader.loadWithMultiClassLoader(RemoteClassLoader.java:277)
	at hudson.remoting.RemoteClassLoader.findClass(RemoteClassLoader.java:236)
	at java.base/java.lang.ClassLoader.loadClass(ClassLoader.java:594)
	at java.base/java.lang.ClassLoader.loadClass(ClassLoader.java:527)
	at java.base/java.lang.ClassLoader.defineClass1(Native Method)
	at java.base/java.lang.ClassLoader.defineClass(ClassLoader.java:1022)
	at java.base/java.lang.ClassLoader.defineClass(ClassLoader.java:883)
	at hudson.remoting.RemoteClassLoader.loadClassFile(RemoteClassLoader.java:470)
	... 23 more
Caused by: java.lang.UnsupportedClassVersionError: jenkins/security/MasterToSlaveCallable has been compiled by a more recent version of the Java Runtime (class file version 61.0), this version of the Java Runtime only recognizes class file versions up to 55.0
	at java.base/java.lang.ClassLoader.defineClass1(Native Method)
	at java.base/java.lang.ClassLoader.defineClass(ClassLoader.java:1022)
	at java.base/java.lang.ClassLoader.defineClass(ClassLoader.java:883)
	at hudson.remoting.RemoteClassLoader.loadClassFile(RemoteClassLoader.java:470)
	... 32 more

ERROR: ================================================================================
ERROR: Invalid project setup: Failed to load hudson.maven.AbstractMavenProcessFactory$ConfigureOriginalJDK
ERROR: [JENKINS-18403][JENKINS-28294] JDK 'jdk_11_latest' not supported to run Maven projects.
ERROR: Maven projects have to be launched with a Java version greater or equal to the minimum version required by the controller.
ERROR: Use the Maven JDK Toolchains (plugin) to build your maven project with an older JDK.
ERROR: Retrying with agent Java and setting compile/test properties to point to /home/jenkins/tools/java/latest11.
ERROR: ================================================================================
Established TCP socket on 43223
maven35-agent.jar already up to date
maven35-interceptor.jar already up to date
maven3-interceptor-commons.jar already up to date
[tomee-jakartaee-api-master] $ /usr/local/asfpackages/java/adoptium-jdk-17.0.12+7/bin/java -Xmx1536m -cp /home/jenkins/jenkins-agent/maven35-agent.jar:/home/jenkins/tools/maven/latest/boot/plexus-classworlds-2.9.0.jar:/home/jenkins/tools/maven/latest/conf/logging jenkins.maven3.agent.Maven35Main /home/jenkins/tools/maven/latest /home/jenkins/jenkins-agent/agent.jar /home/jenkins/jenkins-agent/maven35-interceptor.jar /home/jenkins/jenkins-agent/maven3-interceptor-commons.jar 43223
<===[JENKINS REMOTING CAPACITY]===>   channel started
Executing Maven:  -B -f <https://ci-builds.apache.org/job/Tomee/job/tomee-jakartaee-api-master/ws/pom.xml> -U --show-version --fail-at-end clean install deploy -Dfile.encoding=UTF-8
Apache Maven 3.9.11 (3e54c93a704957b63ee3494413a2b544fd3d825b)
Maven home: /usr/local/asfpackages/maven/apache-maven-3.9.11
Java version: 17.0.12, vendor: Eclipse Adoptium, runtime: /usr/local/asfpackages/java/adoptium-jdk-17.0.12+7
Default locale: en_US, platform encoding: UTF-8
OS name: "linux", version: "5.15.0-174-generic", arch: "amd64", family: "unix"
[INFO] Scanning for projects...
[HUDSON] Collecting dependencies info
[INFO] ------------------------------------------------------------------------
[INFO] Reactor Build Order:
[INFO] 
[HUDSON] Collecting dependencies info
[HUDSON] Collecting dependencies info
[INFO] Apache TomEE :: Jakarta EE 11 Full API :: Parent                   [pom]
[INFO] Apache TomEE :: Jakarta EE 11 Full API                             [jar]
[INFO] Apache TomEE :: Jakarta EE 11 Full API :: Signature Tests          [pom]
[INFO] 
[INFO] ---------------< org.apache.tomee:jakartaee-api-parent >----------------
[INFO] Building Apache TomEE :: Jakarta EE 11 Full API :: Parent 11.0.0-M2-SNAPSHOT [1/3]
[INFO]   from pom.xml
[INFO] --------------------------------[ pom ]---------------------------------
[INFO] 
[INFO] --- clean:3.5.0:clean (default-clean) @ jakartaee-api-parent ---
[INFO] 
[INFO] --- enforcer:3.6.2:enforce (enforce-maven-version) @ jakartaee-api-parent ---
[INFO] Rule 0: org.apache.maven.enforcer.rules.version.RequireMavenVersion passed
[INFO] 
[INFO] --- enforcer:3.6.2:enforce (enforce-java-version) @ jakartaee-api-parent ---
[INFO] Rule 0: org.apache.maven.enforcer.rules.version.RequireJavaVersion passed
[INFO] 
[INFO] --- remote-resources:3.3.0:process (process-resource-bundles) @ jakartaee-api-parent ---
[INFO] Preparing remote bundle org.apache.apache.resources:apache-jar-resource-bundle:1.8
[INFO] Copying 3 resources from 1 bundle.
[INFO] 
[INFO] --- install:3.1.4:install (default-install) @ jakartaee-api-parent ---
[INFO] Installing <https://ci-builds.apache.org/job/Tomee/job/tomee-jakartaee-api-master/ws/pom.xml> to /home/jenkins/.m2/repository/org/apache/tomee/jakartaee-api-parent/11.0.0-M2-SNAPSHOT/jakartaee-api-parent-11.0.0-M2-SNAPSHOT.pom
[INFO] 
[INFO] --- enforcer:3.6.2:enforce (enforce-maven-version) @ jakartaee-api-parent ---
[INFO] 
[INFO] --- enforcer:3.6.2:enforce (enforce-java-version) @ jakartaee-api-parent ---
[INFO] 
[INFO] --- remote-resources:3.3.0:process (process-resource-bundles) @ jakartaee-api-parent ---
[INFO] Preparing remote bundle org.apache.apache.resources:apache-jar-resource-bundle:1.8
[INFO] Copying 3 resources from 1 bundle.
[INFO] 
[INFO] --- install:3.1.4:install (default-install) @ jakartaee-api-parent ---
[INFO] Installing <https://ci-builds.apache.org/job/Tomee/job/tomee-jakartaee-api-master/ws/pom.xml> to /home/jenkins/.m2/repository/org/apache/tomee/jakartaee-api-parent/11.0.0-M2-SNAPSHOT/jakartaee-api-parent-11.0.0-M2-SNAPSHOT.pom
[INFO] 
[INFO] --- deploy:3.1.4:deploy (default-deploy) @ jakartaee-api-parent ---
[INFO] Downloading from apache.snapshots.https: https://repository.apache.org/content/repositories/snapshots/org/apache/tomee/jakartaee-api-parent/11.0.0-M2-SNAPSHOT/maven-metadata.xml
[INFO] Downloaded from apache.snapshots.https: https://repository.apache.org/content/repositories/snapshots/org/apache/tomee/jakartaee-api-parent/11.0.0-M2-SNAPSHOT/maven-metadata.xml (623 B at 727 B/s)
[INFO] Uploading to apache.snapshots.https: https://repository.apache.org/content/repositories/snapshots/org/apache/tomee/jakartaee-api-parent/11.0.0-M2-SNAPSHOT/jakartaee-api-parent-11.0.0-M2-20260629.122017-43.pom
[INFO] Uploaded to apache.snapshots.https: https://repository.apache.org/content/repositories/snapshots/org/apache/tomee/jakartaee-api-parent/11.0.0-M2-SNAPSHOT/jakartaee-api-parent-11.0.0-M2-20260629.122017-43.pom (2.3 kB at 2.1 kB/s)
[INFO] Downloading from apache.snapshots.https: https://repository.apache.org/content/repositories/snapshots/org/apache/tomee/jakartaee-api-parent/maven-metadata.xml
[INFO] Downloaded from apache.snapshots.https: https://repository.apache.org/content/repositories/snapshots/org/apache/tomee/jakartaee-api-parent/maven-metadata.xml (527 B at 2.7 kB/s)
[INFO] Uploading to apache.snapshots.https: https://repository.apache.org/content/repositories/snapshots/org/apache/tomee/jakartaee-api-parent/11.0.0-M2-SNAPSHOT/maven-metadata.xml
[INFO] Uploaded to apache.snapshots.https: https://repository.apache.org/content/repositories/snapshots/org/apache/tomee/jakartaee-api-parent/11.0.0-M2-SNAPSHOT/maven-metadata.xml (623 B at 578 B/s)
[INFO] Uploading to apache.snapshots.https: https://repository.apache.org/content/repositories/snapshots/org/apache/tomee/jakartaee-api-parent/maven-metadata.xml
[INFO] Uploaded to apache.snapshots.https: https://repository.apache.org/content/repositories/snapshots/org/apache/tomee/jakartaee-api-parent/maven-metadata.xml (527 B at 489 B/s)
[WARNING] Attempt to (de-)serialize anonymous class org.jfrog.hudson.maven2.MavenDependenciesRecorder$1; see: https://jenkins.io/redirect/serialization-of-anonymous-classes/
[INFO] 
[INFO] -------------------< org.apache.tomee:jakartaee-api >-------------------
[INFO] Building Apache TomEE :: Jakarta EE 11 Full API 11.0.0-M2-SNAPSHOT [2/3]
[INFO]   from api/pom.xml
[INFO] --------------------------------[ jar ]---------------------------------
[INFO] 
[INFO] --- clean:3.1.0:clean (default-clean) @ jakartaee-api ---
[INFO] 
[INFO] --- enforcer:3.6.2:enforce (enforce-maven-version) @ jakartaee-api ---
[INFO] 
[INFO] --- enforcer:3.6.2:enforce (enforce-java-version) @ jakartaee-api ---
[INFO] 
[INFO] --- remote-resources:3.3.0:process (process-resource-bundles) @ jakartaee-api ---
[INFO] Preparing remote bundle org.apache.apache.resources:apache-jar-resource-bundle:1.8
[INFO] Copying 3 resources from 1 bundle.
[INFO] 
[INFO] --- resources:3.5.0:resources (default-resources) @ jakartaee-api ---
[INFO] Copying 1 resource from src/main/resources to target/classes
[INFO] Copying 1 resource from src/main/filtered-resources to target/classes
[INFO] Copying 3 resources from target/maven-shared-archive-resources to target/classes
[INFO] 
[INFO] --- compiler:3.8.1:compile (default-compile) @ jakartaee-api ---
[INFO] Changes detected - recompiling the module!
[INFO] Compiling 2 source files to <https://ci-builds.apache.org/job/Tomee/job/tomee-jakartaee-api-master/ws/api/target/classes>
[INFO] -------------------------------------------------------------
[ERROR] COMPILATION ERROR : 
[INFO] -------------------------------------------------------------
[ERROR] error: release version 17 not supported
[INFO] 1 error
[INFO] -------------------------------------------------------------
[INFO] 
[INFO] -----------------< org.apache.tomee:jakartaee-api-tck >-----------------
[INFO] Building Apache TomEE :: Jakarta EE 11 Full API :: Signature Tests 11.0.0-M2-SNAPSHOT [3/3]
[INFO]   from tck/pom.xml
[INFO] --------------------------------[ pom ]---------------------------------
[INFO] 
[INFO] --- clean:3.5.0:clean (default-clean) @ jakartaee-api-tck ---
[INFO] 
[INFO] --- enforcer:3.6.2:enforce (enforce-maven-version) @ jakartaee-api-tck ---
[INFO] 
[INFO] --- enforcer:3.6.2:enforce (enforce-java-version) @ jakartaee-api-tck ---
[INFO] 
[INFO] --- dependency:3.10.0:unpack (unpack-classes) @ jakartaee-api-tck ---
[INFO] ------------------------------------------------------------------------
[INFO] Reactor Summary for Apache TomEE :: Jakarta EE 11 Full API :: Parent 11.0.0-M2-SNAPSHOT:
[INFO] 
[INFO] Apache TomEE :: Jakarta EE 11 Full API :: Parent ... SUCCESS [ 20.129 s]
[INFO] Apache TomEE :: Jakarta EE 11 Full API ............. FAILURE [  5.500 s]
[INFO] Apache TomEE :: Jakarta EE 11 Full API :: Signature Tests FAILURE [  2.883 s]
[INFO] ------------------------------------------------------------------------
[INFO] BUILD FAILURE
[INFO] ------------------------------------------------------------------------
[INFO] Total time:  41.633 s
[INFO] Finished at: 2026-06-29T12:20:59Z
[INFO] ------------------------------------------------------------------------
Waiting for Jenkins to finish collecting data
[ERROR] Failed to execute goal org.apache.maven.plugins:maven-compiler-plugin:3.8.1:compile (default-compile) on project jakartaee-api: Compilation failure
[ERROR] error: release version 17 not supported
[ERROR] -> [Help 1]
[ERROR] Failed to execute goal org.apache.maven.plugins:maven-dependency-plugin:3.10.0:unpack (unpack-classes) on project jakartaee-api-tck: Unable to find/resolve artifact. The following artifacts could not be resolved: org.apache.tomee:jakartaee-api:jar:11.0.0-M2-SNAPSHOT (absent): Could not find artifact org.apache.tomee:jakartaee-api:jar:11.0.0-M2-SNAPSHOT -> [Help 2]
[ERROR] 
[ERROR] To see the full stack trace of the errors, re-run Maven with the -e switch.
[ERROR] Re-run Maven using the -X switch to enable full debug logging.
[ERROR] 
[ERROR] For more information about the errors and possible solutions, please read the following articles:
[ERROR] [Help 1] http://cwiki.apache.org/confluence/display/MAVEN/MojoFailureException
[ERROR] [Help 2] http://cwiki.apache.org/confluence/display/MAVEN/MojoExecutionException
[ERROR] 
[ERROR] After correcting the problems, you can resume the build with the command
[ERROR]   mvn <goals> -rf :jakartaee-api
[JENKINS] Archiving <https://ci-builds.apache.org/job/Tomee/job/tomee-jakartaee-api-master/ws/pom.xml> to org.apache.tomee/jakartaee-api-parent/11.0.0-M2-SNAPSHOT/jakartaee-api-parent-11.0.0-M2-SNAPSHOT.pom
[JENKINS] Archiving <https://ci-builds.apache.org/job/Tomee/job/tomee-jakartaee-api-master/ws/api/pom.xml> to org.apache.tomee/jakartaee-api/11.0.0-M2-SNAPSHOT/jakartaee-api-11.0.0-M2-SNAPSHOT.pom
[JENKINS] Archiving <https://ci-builds.apache.org/job/Tomee/job/tomee-jakartaee-api-master/ws/tck/pom.xml> to org.apache.tomee/jakartaee-api-tck/11.0.0-M2-SNAPSHOT/jakartaee-api-tck-11.0.0-M2-SNAPSHOT.pom
Sending e-mails to: commits@tomee.apache.org
Sending e-mails to: commits@tomee.apache.org
channel stopped

Build failed in Jenkins: TomEE » tomee-jakartaee-api-master #1626

Posted by Apache Jenkins Server <je...@builds.apache.org>.
See <https://ci-builds.apache.org/job/Tomee/job/tomee-jakartaee-api-master/1626/display/redirect>

Changes:


------------------------------------------
Started by timer
Running as SYSTEM
[EnvInject] - Loading node environment variables.
Building remotely on builds32 (ubuntu) in workspace <https://ci-builds.apache.org/job/Tomee/job/tomee-jakartaee-api-master/ws/>
The recommended git tool is: NONE
No credentials specified
 > git rev-parse --resolve-git-dir <https://ci-builds.apache.org/job/Tomee/job/tomee-jakartaee-api-master/ws/.git> # timeout=10
Fetching changes from the remote Git repository
 > git config remote.origin.url https://github.com/apache/tomee-jakartaee-api # timeout=10
Cleaning workspace
 > git rev-parse --verify HEAD # timeout=10
Resetting working tree
 > git reset --hard # timeout=10
 > git clean -fdx # timeout=10
Fetching upstream changes from https://github.com/apache/tomee-jakartaee-api
 > git --version # timeout=10
 > git --version # 'git version 2.34.1'
 > git fetch --tags --force --progress -- https://github.com/apache/tomee-jakartaee-api +refs/heads/*:refs/remotes/origin/* # timeout=10
 > git rev-parse refs/remotes/origin/main^{commit} # timeout=10
Checking out Revision c531599fb0d0f9bdb326e28cff23baaaf65af5f5 (refs/remotes/origin/main)
 > git config core.sparsecheckout # timeout=10
 > git checkout -f c531599fb0d0f9bdb326e28cff23baaaf65af5f5 # timeout=10
Commit message: "[maven-release-plugin] prepare for next development iteration"
 > git rev-list --no-walk c531599fb0d0f9bdb326e28cff23baaaf65af5f5 # timeout=10
Parsing POMs
Established TCP socket on 39435
maven35-agent.jar already up to date
maven35-interceptor.jar already up to date
maven3-interceptor-commons.jar already up to date
[tomee-jakartaee-api-master] $ /home/jenkins/tools/java/latest11/bin/java -Xmx1536m -cp /home/jenkins/jenkins-agent/maven35-agent.jar:/home/jenkins/tools/maven/latest/boot/plexus-classworlds-2.9.0.jar:/home/jenkins/tools/maven/latest/conf/logging jenkins.maven3.agent.Maven35Main /home/jenkins/tools/maven/latest /home/jenkins/jenkins-agent/agent.jar /home/jenkins/jenkins-agent/maven35-interceptor.jar /home/jenkins/jenkins-agent/maven3-interceptor-commons.jar 39435
<===[JENKINS REMOTING CAPACITY]===>   channel started
Jul 07, 2026 12:19:14 PM hudson.remoting.UserRequest perform
WARNING: LinkageError while performing UserRequest:hudson.maven.AbstractMavenProcessFactory$ConfigureOriginalJDK@176d3ab7
java.lang.UnsupportedClassVersionError: Failed to load hudson.maven.AbstractMavenProcessFactory$ConfigureOriginalJDK
	at hudson.remoting.RemoteClassLoader.loadClassFile(RemoteClassLoader.java:472)
	at hudson.remoting.RemoteClassLoader.loadRemoteClass(RemoteClassLoader.java:301)
	at hudson.remoting.RemoteClassLoader.loadWithMultiClassLoader(RemoteClassLoader.java:277)
	at hudson.remoting.RemoteClassLoader.findClass(RemoteClassLoader.java:236)
	at java.base/java.lang.ClassLoader.loadClass(ClassLoader.java:594)
	at java.base/java.lang.ClassLoader.loadClass(ClassLoader.java:527)
	at java.base/java.lang.Class.forName0(Native Method)
	at java.base/java.lang.Class.forName(Class.java:398)
	at hudson.remoting.MultiClassLoaderSerializer$Input.resolveClass(MultiClassLoaderSerializer.java:133)
	at java.base/java.io.ObjectInputStream.readNonProxyDesc(ObjectInputStream.java:2003)
	at java.base/java.io.ObjectInputStream.readClassDesc(ObjectInputStream.java:1870)
	at java.base/java.io.ObjectInputStream.readOrdinaryObject(ObjectInputStream.java:2201)
	at java.base/java.io.ObjectInputStream.readObject0(ObjectInputStream.java:1687)
	at java.base/java.io.ObjectInputStream.readObject(ObjectInputStream.java:489)
	at java.base/java.io.ObjectInputStream.readObject(ObjectInputStream.java:447)
	at hudson.remoting.UserRequest.deserialize(UserRequest.java:312)
	at hudson.remoting.UserRequest.perform(UserRequest.java:196)
	at hudson.remoting.UserRequest.perform(UserRequest.java:50)
	at hudson.remoting.Request$2.run(Request.java:391)
	at hudson.remoting.InterceptingExecutorService.lambda$wrap$0(InterceptingExecutorService.java:81)
	at java.base/java.util.concurrent.FutureTask.run(FutureTask.java:264)
	at java.base/java.util.concurrent.ThreadPoolExecutor.runWorker(ThreadPoolExecutor.java:1128)
	at java.base/java.util.concurrent.ThreadPoolExecutor$Worker.run(ThreadPoolExecutor.java:628)
	at java.base/java.lang.Thread.run(Thread.java:829)
Caused by: java.lang.UnsupportedClassVersionError: Failed to load jenkins.security.MasterToSlaveCallable
	at hudson.remoting.RemoteClassLoader.loadClassFile(RemoteClassLoader.java:472)
	at hudson.remoting.RemoteClassLoader.loadRemoteClass(RemoteClassLoader.java:301)
	at hudson.remoting.RemoteClassLoader.loadWithMultiClassLoader(RemoteClassLoader.java:277)
	at hudson.remoting.RemoteClassLoader.findClass(RemoteClassLoader.java:236)
	at java.base/java.lang.ClassLoader.loadClass(ClassLoader.java:594)
	at java.base/java.lang.ClassLoader.loadClass(ClassLoader.java:527)
	at java.base/java.lang.ClassLoader.defineClass1(Native Method)
	at java.base/java.lang.ClassLoader.defineClass(ClassLoader.java:1022)
	at java.base/java.lang.ClassLoader.defineClass(ClassLoader.java:883)
	at hudson.remoting.RemoteClassLoader.loadClassFile(RemoteClassLoader.java:470)
	... 23 more
Caused by: java.lang.UnsupportedClassVersionError: jenkins/security/MasterToSlaveCallable has been compiled by a more recent version of the Java Runtime (class file version 61.0), this version of the Java Runtime only recognizes class file versions up to 55.0
	at java.base/java.lang.ClassLoader.defineClass1(Native Method)
	at java.base/java.lang.ClassLoader.defineClass(ClassLoader.java:1022)
	at java.base/java.lang.ClassLoader.defineClass(ClassLoader.java:883)
	at hudson.remoting.RemoteClassLoader.loadClassFile(RemoteClassLoader.java:470)
	... 32 more

ERROR: ================================================================================
ERROR: Invalid project setup: Failed to load hudson.maven.AbstractMavenProcessFactory$ConfigureOriginalJDK
ERROR: [JENKINS-18403][JENKINS-28294] JDK 'jdk_11_latest' not supported to run Maven projects.
ERROR: Maven projects have to be launched with a Java version greater or equal to the minimum version required by the controller.
ERROR: Use the Maven JDK Toolchains (plugin) to build your maven project with an older JDK.
ERROR: Retrying with agent Java and setting compile/test properties to point to /home/jenkins/tools/java/latest11.
ERROR: ================================================================================
Established TCP socket on 35785
maven35-agent.jar already up to date
maven35-interceptor.jar already up to date
maven3-interceptor-commons.jar already up to date
[tomee-jakartaee-api-master] $ /usr/local/asfpackages/java/adoptium-jdk-17.0.12+7/bin/java -Xmx1536m -cp /home/jenkins/jenkins-agent/maven35-agent.jar:/home/jenkins/tools/maven/latest/boot/plexus-classworlds-2.9.0.jar:/home/jenkins/tools/maven/latest/conf/logging jenkins.maven3.agent.Maven35Main /home/jenkins/tools/maven/latest /home/jenkins/jenkins-agent/agent.jar /home/jenkins/jenkins-agent/maven35-interceptor.jar /home/jenkins/jenkins-agent/maven3-interceptor-commons.jar 35785
<===[JENKINS REMOTING CAPACITY]===>   channel started
Executing Maven:  -B -f <https://ci-builds.apache.org/job/Tomee/job/tomee-jakartaee-api-master/ws/pom.xml> -U --show-version --fail-at-end clean install deploy -Dfile.encoding=UTF-8
Apache Maven 3.9.11 (3e54c93a704957b63ee3494413a2b544fd3d825b)
Maven home: /usr/local/asfpackages/maven/apache-maven-3.9.11
Java version: 17.0.12, vendor: Eclipse Adoptium, runtime: /usr/local/asfpackages/java/adoptium-jdk-17.0.12+7
Default locale: en_US, platform encoding: UTF-8
OS name: "linux", version: "5.15.0-164-generic", arch: "amd64", family: "unix"
[INFO] Scanning for projects...
[INFO] ------------------------------------------------------------------------
[INFO] Reactor Build Order:
[INFO] 
[HUDSON] Collecting dependencies info
[HUDSON] Collecting dependencies info
[HUDSON] Collecting dependencies info
[INFO] Apache TomEE :: Jakarta EE 11 Full API :: Parent                   [pom]
[INFO] Apache TomEE :: Jakarta EE 11 Full API                             [jar]
[INFO] Apache TomEE :: Jakarta EE 11 Full API :: Signature Tests          [pom]
[INFO] 
[INFO] ---------------< org.apache.tomee:jakartaee-api-parent >----------------
[INFO] Building Apache TomEE :: Jakarta EE 11 Full API :: Parent 11.0.0-M2-SNAPSHOT [1/3]
[INFO]   from pom.xml
[INFO] --------------------------------[ pom ]---------------------------------
[INFO] 
[INFO] --- clean:3.5.0:clean (default-clean) @ jakartaee-api-parent ---
[INFO] 
[INFO] --- enforcer:3.6.2:enforce (enforce-maven-version) @ jakartaee-api-parent ---
[INFO] Rule 0: org.apache.maven.enforcer.rules.version.RequireMavenVersion passed
[INFO] 
[INFO] --- enforcer:3.6.2:enforce (enforce-java-version) @ jakartaee-api-parent ---
[INFO] Rule 0: org.apache.maven.enforcer.rules.version.RequireJavaVersion passed
[INFO] 
[INFO] --- remote-resources:3.3.0:process (process-resource-bundles) @ jakartaee-api-parent ---
[INFO] Preparing remote bundle org.apache.apache.resources:apache-jar-resource-bundle:1.8
[INFO] Copying 3 resources from 1 bundle.
[INFO] 
[INFO] --- install:3.1.4:install (default-install) @ jakartaee-api-parent ---
[INFO] Installing <https://ci-builds.apache.org/job/Tomee/job/tomee-jakartaee-api-master/ws/pom.xml> to /home/jenkins/.m2/repository/org/apache/tomee/jakartaee-api-parent/11.0.0-M2-SNAPSHOT/jakartaee-api-parent-11.0.0-M2-SNAPSHOT.pom
[INFO] 
[INFO] --- enforcer:3.6.2:enforce (enforce-maven-version) @ jakartaee-api-parent ---
[INFO] 
[INFO] --- enforcer:3.6.2:enforce (enforce-java-version) @ jakartaee-api-parent ---
[INFO] 
[INFO] --- remote-resources:3.3.0:process (process-resource-bundles) @ jakartaee-api-parent ---
[INFO] Preparing remote bundle org.apache.apache.resources:apache-jar-resource-bundle:1.8
[INFO] Copying 3 resources from 1 bundle.
[INFO] 
[INFO] --- install:3.1.4:install (default-install) @ jakartaee-api-parent ---
[INFO] Installing <https://ci-builds.apache.org/job/Tomee/job/tomee-jakartaee-api-master/ws/pom.xml> to /home/jenkins/.m2/repository/org/apache/tomee/jakartaee-api-parent/11.0.0-M2-SNAPSHOT/jakartaee-api-parent-11.0.0-M2-SNAPSHOT.pom
[INFO] 
[INFO] --- deploy:3.1.4:deploy (default-deploy) @ jakartaee-api-parent ---
[INFO] Downloading from apache.snapshots.https: https://repository.apache.org/content/repositories/snapshots/org/apache/tomee/jakartaee-api-parent/11.0.0-M2-SNAPSHOT/maven-metadata.xml
[INFO] Downloaded from apache.snapshots.https: https://repository.apache.org/content/repositories/snapshots/org/apache/tomee/jakartaee-api-parent/11.0.0-M2-SNAPSHOT/maven-metadata.xml (623 B at 668 B/s)
[INFO] Uploading to apache.snapshots.https: https://repository.apache.org/content/repositories/snapshots/org/apache/tomee/jakartaee-api-parent/11.0.0-M2-SNAPSHOT/jakartaee-api-parent-11.0.0-M2-20260707.121945-59.pom
[INFO] Uploaded to apache.snapshots.https: https://repository.apache.org/content/repositories/snapshots/org/apache/tomee/jakartaee-api-parent/11.0.0-M2-SNAPSHOT/jakartaee-api-parent-11.0.0-M2-20260707.121945-59.pom (2.3 kB at 2.1 kB/s)
[INFO] Downloading from apache.snapshots.https: https://repository.apache.org/content/repositories/snapshots/org/apache/tomee/jakartaee-api-parent/maven-metadata.xml
[INFO] Downloaded from apache.snapshots.https: https://repository.apache.org/content/repositories/snapshots/org/apache/tomee/jakartaee-api-parent/maven-metadata.xml (527 B at 2.8 kB/s)
[INFO] Uploading to apache.snapshots.https: https://repository.apache.org/content/repositories/snapshots/org/apache/tomee/jakartaee-api-parent/11.0.0-M2-SNAPSHOT/maven-metadata.xml
[INFO] Uploaded to apache.snapshots.https: https://repository.apache.org/content/repositories/snapshots/org/apache/tomee/jakartaee-api-parent/11.0.0-M2-SNAPSHOT/maven-metadata.xml (623 B at 582 B/s)
[INFO] Uploading to apache.snapshots.https: https://repository.apache.org/content/repositories/snapshots/org/apache/tomee/jakartaee-api-parent/maven-metadata.xml
[INFO] Uploaded to apache.snapshots.https: https://repository.apache.org/content/repositories/snapshots/org/apache/tomee/jakartaee-api-parent/maven-metadata.xml (527 B at 492 B/s)
[WARNING] Attempt to (de-)serialize anonymous class org.jfrog.hudson.maven2.MavenDependenciesRecorder$1; see: https://jenkins.io/redirect/serialization-of-anonymous-classes/
[INFO] 
[INFO] -------------------< org.apache.tomee:jakartaee-api >-------------------
[INFO] Building Apache TomEE :: Jakarta EE 11 Full API 11.0.0-M2-SNAPSHOT [2/3]
[INFO]   from api/pom.xml
[INFO] --------------------------------[ jar ]---------------------------------
[INFO] 
[INFO] --- clean:3.1.0:clean (default-clean) @ jakartaee-api ---
[INFO] 
[INFO] --- enforcer:3.6.2:enforce (enforce-maven-version) @ jakartaee-api ---
[INFO] 
[INFO] --- enforcer:3.6.2:enforce (enforce-java-version) @ jakartaee-api ---
[INFO] 
[INFO] --- remote-resources:3.3.0:process (process-resource-bundles) @ jakartaee-api ---
[INFO] Preparing remote bundle org.apache.apache.resources:apache-jar-resource-bundle:1.8
[INFO] Copying 3 resources from 1 bundle.
[INFO] 
[INFO] --- resources:3.5.0:resources (default-resources) @ jakartaee-api ---
[INFO] Copying 1 resource from src/main/resources to target/classes
[INFO] Copying 1 resource from src/main/filtered-resources to target/classes
[INFO] Copying 3 resources from target/maven-shared-archive-resources to target/classes
[INFO] 
[INFO] --- compiler:3.8.1:compile (default-compile) @ jakartaee-api ---
[INFO] Changes detected - recompiling the module!
[INFO] Compiling 2 source files to <https://ci-builds.apache.org/job/Tomee/job/tomee-jakartaee-api-master/ws/api/target/classes>
[INFO] -------------------------------------------------------------
[ERROR] COMPILATION ERROR : 
[INFO] -------------------------------------------------------------
[ERROR] error: release version 17 not supported
[INFO] 1 error
[INFO] -------------------------------------------------------------
[INFO] 
[INFO] -----------------< org.apache.tomee:jakartaee-api-tck >-----------------
[INFO] Building Apache TomEE :: Jakarta EE 11 Full API :: Signature Tests 11.0.0-M2-SNAPSHOT [3/3]
[INFO]   from tck/pom.xml
[INFO] --------------------------------[ pom ]---------------------------------
[INFO] 
[INFO] --- clean:3.5.0:clean (default-clean) @ jakartaee-api-tck ---
[INFO] 
[INFO] --- enforcer:3.6.2:enforce (enforce-maven-version) @ jakartaee-api-tck ---
[INFO] 
[INFO] --- enforcer:3.6.2:enforce (enforce-java-version) @ jakartaee-api-tck ---
[INFO] 
[INFO] --- dependency:3.10.0:unpack (unpack-classes) @ jakartaee-api-tck ---
[INFO] ------------------------------------------------------------------------
[INFO] Reactor Summary for Apache TomEE :: Jakarta EE 11 Full API :: Parent 11.0.0-M2-SNAPSHOT:
[INFO] 
[INFO] Apache TomEE :: Jakarta EE 11 Full API :: Parent ... SUCCESS [ 16.101 s]
[INFO] Apache TomEE :: Jakarta EE 11 Full API ............. FAILURE [  5.341 s]
[INFO] Apache TomEE :: Jakarta EE 11 Full API :: Signature Tests FAILURE [  3.198 s]
[INFO] ------------------------------------------------------------------------
[INFO] BUILD FAILURE
[INFO] ------------------------------------------------------------------------
[INFO] Total time:  37.445 s
[INFO] Finished at: 2026-07-07T12:20:23Z
[INFO] ------------------------------------------------------------------------
Waiting for Jenkins to finish collecting data
[ERROR] Failed to execute goal org.apache.maven.plugins:maven-compiler-plugin:3.8.1:compile (default-compile) on project jakartaee-api: Compilation failure
[ERROR] error: release version 17 not supported
[ERROR] -> [Help 1]
[ERROR] Failed to execute goal org.apache.maven.plugins:maven-dependency-plugin:3.10.0:unpack (unpack-classes) on project jakartaee-api-tck: Unable to find/resolve artifact. The following artifacts could not be resolved: org.apache.tomee:jakartaee-api:jar:11.0.0-M2-SNAPSHOT (absent): Could not find artifact org.apache.tomee:jakartaee-api:jar:11.0.0-M2-SNAPSHOT -> [Help 2]
[ERROR] 
[ERROR] To see the full stack trace of the errors, re-run Maven with the -e switch.
[ERROR] Re-run Maven using the -X switch to enable full debug logging.
[ERROR] 
[ERROR] For more information about the errors and possible solutions, please read the following articles:
[ERROR] [Help 1] http://cwiki.apache.org/confluence/display/MAVEN/MojoFailureException
[ERROR] [Help 2] http://cwiki.apache.org/confluence/display/MAVEN/MojoExecutionException
[ERROR] 
[ERROR] After correcting the problems, you can resume the build with the command
[ERROR]   mvn <goals> -rf :jakartaee-api
[JENKINS] Archiving <https://ci-builds.apache.org/job/Tomee/job/tomee-jakartaee-api-master/ws/pom.xml> to org.apache.tomee/jakartaee-api-parent/11.0.0-M2-SNAPSHOT/jakartaee-api-parent-11.0.0-M2-SNAPSHOT.pom
[JENKINS] Archiving <https://ci-builds.apache.org/job/Tomee/job/tomee-jakartaee-api-master/ws/api/pom.xml> to org.apache.tomee/jakartaee-api/11.0.0-M2-SNAPSHOT/jakartaee-api-11.0.0-M2-SNAPSHOT.pom
[JENKINS] Archiving <https://ci-builds.apache.org/job/Tomee/job/tomee-jakartaee-api-master/ws/tck/pom.xml> to org.apache.tomee/jakartaee-api-tck/11.0.0-M2-SNAPSHOT/jakartaee-api-tck-11.0.0-M2-SNAPSHOT.pom
Sending e-mails to: commits@tomee.apache.org
Sending e-mails to: commits@tomee.apache.org
channel stopped

Build failed in Jenkins: TomEE » tomee-jakartaee-api-master #1625

Posted by Apache Jenkins Server <je...@builds.apache.org>.
See <https://ci-builds.apache.org/job/Tomee/job/tomee-jakartaee-api-master/1625/display/redirect>

Changes:


------------------------------------------
Started by timer
Running as SYSTEM
[EnvInject] - Loading node environment variables.
Building remotely on builds32 (ubuntu) in workspace <https://ci-builds.apache.org/job/Tomee/job/tomee-jakartaee-api-master/ws/>
The recommended git tool is: NONE
No credentials specified
 > git rev-parse --resolve-git-dir <https://ci-builds.apache.org/job/Tomee/job/tomee-jakartaee-api-master/ws/.git> # timeout=10
Fetching changes from the remote Git repository
 > git config remote.origin.url https://github.com/apache/tomee-jakartaee-api # timeout=10
Cleaning workspace
 > git rev-parse --verify HEAD # timeout=10
Resetting working tree
 > git reset --hard # timeout=10
 > git clean -fdx # timeout=10
Fetching upstream changes from https://github.com/apache/tomee-jakartaee-api
 > git --version # timeout=10
 > git --version # 'git version 2.34.1'
 > git fetch --tags --force --progress -- https://github.com/apache/tomee-jakartaee-api +refs/heads/*:refs/remotes/origin/* # timeout=10
 > git rev-parse refs/remotes/origin/main^{commit} # timeout=10
Checking out Revision c531599fb0d0f9bdb326e28cff23baaaf65af5f5 (refs/remotes/origin/main)
 > git config core.sparsecheckout # timeout=10
 > git checkout -f c531599fb0d0f9bdb326e28cff23baaaf65af5f5 # timeout=10
Commit message: "[maven-release-plugin] prepare for next development iteration"
 > git rev-list --no-walk c531599fb0d0f9bdb326e28cff23baaaf65af5f5 # timeout=10
Parsing POMs
Established TCP socket on 33007
maven35-agent.jar already up to date
maven35-interceptor.jar already up to date
maven3-interceptor-commons.jar already up to date
[tomee-jakartaee-api-master] $ /home/jenkins/tools/java/latest11/bin/java -Xmx1536m -cp /home/jenkins/jenkins-agent/maven35-agent.jar:/home/jenkins/tools/maven/latest/boot/plexus-classworlds-2.9.0.jar:/home/jenkins/tools/maven/latest/conf/logging jenkins.maven3.agent.Maven35Main /home/jenkins/tools/maven/latest /home/jenkins/jenkins-agent/agent.jar /home/jenkins/jenkins-agent/maven35-interceptor.jar /home/jenkins/jenkins-agent/maven3-interceptor-commons.jar 33007
<===[JENKINS REMOTING CAPACITY]===>   channel started
Jul 06, 2026 12:19:14 PM hudson.remoting.UserRequest perform
WARNING: LinkageError while performing UserRequest:hudson.maven.AbstractMavenProcessFactory$ConfigureOriginalJDK@4d353aa7
java.lang.UnsupportedClassVersionError: Failed to load hudson.maven.AbstractMavenProcessFactory$ConfigureOriginalJDK
	at hudson.remoting.RemoteClassLoader.loadClassFile(RemoteClassLoader.java:472)
	at hudson.remoting.RemoteClassLoader.loadRemoteClass(RemoteClassLoader.java:301)
	at hudson.remoting.RemoteClassLoader.loadWithMultiClassLoader(RemoteClassLoader.java:277)
	at hudson.remoting.RemoteClassLoader.findClass(RemoteClassLoader.java:236)
	at java.base/java.lang.ClassLoader.loadClass(ClassLoader.java:594)
	at java.base/java.lang.ClassLoader.loadClass(ClassLoader.java:527)
	at java.base/java.lang.Class.forName0(Native Method)
	at java.base/java.lang.Class.forName(Class.java:398)
	at hudson.remoting.MultiClassLoaderSerializer$Input.resolveClass(MultiClassLoaderSerializer.java:133)
	at java.base/java.io.ObjectInputStream.readNonProxyDesc(ObjectInputStream.java:2003)
	at java.base/java.io.ObjectInputStream.readClassDesc(ObjectInputStream.java:1870)
	at java.base/java.io.ObjectInputStream.readOrdinaryObject(ObjectInputStream.java:2201)
	at java.base/java.io.ObjectInputStream.readObject0(ObjectInputStream.java:1687)
	at java.base/java.io.ObjectInputStream.readObject(ObjectInputStream.java:489)
	at java.base/java.io.ObjectInputStream.readObject(ObjectInputStream.java:447)
	at hudson.remoting.UserRequest.deserialize(UserRequest.java:312)
	at hudson.remoting.UserRequest.perform(UserRequest.java:196)
	at hudson.remoting.UserRequest.perform(UserRequest.java:50)
	at hudson.remoting.Request$2.run(Request.java:391)
	at hudson.remoting.InterceptingExecutorService.lambda$wrap$0(InterceptingExecutorService.java:81)
	at java.base/java.util.concurrent.FutureTask.run(FutureTask.java:264)
	at java.base/java.util.concurrent.ThreadPoolExecutor.runWorker(ThreadPoolExecutor.java:1128)
	at java.base/java.util.concurrent.ThreadPoolExecutor$Worker.run(ThreadPoolExecutor.java:628)
	at java.base/java.lang.Thread.run(Thread.java:829)
Caused by: java.lang.UnsupportedClassVersionError: Failed to load jenkins.security.MasterToSlaveCallable
	at hudson.remoting.RemoteClassLoader.loadClassFile(RemoteClassLoader.java:472)
	at hudson.remoting.RemoteClassLoader.loadRemoteClass(RemoteClassLoader.java:301)
	at hudson.remoting.RemoteClassLoader.loadWithMultiClassLoader(RemoteClassLoader.java:277)
	at hudson.remoting.RemoteClassLoader.findClass(RemoteClassLoader.java:236)
	at java.base/java.lang.ClassLoader.loadClass(ClassLoader.java:594)
	at java.base/java.lang.ClassLoader.loadClass(ClassLoader.java:527)
	at java.base/java.lang.ClassLoader.defineClass1(Native Method)
	at java.base/java.lang.ClassLoader.defineClass(ClassLoader.java:1022)
	at java.base/java.lang.ClassLoader.defineClass(ClassLoader.java:883)
	at hudson.remoting.RemoteClassLoader.loadClassFile(RemoteClassLoader.java:470)
	... 23 more
Caused by: java.lang.UnsupportedClassVersionError: jenkins/security/MasterToSlaveCallable has been compiled by a more recent version of the Java Runtime (class file version 61.0), this version of the Java Runtime only recognizes class file versions up to 55.0
	at java.base/java.lang.ClassLoader.defineClass1(Native Method)
	at java.base/java.lang.ClassLoader.defineClass(ClassLoader.java:1022)
	at java.base/java.lang.ClassLoader.defineClass(ClassLoader.java:883)
	at hudson.remoting.RemoteClassLoader.loadClassFile(RemoteClassLoader.java:470)
	... 32 more

ERROR: ================================================================================
ERROR: Invalid project setup: Failed to load hudson.maven.AbstractMavenProcessFactory$ConfigureOriginalJDK
ERROR: [JENKINS-18403][JENKINS-28294] JDK 'jdk_11_latest' not supported to run Maven projects.
ERROR: Maven projects have to be launched with a Java version greater or equal to the minimum version required by the controller.
ERROR: Use the Maven JDK Toolchains (plugin) to build your maven project with an older JDK.
ERROR: Retrying with agent Java and setting compile/test properties to point to /home/jenkins/tools/java/latest11.
ERROR: ================================================================================
Established TCP socket on 45447
maven35-agent.jar already up to date
maven35-interceptor.jar already up to date
maven3-interceptor-commons.jar already up to date
[tomee-jakartaee-api-master] $ /usr/local/asfpackages/java/adoptium-jdk-17.0.12+7/bin/java -Xmx1536m -cp /home/jenkins/jenkins-agent/maven35-agent.jar:/home/jenkins/tools/maven/latest/boot/plexus-classworlds-2.9.0.jar:/home/jenkins/tools/maven/latest/conf/logging jenkins.maven3.agent.Maven35Main /home/jenkins/tools/maven/latest /home/jenkins/jenkins-agent/agent.jar /home/jenkins/jenkins-agent/maven35-interceptor.jar /home/jenkins/jenkins-agent/maven3-interceptor-commons.jar 45447
<===[JENKINS REMOTING CAPACITY]===>   channel started
Executing Maven:  -B -f <https://ci-builds.apache.org/job/Tomee/job/tomee-jakartaee-api-master/ws/pom.xml> -U --show-version --fail-at-end clean install deploy -Dfile.encoding=UTF-8
Apache Maven 3.9.11 (3e54c93a704957b63ee3494413a2b544fd3d825b)
Maven home: /usr/local/asfpackages/maven/apache-maven-3.9.11
Java version: 17.0.12, vendor: Eclipse Adoptium, runtime: /usr/local/asfpackages/java/adoptium-jdk-17.0.12+7
Default locale: en_US, platform encoding: UTF-8
OS name: "linux", version: "5.15.0-164-generic", arch: "amd64", family: "unix"
[INFO] Scanning for projects...
[INFO] ------------------------------------------------------------------------
[INFO] Reactor Build Order:
[INFO] 
[HUDSON] Collecting dependencies info
[HUDSON] Collecting dependencies info
[HUDSON] Collecting dependencies info
[INFO] Apache TomEE :: Jakarta EE 11 Full API :: Parent                   [pom]
[INFO] Apache TomEE :: Jakarta EE 11 Full API                             [jar]
[INFO] Apache TomEE :: Jakarta EE 11 Full API :: Signature Tests          [pom]
[INFO] 
[INFO] ---------------< org.apache.tomee:jakartaee-api-parent >----------------
[INFO] Building Apache TomEE :: Jakarta EE 11 Full API :: Parent 11.0.0-M2-SNAPSHOT [1/3]
[INFO]   from pom.xml
[INFO] --------------------------------[ pom ]---------------------------------
[INFO] 
[INFO] --- clean:3.5.0:clean (default-clean) @ jakartaee-api-parent ---
[INFO] 
[INFO] --- enforcer:3.6.2:enforce (enforce-maven-version) @ jakartaee-api-parent ---
[INFO] Rule 0: org.apache.maven.enforcer.rules.version.RequireMavenVersion passed
[INFO] 
[INFO] --- enforcer:3.6.2:enforce (enforce-java-version) @ jakartaee-api-parent ---
[INFO] Rule 0: org.apache.maven.enforcer.rules.version.RequireJavaVersion passed
[INFO] 
[INFO] --- remote-resources:3.3.0:process (process-resource-bundles) @ jakartaee-api-parent ---
[INFO] Preparing remote bundle org.apache.apache.resources:apache-jar-resource-bundle:1.8
[INFO] Copying 3 resources from 1 bundle.
[INFO] 
[INFO] --- install:3.1.4:install (default-install) @ jakartaee-api-parent ---
[INFO] Installing <https://ci-builds.apache.org/job/Tomee/job/tomee-jakartaee-api-master/ws/pom.xml> to /home/jenkins/.m2/repository/org/apache/tomee/jakartaee-api-parent/11.0.0-M2-SNAPSHOT/jakartaee-api-parent-11.0.0-M2-SNAPSHOT.pom
[INFO] 
[INFO] --- enforcer:3.6.2:enforce (enforce-maven-version) @ jakartaee-api-parent ---
[INFO] 
[INFO] --- enforcer:3.6.2:enforce (enforce-java-version) @ jakartaee-api-parent ---
[INFO] 
[INFO] --- remote-resources:3.3.0:process (process-resource-bundles) @ jakartaee-api-parent ---
[INFO] Preparing remote bundle org.apache.apache.resources:apache-jar-resource-bundle:1.8
[INFO] Copying 3 resources from 1 bundle.
[INFO] 
[INFO] --- install:3.1.4:install (default-install) @ jakartaee-api-parent ---
[INFO] Installing <https://ci-builds.apache.org/job/Tomee/job/tomee-jakartaee-api-master/ws/pom.xml> to /home/jenkins/.m2/repository/org/apache/tomee/jakartaee-api-parent/11.0.0-M2-SNAPSHOT/jakartaee-api-parent-11.0.0-M2-SNAPSHOT.pom
[INFO] 
[INFO] --- deploy:3.1.4:deploy (default-deploy) @ jakartaee-api-parent ---
[INFO] Downloading from apache.snapshots.https: https://repository.apache.org/content/repositories/snapshots/org/apache/tomee/jakartaee-api-parent/11.0.0-M2-SNAPSHOT/maven-metadata.xml
[INFO] Downloaded from apache.snapshots.https: https://repository.apache.org/content/repositories/snapshots/org/apache/tomee/jakartaee-api-parent/11.0.0-M2-SNAPSHOT/maven-metadata.xml (623 B at 655 B/s)
[INFO] Uploading to apache.snapshots.https: https://repository.apache.org/content/repositories/snapshots/org/apache/tomee/jakartaee-api-parent/11.0.0-M2-SNAPSHOT/jakartaee-api-parent-11.0.0-M2-20260706.121949-57.pom
[INFO] Uploaded to apache.snapshots.https: https://repository.apache.org/content/repositories/snapshots/org/apache/tomee/jakartaee-api-parent/11.0.0-M2-SNAPSHOT/jakartaee-api-parent-11.0.0-M2-20260706.121949-57.pom (2.3 kB at 2.1 kB/s)
[INFO] Downloading from apache.snapshots.https: https://repository.apache.org/content/repositories/snapshots/org/apache/tomee/jakartaee-api-parent/maven-metadata.xml
[INFO] Downloaded from apache.snapshots.https: https://repository.apache.org/content/repositories/snapshots/org/apache/tomee/jakartaee-api-parent/maven-metadata.xml (527 B at 2.6 kB/s)
[INFO] Uploading to apache.snapshots.https: https://repository.apache.org/content/repositories/snapshots/org/apache/tomee/jakartaee-api-parent/11.0.0-M2-SNAPSHOT/maven-metadata.xml
[INFO] Uploaded to apache.snapshots.https: https://repository.apache.org/content/repositories/snapshots/org/apache/tomee/jakartaee-api-parent/11.0.0-M2-SNAPSHOT/maven-metadata.xml (623 B at 574 B/s)
[INFO] Uploading to apache.snapshots.https: https://repository.apache.org/content/repositories/snapshots/org/apache/tomee/jakartaee-api-parent/maven-metadata.xml
[INFO] Uploaded to apache.snapshots.https: https://repository.apache.org/content/repositories/snapshots/org/apache/tomee/jakartaee-api-parent/maven-metadata.xml (527 B at 485 B/s)
[WARNING] Attempt to (de-)serialize anonymous class org.jfrog.hudson.maven2.MavenDependenciesRecorder$1; see: https://jenkins.io/redirect/serialization-of-anonymous-classes/
[INFO] 
[INFO] -------------------< org.apache.tomee:jakartaee-api >-------------------
[INFO] Building Apache TomEE :: Jakarta EE 11 Full API 11.0.0-M2-SNAPSHOT [2/3]
[INFO]   from api/pom.xml
[INFO] --------------------------------[ jar ]---------------------------------
[INFO] 
[INFO] --- clean:3.1.0:clean (default-clean) @ jakartaee-api ---
[INFO] 
[INFO] --- enforcer:3.6.2:enforce (enforce-maven-version) @ jakartaee-api ---
[INFO] 
[INFO] --- enforcer:3.6.2:enforce (enforce-java-version) @ jakartaee-api ---
[INFO] 
[INFO] --- remote-resources:3.3.0:process (process-resource-bundles) @ jakartaee-api ---
[INFO] Preparing remote bundle org.apache.apache.resources:apache-jar-resource-bundle:1.8
[INFO] Copying 3 resources from 1 bundle.
[INFO] 
[INFO] --- resources:3.5.0:resources (default-resources) @ jakartaee-api ---
[INFO] Copying 1 resource from src/main/resources to target/classes
[INFO] Copying 1 resource from src/main/filtered-resources to target/classes
[INFO] Copying 3 resources from target/maven-shared-archive-resources to target/classes
[INFO] 
[INFO] --- compiler:3.8.1:compile (default-compile) @ jakartaee-api ---
[INFO] Changes detected - recompiling the module!
[INFO] Compiling 2 source files to <https://ci-builds.apache.org/job/Tomee/job/tomee-jakartaee-api-master/ws/api/target/classes>
[INFO] -------------------------------------------------------------
[ERROR] COMPILATION ERROR : 
[INFO] -------------------------------------------------------------
[ERROR] error: release version 17 not supported
[INFO] 1 error
[INFO] -------------------------------------------------------------
[INFO] 
[INFO] -----------------< org.apache.tomee:jakartaee-api-tck >-----------------
[INFO] Building Apache TomEE :: Jakarta EE 11 Full API :: Signature Tests 11.0.0-M2-SNAPSHOT [3/3]
[INFO]   from tck/pom.xml
[INFO] --------------------------------[ pom ]---------------------------------
[INFO] 
[INFO] --- clean:3.5.0:clean (default-clean) @ jakartaee-api-tck ---
[INFO] 
[INFO] --- enforcer:3.6.2:enforce (enforce-maven-version) @ jakartaee-api-tck ---
[INFO] 
[INFO] --- enforcer:3.6.2:enforce (enforce-java-version) @ jakartaee-api-tck ---
[INFO] 
[INFO] --- dependency:3.10.0:unpack (unpack-classes) @ jakartaee-api-tck ---
[INFO] ------------------------------------------------------------------------
[INFO] Reactor Summary for Apache TomEE :: Jakarta EE 11 Full API :: Parent 11.0.0-M2-SNAPSHOT:
[INFO] 
[INFO] Apache TomEE :: Jakarta EE 11 Full API :: Parent ... SUCCESS [ 17.011 s]
[INFO] Apache TomEE :: Jakarta EE 11 Full API ............. FAILURE [  5.936 s]
[INFO] Apache TomEE :: Jakarta EE 11 Full API :: Signature Tests FAILURE [  3.210 s]
[INFO] ------------------------------------------------------------------------
[INFO] BUILD FAILURE
[INFO] ------------------------------------------------------------------------
[INFO] Total time:  39.703 s
[INFO] Finished at: 2026-07-06T12:20:28Z
[INFO] ------------------------------------------------------------------------
Waiting for Jenkins to finish collecting data
[ERROR] Failed to execute goal org.apache.maven.plugins:maven-compiler-plugin:3.8.1:compile (default-compile) on project jakartaee-api: Compilation failure
[ERROR] error: release version 17 not supported
[ERROR] -> [Help 1]
[ERROR] Failed to execute goal org.apache.maven.plugins:maven-dependency-plugin:3.10.0:unpack (unpack-classes) on project jakartaee-api-tck: Unable to find/resolve artifact. The following artifacts could not be resolved: org.apache.tomee:jakartaee-api:jar:11.0.0-M2-SNAPSHOT (absent): Could not find artifact org.apache.tomee:jakartaee-api:jar:11.0.0-M2-SNAPSHOT -> [Help 2]
[ERROR] 
[ERROR] To see the full stack trace of the errors, re-run Maven with the -e switch.
[ERROR] Re-run Maven using the -X switch to enable full debug logging.
[ERROR] 
[ERROR] For more information about the errors and possible solutions, please read the following articles:
[ERROR] [Help 1] http://cwiki.apache.org/confluence/display/MAVEN/MojoFailureException
[ERROR] [Help 2] http://cwiki.apache.org/confluence/display/MAVEN/MojoExecutionException
[ERROR] 
[ERROR] After correcting the problems, you can resume the build with the command
[ERROR]   mvn <goals> -rf :jakartaee-api
[JENKINS] Archiving <https://ci-builds.apache.org/job/Tomee/job/tomee-jakartaee-api-master/ws/pom.xml> to org.apache.tomee/jakartaee-api-parent/11.0.0-M2-SNAPSHOT/jakartaee-api-parent-11.0.0-M2-SNAPSHOT.pom
[JENKINS] Archiving <https://ci-builds.apache.org/job/Tomee/job/tomee-jakartaee-api-master/ws/api/pom.xml> to org.apache.tomee/jakartaee-api/11.0.0-M2-SNAPSHOT/jakartaee-api-11.0.0-M2-SNAPSHOT.pom
[JENKINS] Archiving <https://ci-builds.apache.org/job/Tomee/job/tomee-jakartaee-api-master/ws/tck/pom.xml> to org.apache.tomee/jakartaee-api-tck/11.0.0-M2-SNAPSHOT/jakartaee-api-tck-11.0.0-M2-SNAPSHOT.pom
Sending e-mails to: commits@tomee.apache.org
Sending e-mails to: commits@tomee.apache.org
channel stopped

Build failed in Jenkins: TomEE » tomee-jakartaee-api-master #1624

Posted by Apache Jenkins Server <je...@builds.apache.org>.
See <https://ci-builds.apache.org/job/Tomee/job/tomee-jakartaee-api-master/1624/display/redirect>

Changes:


------------------------------------------
Started by timer
Running as SYSTEM
[EnvInject] - Loading node environment variables.
Building remotely on builds32 (ubuntu) in workspace <https://ci-builds.apache.org/job/Tomee/job/tomee-jakartaee-api-master/ws/>
The recommended git tool is: NONE
No credentials specified
 > git rev-parse --resolve-git-dir <https://ci-builds.apache.org/job/Tomee/job/tomee-jakartaee-api-master/ws/.git> # timeout=10
Fetching changes from the remote Git repository
 > git config remote.origin.url https://github.com/apache/tomee-jakartaee-api # timeout=10
Cleaning workspace
 > git rev-parse --verify HEAD # timeout=10
Resetting working tree
 > git reset --hard # timeout=10
 > git clean -fdx # timeout=10
Fetching upstream changes from https://github.com/apache/tomee-jakartaee-api
 > git --version # timeout=10
 > git --version # 'git version 2.34.1'
 > git fetch --tags --force --progress -- https://github.com/apache/tomee-jakartaee-api +refs/heads/*:refs/remotes/origin/* # timeout=10
 > git rev-parse refs/remotes/origin/main^{commit} # timeout=10
Checking out Revision c531599fb0d0f9bdb326e28cff23baaaf65af5f5 (refs/remotes/origin/main)
 > git config core.sparsecheckout # timeout=10
 > git checkout -f c531599fb0d0f9bdb326e28cff23baaaf65af5f5 # timeout=10
Commit message: "[maven-release-plugin] prepare for next development iteration"
 > git rev-list --no-walk c531599fb0d0f9bdb326e28cff23baaaf65af5f5 # timeout=10
Parsing POMs
Established TCP socket on 45073
maven35-agent.jar already up to date
maven35-interceptor.jar already up to date
maven3-interceptor-commons.jar already up to date
[tomee-jakartaee-api-master] $ /home/jenkins/tools/java/latest11/bin/java -Xmx1536m -cp /home/jenkins/jenkins-agent/maven35-agent.jar:/home/jenkins/tools/maven/latest/boot/plexus-classworlds-2.9.0.jar:/home/jenkins/tools/maven/latest/conf/logging jenkins.maven3.agent.Maven35Main /home/jenkins/tools/maven/latest /home/jenkins/jenkins-agent/agent.jar /home/jenkins/jenkins-agent/maven35-interceptor.jar /home/jenkins/jenkins-agent/maven3-interceptor-commons.jar 45073
<===[JENKINS REMOTING CAPACITY]===>   channel started
Jul 05, 2026 12:19:12 PM hudson.remoting.UserRequest perform
WARNING: LinkageError while performing UserRequest:hudson.maven.AbstractMavenProcessFactory$ConfigureOriginalJDK@26167145
java.lang.UnsupportedClassVersionError: Failed to load hudson.maven.AbstractMavenProcessFactory$ConfigureOriginalJDK
	at hudson.remoting.RemoteClassLoader.loadClassFile(RemoteClassLoader.java:472)
	at hudson.remoting.RemoteClassLoader.loadRemoteClass(RemoteClassLoader.java:301)
	at hudson.remoting.RemoteClassLoader.loadWithMultiClassLoader(RemoteClassLoader.java:277)
	at hudson.remoting.RemoteClassLoader.findClass(RemoteClassLoader.java:236)
	at java.base/java.lang.ClassLoader.loadClass(ClassLoader.java:594)
	at java.base/java.lang.ClassLoader.loadClass(ClassLoader.java:527)
	at java.base/java.lang.Class.forName0(Native Method)
	at java.base/java.lang.Class.forName(Class.java:398)
	at hudson.remoting.MultiClassLoaderSerializer$Input.resolveClass(MultiClassLoaderSerializer.java:133)
	at java.base/java.io.ObjectInputStream.readNonProxyDesc(ObjectInputStream.java:2003)
	at java.base/java.io.ObjectInputStream.readClassDesc(ObjectInputStream.java:1870)
	at java.base/java.io.ObjectInputStream.readOrdinaryObject(ObjectInputStream.java:2201)
	at java.base/java.io.ObjectInputStream.readObject0(ObjectInputStream.java:1687)
	at java.base/java.io.ObjectInputStream.readObject(ObjectInputStream.java:489)
	at java.base/java.io.ObjectInputStream.readObject(ObjectInputStream.java:447)
	at hudson.remoting.UserRequest.deserialize(UserRequest.java:312)
	at hudson.remoting.UserRequest.perform(UserRequest.java:196)
	at hudson.remoting.UserRequest.perform(UserRequest.java:50)
	at hudson.remoting.Request$2.run(Request.java:391)
	at hudson.remoting.InterceptingExecutorService.lambda$wrap$0(InterceptingExecutorService.java:81)
	at java.base/java.util.concurrent.FutureTask.run(FutureTask.java:264)
	at java.base/java.util.concurrent.ThreadPoolExecutor.runWorker(ThreadPoolExecutor.java:1128)
	at java.base/java.util.concurrent.ThreadPoolExecutor$Worker.run(ThreadPoolExecutor.java:628)
	at java.base/java.lang.Thread.run(Thread.java:829)
Caused by: java.lang.UnsupportedClassVersionError: Failed to load jenkins.security.MasterToSlaveCallable
	at hudson.remoting.RemoteClassLoader.loadClassFile(RemoteClassLoader.java:472)
	at hudson.remoting.RemoteClassLoader.loadRemoteClass(RemoteClassLoader.java:301)
	at hudson.remoting.RemoteClassLoader.loadWithMultiClassLoader(RemoteClassLoader.java:277)
	at hudson.remoting.RemoteClassLoader.findClass(RemoteClassLoader.java:236)
	at java.base/java.lang.ClassLoader.loadClass(ClassLoader.java:594)
	at java.base/java.lang.ClassLoader.loadClass(ClassLoader.java:527)
	at java.base/java.lang.ClassLoader.defineClass1(Native Method)
	at java.base/java.lang.ClassLoader.defineClass(ClassLoader.java:1022)
	at java.base/java.lang.ClassLoader.defineClass(ClassLoader.java:883)
	at hudson.remoting.RemoteClassLoader.loadClassFile(RemoteClassLoader.java:470)
	... 23 more
Caused by: java.lang.UnsupportedClassVersionError: jenkins/security/MasterToSlaveCallable has been compiled by a more recent version of the Java Runtime (class file version 61.0), this version of the Java Runtime only recognizes class file versions up to 55.0
	at java.base/java.lang.ClassLoader.defineClass1(Native Method)
	at java.base/java.lang.ClassLoader.defineClass(ClassLoader.java:1022)
	at java.base/java.lang.ClassLoader.defineClass(ClassLoader.java:883)
	at hudson.remoting.RemoteClassLoader.loadClassFile(RemoteClassLoader.java:470)
	... 32 more

ERROR: ================================================================================
ERROR: Invalid project setup: Failed to load hudson.maven.AbstractMavenProcessFactory$ConfigureOriginalJDK
ERROR: [JENKINS-18403][JENKINS-28294] JDK 'jdk_11_latest' not supported to run Maven projects.
ERROR: Maven projects have to be launched with a Java version greater or equal to the minimum version required by the controller.
ERROR: Use the Maven JDK Toolchains (plugin) to build your maven project with an older JDK.
ERROR: Retrying with agent Java and setting compile/test properties to point to /home/jenkins/tools/java/latest11.
ERROR: ================================================================================
Established TCP socket on 44865
maven35-agent.jar already up to date
maven35-interceptor.jar already up to date
maven3-interceptor-commons.jar already up to date
[tomee-jakartaee-api-master] $ /usr/local/asfpackages/java/adoptium-jdk-17.0.12+7/bin/java -Xmx1536m -cp /home/jenkins/jenkins-agent/maven35-agent.jar:/home/jenkins/tools/maven/latest/boot/plexus-classworlds-2.9.0.jar:/home/jenkins/tools/maven/latest/conf/logging jenkins.maven3.agent.Maven35Main /home/jenkins/tools/maven/latest /home/jenkins/jenkins-agent/agent.jar /home/jenkins/jenkins-agent/maven35-interceptor.jar /home/jenkins/jenkins-agent/maven3-interceptor-commons.jar 44865
<===[JENKINS REMOTING CAPACITY]===>   channel started
Executing Maven:  -B -f <https://ci-builds.apache.org/job/Tomee/job/tomee-jakartaee-api-master/ws/pom.xml> -U --show-version --fail-at-end clean install deploy -Dfile.encoding=UTF-8
Apache Maven 3.9.11 (3e54c93a704957b63ee3494413a2b544fd3d825b)
Maven home: /usr/local/asfpackages/maven/apache-maven-3.9.11
Java version: 17.0.12, vendor: Eclipse Adoptium, runtime: /usr/local/asfpackages/java/adoptium-jdk-17.0.12+7
Default locale: en_US, platform encoding: UTF-8
OS name: "linux", version: "5.15.0-164-generic", arch: "amd64", family: "unix"
[INFO] Scanning for projects...
[INFO] ------------------------------------------------------------------------
[INFO] Reactor Build Order:
[INFO] 
[HUDSON] Collecting dependencies info
[HUDSON] Collecting dependencies info
[HUDSON] Collecting dependencies info
[INFO] Apache TomEE :: Jakarta EE 11 Full API :: Parent                   [pom]
[INFO] Apache TomEE :: Jakarta EE 11 Full API                             [jar]
[INFO] Apache TomEE :: Jakarta EE 11 Full API :: Signature Tests          [pom]
[INFO] 
[INFO] ---------------< org.apache.tomee:jakartaee-api-parent >----------------
[INFO] Building Apache TomEE :: Jakarta EE 11 Full API :: Parent 11.0.0-M2-SNAPSHOT [1/3]
[INFO]   from pom.xml
[INFO] --------------------------------[ pom ]---------------------------------
[INFO] 
[INFO] --- clean:3.5.0:clean (default-clean) @ jakartaee-api-parent ---
[INFO] 
[INFO] --- enforcer:3.6.2:enforce (enforce-maven-version) @ jakartaee-api-parent ---
[INFO] Rule 0: org.apache.maven.enforcer.rules.version.RequireMavenVersion passed
[INFO] 
[INFO] --- enforcer:3.6.2:enforce (enforce-java-version) @ jakartaee-api-parent ---
[INFO] Rule 0: org.apache.maven.enforcer.rules.version.RequireJavaVersion passed
[INFO] 
[INFO] --- remote-resources:3.3.0:process (process-resource-bundles) @ jakartaee-api-parent ---
[INFO] Preparing remote bundle org.apache.apache.resources:apache-jar-resource-bundle:1.8
[INFO] Copying 3 resources from 1 bundle.
[INFO] 
[INFO] --- install:3.1.4:install (default-install) @ jakartaee-api-parent ---
[INFO] Installing <https://ci-builds.apache.org/job/Tomee/job/tomee-jakartaee-api-master/ws/pom.xml> to /home/jenkins/.m2/repository/org/apache/tomee/jakartaee-api-parent/11.0.0-M2-SNAPSHOT/jakartaee-api-parent-11.0.0-M2-SNAPSHOT.pom
[INFO] 
[INFO] --- enforcer:3.6.2:enforce (enforce-maven-version) @ jakartaee-api-parent ---
[INFO] 
[INFO] --- enforcer:3.6.2:enforce (enforce-java-version) @ jakartaee-api-parent ---
[INFO] 
[INFO] --- remote-resources:3.3.0:process (process-resource-bundles) @ jakartaee-api-parent ---
[INFO] Preparing remote bundle org.apache.apache.resources:apache-jar-resource-bundle:1.8
[INFO] Copying 3 resources from 1 bundle.
[INFO] 
[INFO] --- install:3.1.4:install (default-install) @ jakartaee-api-parent ---
[INFO] Installing <https://ci-builds.apache.org/job/Tomee/job/tomee-jakartaee-api-master/ws/pom.xml> to /home/jenkins/.m2/repository/org/apache/tomee/jakartaee-api-parent/11.0.0-M2-SNAPSHOT/jakartaee-api-parent-11.0.0-M2-SNAPSHOT.pom
[INFO] 
[INFO] --- deploy:3.1.4:deploy (default-deploy) @ jakartaee-api-parent ---
[INFO] Downloading from apache.snapshots.https: https://repository.apache.org/content/repositories/snapshots/org/apache/tomee/jakartaee-api-parent/11.0.0-M2-SNAPSHOT/maven-metadata.xml
[INFO] Downloaded from apache.snapshots.https: https://repository.apache.org/content/repositories/snapshots/org/apache/tomee/jakartaee-api-parent/11.0.0-M2-SNAPSHOT/maven-metadata.xml (623 B at 653 B/s)
[INFO] Uploading to apache.snapshots.https: https://repository.apache.org/content/repositories/snapshots/org/apache/tomee/jakartaee-api-parent/11.0.0-M2-SNAPSHOT/jakartaee-api-parent-11.0.0-M2-20260705.121946-55.pom
[INFO] Uploaded to apache.snapshots.https: https://repository.apache.org/content/repositories/snapshots/org/apache/tomee/jakartaee-api-parent/11.0.0-M2-SNAPSHOT/jakartaee-api-parent-11.0.0-M2-20260705.121946-55.pom (2.3 kB at 2.1 kB/s)
[INFO] Downloading from apache.snapshots.https: https://repository.apache.org/content/repositories/snapshots/org/apache/tomee/jakartaee-api-parent/maven-metadata.xml
[INFO] Downloaded from apache.snapshots.https: https://repository.apache.org/content/repositories/snapshots/org/apache/tomee/jakartaee-api-parent/maven-metadata.xml (527 B at 2.9 kB/s)
[INFO] Uploading to apache.snapshots.https: https://repository.apache.org/content/repositories/snapshots/org/apache/tomee/jakartaee-api-parent/11.0.0-M2-SNAPSHOT/maven-metadata.xml
[INFO] Uploaded to apache.snapshots.https: https://repository.apache.org/content/repositories/snapshots/org/apache/tomee/jakartaee-api-parent/11.0.0-M2-SNAPSHOT/maven-metadata.xml (623 B at 582 B/s)
[INFO] Uploading to apache.snapshots.https: https://repository.apache.org/content/repositories/snapshots/org/apache/tomee/jakartaee-api-parent/maven-metadata.xml
[INFO] Uploaded to apache.snapshots.https: https://repository.apache.org/content/repositories/snapshots/org/apache/tomee/jakartaee-api-parent/maven-metadata.xml (527 B at 493 B/s)
[WARNING] Attempt to (de-)serialize anonymous class org.jfrog.hudson.maven2.MavenDependenciesRecorder$1; see: https://jenkins.io/redirect/serialization-of-anonymous-classes/
[INFO] 
[INFO] -------------------< org.apache.tomee:jakartaee-api >-------------------
[INFO] Building Apache TomEE :: Jakarta EE 11 Full API 11.0.0-M2-SNAPSHOT [2/3]
[INFO]   from api/pom.xml
[INFO] --------------------------------[ jar ]---------------------------------
[INFO] 
[INFO] --- clean:3.1.0:clean (default-clean) @ jakartaee-api ---
[INFO] 
[INFO] --- enforcer:3.6.2:enforce (enforce-maven-version) @ jakartaee-api ---
[INFO] 
[INFO] --- enforcer:3.6.2:enforce (enforce-java-version) @ jakartaee-api ---
[INFO] 
[INFO] --- remote-resources:3.3.0:process (process-resource-bundles) @ jakartaee-api ---
[INFO] Preparing remote bundle org.apache.apache.resources:apache-jar-resource-bundle:1.8
[INFO] Copying 3 resources from 1 bundle.
[INFO] 
[INFO] --- resources:3.5.0:resources (default-resources) @ jakartaee-api ---
[INFO] Copying 1 resource from src/main/resources to target/classes
[INFO] Copying 1 resource from src/main/filtered-resources to target/classes
[INFO] Copying 3 resources from target/maven-shared-archive-resources to target/classes
[INFO] 
[INFO] --- compiler:3.8.1:compile (default-compile) @ jakartaee-api ---
[INFO] Changes detected - recompiling the module!
[INFO] Compiling 2 source files to <https://ci-builds.apache.org/job/Tomee/job/tomee-jakartaee-api-master/ws/api/target/classes>
[INFO] -------------------------------------------------------------
[ERROR] COMPILATION ERROR : 
[INFO] -------------------------------------------------------------
[ERROR] error: release version 17 not supported
[INFO] 1 error
[INFO] -------------------------------------------------------------
[INFO] 
[INFO] -----------------< org.apache.tomee:jakartaee-api-tck >-----------------
[INFO] Building Apache TomEE :: Jakarta EE 11 Full API :: Signature Tests 11.0.0-M2-SNAPSHOT [3/3]
[INFO]   from tck/pom.xml
[INFO] --------------------------------[ pom ]---------------------------------
[INFO] 
[INFO] --- clean:3.5.0:clean (default-clean) @ jakartaee-api-tck ---
[INFO] 
[INFO] --- enforcer:3.6.2:enforce (enforce-maven-version) @ jakartaee-api-tck ---
[INFO] 
[INFO] --- enforcer:3.6.2:enforce (enforce-java-version) @ jakartaee-api-tck ---
[INFO] 
[INFO] --- dependency:3.10.0:unpack (unpack-classes) @ jakartaee-api-tck ---
[INFO] ------------------------------------------------------------------------
[INFO] Reactor Summary for Apache TomEE :: Jakarta EE 11 Full API :: Parent 11.0.0-M2-SNAPSHOT:
[INFO] 
[INFO] Apache TomEE :: Jakarta EE 11 Full API :: Parent ... SUCCESS [ 16.344 s]
[INFO] Apache TomEE :: Jakarta EE 11 Full API ............. FAILURE [  7.969 s]
[INFO] Apache TomEE :: Jakarta EE 11 Full API :: Signature Tests FAILURE [  3.537 s]
[INFO] ------------------------------------------------------------------------
[INFO] BUILD FAILURE
[INFO] ------------------------------------------------------------------------
[INFO] Total time:  41.086 s
[INFO] Finished at: 2026-07-05T12:20:27Z
[INFO] ------------------------------------------------------------------------
Waiting for Jenkins to finish collecting data
[ERROR] Failed to execute goal org.apache.maven.plugins:maven-compiler-plugin:3.8.1:compile (default-compile) on project jakartaee-api: Compilation failure
[ERROR] error: release version 17 not supported
[ERROR] -> [Help 1]
[ERROR] Failed to execute goal org.apache.maven.plugins:maven-dependency-plugin:3.10.0:unpack (unpack-classes) on project jakartaee-api-tck: Unable to find/resolve artifact. The following artifacts could not be resolved: org.apache.tomee:jakartaee-api:jar:11.0.0-M2-SNAPSHOT (absent): Could not find artifact org.apache.tomee:jakartaee-api:jar:11.0.0-M2-SNAPSHOT -> [Help 2]
[ERROR] 
[ERROR] To see the full stack trace of the errors, re-run Maven with the -e switch.
[ERROR] Re-run Maven using the -X switch to enable full debug logging.
[ERROR] 
[ERROR] For more information about the errors and possible solutions, please read the following articles:
[ERROR] [Help 1] http://cwiki.apache.org/confluence/display/MAVEN/MojoFailureException
[ERROR] [Help 2] http://cwiki.apache.org/confluence/display/MAVEN/MojoExecutionException
[ERROR] 
[ERROR] After correcting the problems, you can resume the build with the command
[ERROR]   mvn <goals> -rf :jakartaee-api
[JENKINS] Archiving <https://ci-builds.apache.org/job/Tomee/job/tomee-jakartaee-api-master/ws/pom.xml> to org.apache.tomee/jakartaee-api-parent/11.0.0-M2-SNAPSHOT/jakartaee-api-parent-11.0.0-M2-SNAPSHOT.pom
[JENKINS] Archiving <https://ci-builds.apache.org/job/Tomee/job/tomee-jakartaee-api-master/ws/api/pom.xml> to org.apache.tomee/jakartaee-api/11.0.0-M2-SNAPSHOT/jakartaee-api-11.0.0-M2-SNAPSHOT.pom
[JENKINS] Archiving <https://ci-builds.apache.org/job/Tomee/job/tomee-jakartaee-api-master/ws/tck/pom.xml> to org.apache.tomee/jakartaee-api-tck/11.0.0-M2-SNAPSHOT/jakartaee-api-tck-11.0.0-M2-SNAPSHOT.pom
Sending e-mails to: commits@tomee.apache.org
Sending e-mails to: commits@tomee.apache.org
channel stopped

Build failed in Jenkins: TomEE » tomee-jakartaee-api-master #1623

Posted by Apache Jenkins Server <je...@builds.apache.org>.
See <https://ci-builds.apache.org/job/Tomee/job/tomee-jakartaee-api-master/1623/display/redirect>

Changes:


------------------------------------------
Started by timer
Running as SYSTEM
[EnvInject] - Loading node environment variables.
Building remotely on builds32 (ubuntu) in workspace <https://ci-builds.apache.org/job/Tomee/job/tomee-jakartaee-api-master/ws/>
The recommended git tool is: NONE
No credentials specified
 > git rev-parse --resolve-git-dir <https://ci-builds.apache.org/job/Tomee/job/tomee-jakartaee-api-master/ws/.git> # timeout=10
Fetching changes from the remote Git repository
 > git config remote.origin.url https://github.com/apache/tomee-jakartaee-api # timeout=10
Cleaning workspace
 > git rev-parse --verify HEAD # timeout=10
Resetting working tree
 > git reset --hard # timeout=10
 > git clean -fdx # timeout=10
Fetching upstream changes from https://github.com/apache/tomee-jakartaee-api
 > git --version # timeout=10
 > git --version # 'git version 2.34.1'
 > git fetch --tags --force --progress -- https://github.com/apache/tomee-jakartaee-api +refs/heads/*:refs/remotes/origin/* # timeout=10
 > git rev-parse refs/remotes/origin/main^{commit} # timeout=10
Checking out Revision c531599fb0d0f9bdb326e28cff23baaaf65af5f5 (refs/remotes/origin/main)
 > git config core.sparsecheckout # timeout=10
 > git checkout -f c531599fb0d0f9bdb326e28cff23baaaf65af5f5 # timeout=10
Commit message: "[maven-release-plugin] prepare for next development iteration"
 > git rev-list --no-walk c531599fb0d0f9bdb326e28cff23baaaf65af5f5 # timeout=10
Parsing POMs
Established TCP socket on 42993
maven35-agent.jar already up to date
maven35-interceptor.jar already up to date
maven3-interceptor-commons.jar already up to date
[tomee-jakartaee-api-master] $ /home/jenkins/tools/java/latest11/bin/java -Xmx1536m -cp /home/jenkins/jenkins-agent/maven35-agent.jar:/home/jenkins/tools/maven/latest/boot/plexus-classworlds-2.9.0.jar:/home/jenkins/tools/maven/latest/conf/logging jenkins.maven3.agent.Maven35Main /home/jenkins/tools/maven/latest /home/jenkins/jenkins-agent/agent.jar /home/jenkins/jenkins-agent/maven35-interceptor.jar /home/jenkins/jenkins-agent/maven3-interceptor-commons.jar 42993
<===[JENKINS REMOTING CAPACITY]===>   channel started
Jul 04, 2026 12:19:41 PM hudson.remoting.UserRequest perform
WARNING: LinkageError while performing UserRequest:hudson.maven.AbstractMavenProcessFactory$ConfigureOriginalJDK@bb23636
java.lang.UnsupportedClassVersionError: Failed to load hudson.maven.AbstractMavenProcessFactory$ConfigureOriginalJDK
	at hudson.remoting.RemoteClassLoader.loadClassFile(RemoteClassLoader.java:472)
	at hudson.remoting.RemoteClassLoader.loadRemoteClass(RemoteClassLoader.java:301)
	at hudson.remoting.RemoteClassLoader.loadWithMultiClassLoader(RemoteClassLoader.java:277)
	at hudson.remoting.RemoteClassLoader.findClass(RemoteClassLoader.java:236)
	at java.base/java.lang.ClassLoader.loadClass(ClassLoader.java:594)
	at java.base/java.lang.ClassLoader.loadClass(ClassLoader.java:527)
	at java.base/java.lang.Class.forName0(Native Method)
	at java.base/java.lang.Class.forName(Class.java:398)
	at hudson.remoting.MultiClassLoaderSerializer$Input.resolveClass(MultiClassLoaderSerializer.java:133)
	at java.base/java.io.ObjectInputStream.readNonProxyDesc(ObjectInputStream.java:2003)
	at java.base/java.io.ObjectInputStream.readClassDesc(ObjectInputStream.java:1870)
	at java.base/java.io.ObjectInputStream.readOrdinaryObject(ObjectInputStream.java:2201)
	at java.base/java.io.ObjectInputStream.readObject0(ObjectInputStream.java:1687)
	at java.base/java.io.ObjectInputStream.readObject(ObjectInputStream.java:489)
	at java.base/java.io.ObjectInputStream.readObject(ObjectInputStream.java:447)
	at hudson.remoting.UserRequest.deserialize(UserRequest.java:312)
	at hudson.remoting.UserRequest.perform(UserRequest.java:196)
	at hudson.remoting.UserRequest.perform(UserRequest.java:50)
	at hudson.remoting.Request$2.run(Request.java:391)
	at hudson.remoting.InterceptingExecutorService.lambda$wrap$0(InterceptingExecutorService.java:81)
	at java.base/java.util.concurrent.FutureTask.run(FutureTask.java:264)
	at java.base/java.util.concurrent.ThreadPoolExecutor.runWorker(ThreadPoolExecutor.java:1128)
	at java.base/java.util.concurrent.ThreadPoolExecutor$Worker.run(ThreadPoolExecutor.java:628)
	at java.base/java.lang.Thread.run(Thread.java:829)
Caused by: java.lang.UnsupportedClassVersionError: Failed to load jenkins.security.MasterToSlaveCallable
	at hudson.remoting.RemoteClassLoader.loadClassFile(RemoteClassLoader.java:472)
	at hudson.remoting.RemoteClassLoader.loadRemoteClass(RemoteClassLoader.java:301)
	at hudson.remoting.RemoteClassLoader.loadWithMultiClassLoader(RemoteClassLoader.java:277)
	at hudson.remoting.RemoteClassLoader.findClass(RemoteClassLoader.java:236)
	at java.base/java.lang.ClassLoader.loadClass(ClassLoader.java:594)
	at java.base/java.lang.ClassLoader.loadClass(ClassLoader.java:527)
	at java.base/java.lang.ClassLoader.defineClass1(Native Method)
	at java.base/java.lang.ClassLoader.defineClass(ClassLoader.java:1022)
	at java.base/java.lang.ClassLoader.defineClass(ClassLoader.java:883)
	at hudson.remoting.RemoteClassLoader.loadClassFile(RemoteClassLoader.java:470)
	... 23 more
Caused by: java.lang.UnsupportedClassVersionError: jenkins/security/MasterToSlaveCallable has been compiled by a more recent version of the Java Runtime (class file version 61.0), this version of the Java Runtime only recognizes class file versions up to 55.0
	at java.base/java.lang.ClassLoader.defineClass1(Native Method)
	at java.base/java.lang.ClassLoader.defineClass(ClassLoader.java:1022)
	at java.base/java.lang.ClassLoader.defineClass(ClassLoader.java:883)
	at hudson.remoting.RemoteClassLoader.loadClassFile(RemoteClassLoader.java:470)
	... 32 more

ERROR: ================================================================================
ERROR: Invalid project setup: Failed to load hudson.maven.AbstractMavenProcessFactory$ConfigureOriginalJDK
ERROR: [JENKINS-18403][JENKINS-28294] JDK 'jdk_11_latest' not supported to run Maven projects.
ERROR: Maven projects have to be launched with a Java version greater or equal to the minimum version required by the controller.
ERROR: Use the Maven JDK Toolchains (plugin) to build your maven project with an older JDK.
ERROR: Retrying with agent Java and setting compile/test properties to point to /home/jenkins/tools/java/latest11.
ERROR: ================================================================================
Established TCP socket on 33003
maven35-agent.jar already up to date
maven35-interceptor.jar already up to date
maven3-interceptor-commons.jar already up to date
[tomee-jakartaee-api-master] $ /usr/local/asfpackages/java/adoptium-jdk-17.0.12+7/bin/java -Xmx1536m -cp /home/jenkins/jenkins-agent/maven35-agent.jar:/home/jenkins/tools/maven/latest/boot/plexus-classworlds-2.9.0.jar:/home/jenkins/tools/maven/latest/conf/logging jenkins.maven3.agent.Maven35Main /home/jenkins/tools/maven/latest /home/jenkins/jenkins-agent/agent.jar /home/jenkins/jenkins-agent/maven35-interceptor.jar /home/jenkins/jenkins-agent/maven3-interceptor-commons.jar 33003
<===[JENKINS REMOTING CAPACITY]===>   channel started
Executing Maven:  -B -f <https://ci-builds.apache.org/job/Tomee/job/tomee-jakartaee-api-master/ws/pom.xml> -U --show-version --fail-at-end clean install deploy -Dfile.encoding=UTF-8
Apache Maven 3.9.11 (3e54c93a704957b63ee3494413a2b544fd3d825b)
Maven home: /usr/local/asfpackages/maven/apache-maven-3.9.11
Java version: 17.0.12, vendor: Eclipse Adoptium, runtime: /usr/local/asfpackages/java/adoptium-jdk-17.0.12+7
Default locale: en_US, platform encoding: UTF-8
OS name: "linux", version: "5.15.0-164-generic", arch: "amd64", family: "unix"
[INFO] Scanning for projects...
[INFO] ------------------------------------------------------------------------
[INFO] Reactor Build Order:
[INFO] 
[HUDSON] Collecting dependencies info
[HUDSON] Collecting dependencies info
[HUDSON] Collecting dependencies info
[INFO] Apache TomEE :: Jakarta EE 11 Full API :: Parent                   [pom]
[INFO] Apache TomEE :: Jakarta EE 11 Full API                             [jar]
[INFO] Apache TomEE :: Jakarta EE 11 Full API :: Signature Tests          [pom]
[INFO] 
[INFO] ---------------< org.apache.tomee:jakartaee-api-parent >----------------
[INFO] Building Apache TomEE :: Jakarta EE 11 Full API :: Parent 11.0.0-M2-SNAPSHOT [1/3]
[INFO]   from pom.xml
[INFO] --------------------------------[ pom ]---------------------------------
[INFO] 
[INFO] --- clean:3.5.0:clean (default-clean) @ jakartaee-api-parent ---
[INFO] 
[INFO] --- enforcer:3.6.2:enforce (enforce-maven-version) @ jakartaee-api-parent ---
[INFO] Rule 0: org.apache.maven.enforcer.rules.version.RequireMavenVersion passed
[INFO] 
[INFO] --- enforcer:3.6.2:enforce (enforce-java-version) @ jakartaee-api-parent ---
[INFO] Rule 0: org.apache.maven.enforcer.rules.version.RequireJavaVersion passed
[INFO] 
[INFO] --- remote-resources:3.3.0:process (process-resource-bundles) @ jakartaee-api-parent ---
[INFO] Preparing remote bundle org.apache.apache.resources:apache-jar-resource-bundle:1.8
[INFO] Copying 3 resources from 1 bundle.
[INFO] 
[INFO] --- install:3.1.4:install (default-install) @ jakartaee-api-parent ---
[INFO] Installing <https://ci-builds.apache.org/job/Tomee/job/tomee-jakartaee-api-master/ws/pom.xml> to /home/jenkins/.m2/repository/org/apache/tomee/jakartaee-api-parent/11.0.0-M2-SNAPSHOT/jakartaee-api-parent-11.0.0-M2-SNAPSHOT.pom
[INFO] 
[INFO] --- enforcer:3.6.2:enforce (enforce-maven-version) @ jakartaee-api-parent ---
[INFO] 
[INFO] --- enforcer:3.6.2:enforce (enforce-java-version) @ jakartaee-api-parent ---
[INFO] 
[INFO] --- remote-resources:3.3.0:process (process-resource-bundles) @ jakartaee-api-parent ---
[INFO] Preparing remote bundle org.apache.apache.resources:apache-jar-resource-bundle:1.8
[INFO] Copying 3 resources from 1 bundle.
[INFO] 
[INFO] --- install:3.1.4:install (default-install) @ jakartaee-api-parent ---
[INFO] Installing <https://ci-builds.apache.org/job/Tomee/job/tomee-jakartaee-api-master/ws/pom.xml> to /home/jenkins/.m2/repository/org/apache/tomee/jakartaee-api-parent/11.0.0-M2-SNAPSHOT/jakartaee-api-parent-11.0.0-M2-SNAPSHOT.pom
[INFO] 
[INFO] --- deploy:3.1.4:deploy (default-deploy) @ jakartaee-api-parent ---
[INFO] Downloading from apache.snapshots.https: https://repository.apache.org/content/repositories/snapshots/org/apache/tomee/jakartaee-api-parent/11.0.0-M2-SNAPSHOT/maven-metadata.xml
[INFO] Downloaded from apache.snapshots.https: https://repository.apache.org/content/repositories/snapshots/org/apache/tomee/jakartaee-api-parent/11.0.0-M2-SNAPSHOT/maven-metadata.xml (623 B at 625 B/s)
[INFO] Uploading to apache.snapshots.https: https://repository.apache.org/content/repositories/snapshots/org/apache/tomee/jakartaee-api-parent/11.0.0-M2-SNAPSHOT/jakartaee-api-parent-11.0.0-M2-20260704.122016-53.pom
[INFO] Uploaded to apache.snapshots.https: https://repository.apache.org/content/repositories/snapshots/org/apache/tomee/jakartaee-api-parent/11.0.0-M2-SNAPSHOT/jakartaee-api-parent-11.0.0-M2-20260704.122016-53.pom (2.3 kB at 2.1 kB/s)
[INFO] Downloading from apache.snapshots.https: https://repository.apache.org/content/repositories/snapshots/org/apache/tomee/jakartaee-api-parent/maven-metadata.xml
[INFO] Downloaded from apache.snapshots.https: https://repository.apache.org/content/repositories/snapshots/org/apache/tomee/jakartaee-api-parent/maven-metadata.xml (527 B at 2.5 kB/s)
[INFO] Uploading to apache.snapshots.https: https://repository.apache.org/content/repositories/snapshots/org/apache/tomee/jakartaee-api-parent/11.0.0-M2-SNAPSHOT/maven-metadata.xml
[INFO] Uploaded to apache.snapshots.https: https://repository.apache.org/content/repositories/snapshots/org/apache/tomee/jakartaee-api-parent/11.0.0-M2-SNAPSHOT/maven-metadata.xml (623 B at 571 B/s)
[INFO] Uploading to apache.snapshots.https: https://repository.apache.org/content/repositories/snapshots/org/apache/tomee/jakartaee-api-parent/maven-metadata.xml
[INFO] Uploaded to apache.snapshots.https: https://repository.apache.org/content/repositories/snapshots/org/apache/tomee/jakartaee-api-parent/maven-metadata.xml (527 B at 483 B/s)
[WARNING] Attempt to (de-)serialize anonymous class org.jfrog.hudson.maven2.MavenDependenciesRecorder$1; see: https://jenkins.io/redirect/serialization-of-anonymous-classes/
[INFO] 
[INFO] -------------------< org.apache.tomee:jakartaee-api >-------------------
[INFO] Building Apache TomEE :: Jakarta EE 11 Full API 11.0.0-M2-SNAPSHOT [2/3]
[INFO]   from api/pom.xml
[INFO] --------------------------------[ jar ]---------------------------------
[INFO] 
[INFO] --- clean:3.1.0:clean (default-clean) @ jakartaee-api ---
[INFO] 
[INFO] --- enforcer:3.6.2:enforce (enforce-maven-version) @ jakartaee-api ---
[INFO] 
[INFO] --- enforcer:3.6.2:enforce (enforce-java-version) @ jakartaee-api ---
[INFO] 
[INFO] --- remote-resources:3.3.0:process (process-resource-bundles) @ jakartaee-api ---
[INFO] Preparing remote bundle org.apache.apache.resources:apache-jar-resource-bundle:1.8
[INFO] Copying 3 resources from 1 bundle.
[INFO] 
[INFO] --- resources:3.5.0:resources (default-resources) @ jakartaee-api ---
[INFO] Copying 1 resource from src/main/resources to target/classes
[INFO] Copying 1 resource from src/main/filtered-resources to target/classes
[INFO] Copying 3 resources from target/maven-shared-archive-resources to target/classes
[INFO] 
[INFO] --- compiler:3.8.1:compile (default-compile) @ jakartaee-api ---
[INFO] Changes detected - recompiling the module!
[INFO] Compiling 2 source files to <https://ci-builds.apache.org/job/Tomee/job/tomee-jakartaee-api-master/ws/api/target/classes>
[INFO] -------------------------------------------------------------
[ERROR] COMPILATION ERROR : 
[INFO] -------------------------------------------------------------
[ERROR] error: release version 17 not supported
[INFO] 1 error
[INFO] -------------------------------------------------------------
[INFO] 
[INFO] -----------------< org.apache.tomee:jakartaee-api-tck >-----------------
[INFO] Building Apache TomEE :: Jakarta EE 11 Full API :: Signature Tests 11.0.0-M2-SNAPSHOT [3/3]
[INFO]   from tck/pom.xml
[INFO] --------------------------------[ pom ]---------------------------------
[INFO] 
[INFO] --- clean:3.5.0:clean (default-clean) @ jakartaee-api-tck ---
[INFO] 
[INFO] --- enforcer:3.6.2:enforce (enforce-maven-version) @ jakartaee-api-tck ---
[INFO] 
[INFO] --- enforcer:3.6.2:enforce (enforce-java-version) @ jakartaee-api-tck ---
[INFO] 
[INFO] --- dependency:3.10.0:unpack (unpack-classes) @ jakartaee-api-tck ---
[INFO] ------------------------------------------------------------------------
[INFO] Reactor Summary for Apache TomEE :: Jakarta EE 11 Full API :: Parent 11.0.0-M2-SNAPSHOT:
[INFO] 
[INFO] Apache TomEE :: Jakarta EE 11 Full API :: Parent ... SUCCESS [ 17.260 s]
[INFO] Apache TomEE :: Jakarta EE 11 Full API ............. FAILURE [ 22.320 s]
[INFO] Apache TomEE :: Jakarta EE 11 Full API :: Signature Tests FAILURE [  3.248 s]
[INFO] ------------------------------------------------------------------------
[INFO] BUILD FAILURE
[INFO] ------------------------------------------------------------------------
[INFO] Total time:  01:16 min
[INFO] Finished at: 2026-07-04T12:21:32Z
[INFO] ------------------------------------------------------------------------
Waiting for Jenkins to finish collecting data
[ERROR] Failed to execute goal org.apache.maven.plugins:maven-compiler-plugin:3.8.1:compile (default-compile) on project jakartaee-api: Compilation failure
[ERROR] error: release version 17 not supported
[ERROR] -> [Help 1]
[ERROR] Failed to execute goal org.apache.maven.plugins:maven-dependency-plugin:3.10.0:unpack (unpack-classes) on project jakartaee-api-tck: Unable to find/resolve artifact. The following artifacts could not be resolved: org.apache.tomee:jakartaee-api:jar:11.0.0-M2-SNAPSHOT (absent): Could not find artifact org.apache.tomee:jakartaee-api:jar:11.0.0-M2-SNAPSHOT -> [Help 2]
[ERROR] 
[ERROR] To see the full stack trace of the errors, re-run Maven with the -e switch.
[ERROR] Re-run Maven using the -X switch to enable full debug logging.
[ERROR] 
[ERROR] For more information about the errors and possible solutions, please read the following articles:
[ERROR] [Help 1] http://cwiki.apache.org/confluence/display/MAVEN/MojoFailureException
[ERROR] [Help 2] http://cwiki.apache.org/confluence/display/MAVEN/MojoExecutionException
[ERROR] 
[ERROR] After correcting the problems, you can resume the build with the command
[ERROR]   mvn <goals> -rf :jakartaee-api
[JENKINS] Archiving <https://ci-builds.apache.org/job/Tomee/job/tomee-jakartaee-api-master/ws/pom.xml> to org.apache.tomee/jakartaee-api-parent/11.0.0-M2-SNAPSHOT/jakartaee-api-parent-11.0.0-M2-SNAPSHOT.pom
[JENKINS] Archiving <https://ci-builds.apache.org/job/Tomee/job/tomee-jakartaee-api-master/ws/api/pom.xml> to org.apache.tomee/jakartaee-api/11.0.0-M2-SNAPSHOT/jakartaee-api-11.0.0-M2-SNAPSHOT.pom
[JENKINS] Archiving <https://ci-builds.apache.org/job/Tomee/job/tomee-jakartaee-api-master/ws/tck/pom.xml> to org.apache.tomee/jakartaee-api-tck/11.0.0-M2-SNAPSHOT/jakartaee-api-tck-11.0.0-M2-SNAPSHOT.pom
Sending e-mails to: commits@tomee.apache.org
Sending e-mails to: commits@tomee.apache.org
channel stopped

Build failed in Jenkins: TomEE » tomee-jakartaee-api-master #1622

Posted by Apache Jenkins Server <je...@builds.apache.org>.
See <https://ci-builds.apache.org/job/Tomee/job/tomee-jakartaee-api-master/1622/display/redirect>

Changes:


------------------------------------------
Started by timer
Running as SYSTEM
[EnvInject] - Loading node environment variables.
Building remotely on builds32 (ubuntu) in workspace <https://ci-builds.apache.org/job/Tomee/job/tomee-jakartaee-api-master/ws/>
The recommended git tool is: NONE
No credentials specified
 > git rev-parse --resolve-git-dir <https://ci-builds.apache.org/job/Tomee/job/tomee-jakartaee-api-master/ws/.git> # timeout=10
Fetching changes from the remote Git repository
 > git config remote.origin.url https://github.com/apache/tomee-jakartaee-api # timeout=10
Cleaning workspace
 > git rev-parse --verify HEAD # timeout=10
Resetting working tree
 > git reset --hard # timeout=10
 > git clean -fdx # timeout=10
Fetching upstream changes from https://github.com/apache/tomee-jakartaee-api
 > git --version # timeout=10
 > git --version # 'git version 2.34.1'
 > git fetch --tags --force --progress -- https://github.com/apache/tomee-jakartaee-api +refs/heads/*:refs/remotes/origin/* # timeout=10
 > git rev-parse refs/remotes/origin/main^{commit} # timeout=10
Checking out Revision c531599fb0d0f9bdb326e28cff23baaaf65af5f5 (refs/remotes/origin/main)
 > git config core.sparsecheckout # timeout=10
 > git checkout -f c531599fb0d0f9bdb326e28cff23baaaf65af5f5 # timeout=10
Commit message: "[maven-release-plugin] prepare for next development iteration"
 > git rev-list --no-walk c531599fb0d0f9bdb326e28cff23baaaf65af5f5 # timeout=10
Parsing POMs
Established TCP socket on 46737
maven35-agent.jar already up to date
maven35-interceptor.jar already up to date
maven3-interceptor-commons.jar already up to date
[tomee-jakartaee-api-master] $ /home/jenkins/tools/java/latest11/bin/java -Xmx1536m -cp /home/jenkins/jenkins-agent/maven35-agent.jar:/home/jenkins/tools/maven/latest/boot/plexus-classworlds-2.9.0.jar:/home/jenkins/tools/maven/latest/conf/logging jenkins.maven3.agent.Maven35Main /home/jenkins/tools/maven/latest /home/jenkins/jenkins-agent/agent.jar /home/jenkins/jenkins-agent/maven35-interceptor.jar /home/jenkins/jenkins-agent/maven3-interceptor-commons.jar 46737
<===[JENKINS REMOTING CAPACITY]===>   channel started
Jul 03, 2026 12:19:37 PM hudson.remoting.UserRequest perform
WARNING: LinkageError while performing UserRequest:hudson.maven.AbstractMavenProcessFactory$ConfigureOriginalJDK@17e5e4f6
java.lang.UnsupportedClassVersionError: Failed to load hudson.maven.AbstractMavenProcessFactory$ConfigureOriginalJDK
	at hudson.remoting.RemoteClassLoader.loadClassFile(RemoteClassLoader.java:472)
	at hudson.remoting.RemoteClassLoader.loadRemoteClass(RemoteClassLoader.java:301)
	at hudson.remoting.RemoteClassLoader.loadWithMultiClassLoader(RemoteClassLoader.java:277)
	at hudson.remoting.RemoteClassLoader.findClass(RemoteClassLoader.java:236)
	at java.base/java.lang.ClassLoader.loadClass(ClassLoader.java:594)
	at java.base/java.lang.ClassLoader.loadClass(ClassLoader.java:527)
	at java.base/java.lang.Class.forName0(Native Method)
	at java.base/java.lang.Class.forName(Class.java:398)
	at hudson.remoting.MultiClassLoaderSerializer$Input.resolveClass(MultiClassLoaderSerializer.java:133)
	at java.base/java.io.ObjectInputStream.readNonProxyDesc(ObjectInputStream.java:2003)
	at java.base/java.io.ObjectInputStream.readClassDesc(ObjectInputStream.java:1870)
	at java.base/java.io.ObjectInputStream.readOrdinaryObject(ObjectInputStream.java:2201)
	at java.base/java.io.ObjectInputStream.readObject0(ObjectInputStream.java:1687)
	at java.base/java.io.ObjectInputStream.readObject(ObjectInputStream.java:489)
	at java.base/java.io.ObjectInputStream.readObject(ObjectInputStream.java:447)
	at hudson.remoting.UserRequest.deserialize(UserRequest.java:312)
	at hudson.remoting.UserRequest.perform(UserRequest.java:196)
	at hudson.remoting.UserRequest.perform(UserRequest.java:50)
	at hudson.remoting.Request$2.run(Request.java:391)
	at hudson.remoting.InterceptingExecutorService.lambda$wrap$0(InterceptingExecutorService.java:81)
	at java.base/java.util.concurrent.FutureTask.run(FutureTask.java:264)
	at java.base/java.util.concurrent.ThreadPoolExecutor.runWorker(ThreadPoolExecutor.java:1128)
	at java.base/java.util.concurrent.ThreadPoolExecutor$Worker.run(ThreadPoolExecutor.java:628)
	at java.base/java.lang.Thread.run(Thread.java:829)
Caused by: java.lang.UnsupportedClassVersionError: Failed to load jenkins.security.MasterToSlaveCallable
	at hudson.remoting.RemoteClassLoader.loadClassFile(RemoteClassLoader.java:472)
	at hudson.remoting.RemoteClassLoader.loadRemoteClass(RemoteClassLoader.java:301)
	at hudson.remoting.RemoteClassLoader.loadWithMultiClassLoader(RemoteClassLoader.java:277)
	at hudson.remoting.RemoteClassLoader.findClass(RemoteClassLoader.java:236)
	at java.base/java.lang.ClassLoader.loadClass(ClassLoader.java:594)
	at java.base/java.lang.ClassLoader.loadClass(ClassLoader.java:527)
	at java.base/java.lang.ClassLoader.defineClass1(Native Method)
	at java.base/java.lang.ClassLoader.defineClass(ClassLoader.java:1022)
	at java.base/java.lang.ClassLoader.defineClass(ClassLoader.java:883)
	at hudson.remoting.RemoteClassLoader.loadClassFile(RemoteClassLoader.java:470)
	... 23 more
Caused by: java.lang.UnsupportedClassVersionError: jenkins/security/MasterToSlaveCallable has been compiled by a more recent version of the Java Runtime (class file version 61.0), this version of the Java Runtime only recognizes class file versions up to 55.0
	at java.base/java.lang.ClassLoader.defineClass1(Native Method)
	at java.base/java.lang.ClassLoader.defineClass(ClassLoader.java:1022)
	at java.base/java.lang.ClassLoader.defineClass(ClassLoader.java:883)
	at hudson.remoting.RemoteClassLoader.loadClassFile(RemoteClassLoader.java:470)
	... 32 more

ERROR: ================================================================================
ERROR: Invalid project setup: Failed to load hudson.maven.AbstractMavenProcessFactory$ConfigureOriginalJDK
ERROR: [JENKINS-18403][JENKINS-28294] JDK 'jdk_11_latest' not supported to run Maven projects.
ERROR: Maven projects have to be launched with a Java version greater or equal to the minimum version required by the controller.
ERROR: Use the Maven JDK Toolchains (plugin) to build your maven project with an older JDK.
ERROR: Retrying with agent Java and setting compile/test properties to point to /home/jenkins/tools/java/latest11.
ERROR: ================================================================================
Established TCP socket on 34835
maven35-agent.jar already up to date
maven35-interceptor.jar already up to date
maven3-interceptor-commons.jar already up to date
[tomee-jakartaee-api-master] $ /usr/local/asfpackages/java/adoptium-jdk-17.0.12+7/bin/java -Xmx1536m -cp /home/jenkins/jenkins-agent/maven35-agent.jar:/home/jenkins/tools/maven/latest/boot/plexus-classworlds-2.9.0.jar:/home/jenkins/tools/maven/latest/conf/logging jenkins.maven3.agent.Maven35Main /home/jenkins/tools/maven/latest /home/jenkins/jenkins-agent/agent.jar /home/jenkins/jenkins-agent/maven35-interceptor.jar /home/jenkins/jenkins-agent/maven3-interceptor-commons.jar 34835
<===[JENKINS REMOTING CAPACITY]===>   channel started
Executing Maven:  -B -f <https://ci-builds.apache.org/job/Tomee/job/tomee-jakartaee-api-master/ws/pom.xml> -U --show-version --fail-at-end clean install deploy -Dfile.encoding=UTF-8
Apache Maven 3.9.11 (3e54c93a704957b63ee3494413a2b544fd3d825b)
Maven home: /usr/local/asfpackages/maven/apache-maven-3.9.11
Java version: 17.0.12, vendor: Eclipse Adoptium, runtime: /usr/local/asfpackages/java/adoptium-jdk-17.0.12+7
Default locale: en_US, platform encoding: UTF-8
OS name: "linux", version: "5.15.0-164-generic", arch: "amd64", family: "unix"
[INFO] Scanning for projects...
[INFO] ------------------------------------------------------------------------
[INFO] Reactor Build Order:
[INFO] 
[HUDSON] Collecting dependencies info
[HUDSON] Collecting dependencies info
[HUDSON] Collecting dependencies info
[INFO] Apache TomEE :: Jakarta EE 11 Full API :: Parent                   [pom]
[INFO] Apache TomEE :: Jakarta EE 11 Full API                             [jar]
[INFO] Apache TomEE :: Jakarta EE 11 Full API :: Signature Tests          [pom]
[INFO] 
[INFO] ---------------< org.apache.tomee:jakartaee-api-parent >----------------
[INFO] Building Apache TomEE :: Jakarta EE 11 Full API :: Parent 11.0.0-M2-SNAPSHOT [1/3]
[INFO]   from pom.xml
[INFO] --------------------------------[ pom ]---------------------------------
[INFO] 
[INFO] --- clean:3.5.0:clean (default-clean) @ jakartaee-api-parent ---
[INFO] 
[INFO] --- enforcer:3.6.2:enforce (enforce-maven-version) @ jakartaee-api-parent ---
[INFO] Rule 0: org.apache.maven.enforcer.rules.version.RequireMavenVersion passed
[INFO] 
[INFO] --- enforcer:3.6.2:enforce (enforce-java-version) @ jakartaee-api-parent ---
[INFO] Rule 0: org.apache.maven.enforcer.rules.version.RequireJavaVersion passed
[INFO] 
[INFO] --- remote-resources:3.3.0:process (process-resource-bundles) @ jakartaee-api-parent ---
[INFO] Preparing remote bundle org.apache.apache.resources:apache-jar-resource-bundle:1.8
[INFO] Copying 3 resources from 1 bundle.
[INFO] 
[INFO] --- install:3.1.4:install (default-install) @ jakartaee-api-parent ---
[INFO] Installing <https://ci-builds.apache.org/job/Tomee/job/tomee-jakartaee-api-master/ws/pom.xml> to /home/jenkins/.m2/repository/org/apache/tomee/jakartaee-api-parent/11.0.0-M2-SNAPSHOT/jakartaee-api-parent-11.0.0-M2-SNAPSHOT.pom
[INFO] 
[INFO] --- enforcer:3.6.2:enforce (enforce-maven-version) @ jakartaee-api-parent ---
[INFO] 
[INFO] --- enforcer:3.6.2:enforce (enforce-java-version) @ jakartaee-api-parent ---
[INFO] 
[INFO] --- remote-resources:3.3.0:process (process-resource-bundles) @ jakartaee-api-parent ---
[INFO] Preparing remote bundle org.apache.apache.resources:apache-jar-resource-bundle:1.8
[INFO] Copying 3 resources from 1 bundle.
[INFO] 
[INFO] --- install:3.1.4:install (default-install) @ jakartaee-api-parent ---
[INFO] Installing <https://ci-builds.apache.org/job/Tomee/job/tomee-jakartaee-api-master/ws/pom.xml> to /home/jenkins/.m2/repository/org/apache/tomee/jakartaee-api-parent/11.0.0-M2-SNAPSHOT/jakartaee-api-parent-11.0.0-M2-SNAPSHOT.pom
[INFO] 
[INFO] --- deploy:3.1.4:deploy (default-deploy) @ jakartaee-api-parent ---
[INFO] Downloading from apache.snapshots.https: https://repository.apache.org/content/repositories/snapshots/org/apache/tomee/jakartaee-api-parent/11.0.0-M2-SNAPSHOT/maven-metadata.xml
[INFO] Downloaded from apache.snapshots.https: https://repository.apache.org/content/repositories/snapshots/org/apache/tomee/jakartaee-api-parent/11.0.0-M2-SNAPSHOT/maven-metadata.xml (623 B at 677 B/s)
[INFO] Uploading to apache.snapshots.https: https://repository.apache.org/content/repositories/snapshots/org/apache/tomee/jakartaee-api-parent/11.0.0-M2-SNAPSHOT/jakartaee-api-parent-11.0.0-M2-20260703.122011-51.pom
[INFO] Uploaded to apache.snapshots.https: https://repository.apache.org/content/repositories/snapshots/org/apache/tomee/jakartaee-api-parent/11.0.0-M2-SNAPSHOT/jakartaee-api-parent-11.0.0-M2-20260703.122011-51.pom (2.3 kB at 2.1 kB/s)
[INFO] Downloading from apache.snapshots.https: https://repository.apache.org/content/repositories/snapshots/org/apache/tomee/jakartaee-api-parent/maven-metadata.xml
[INFO] Downloaded from apache.snapshots.https: https://repository.apache.org/content/repositories/snapshots/org/apache/tomee/jakartaee-api-parent/maven-metadata.xml (527 B at 2.5 kB/s)
[INFO] Uploading to apache.snapshots.https: https://repository.apache.org/content/repositories/snapshots/org/apache/tomee/jakartaee-api-parent/11.0.0-M2-SNAPSHOT/maven-metadata.xml
[INFO] Uploaded to apache.snapshots.https: https://repository.apache.org/content/repositories/snapshots/org/apache/tomee/jakartaee-api-parent/11.0.0-M2-SNAPSHOT/maven-metadata.xml (623 B at 581 B/s)
[INFO] Uploading to apache.snapshots.https: https://repository.apache.org/content/repositories/snapshots/org/apache/tomee/jakartaee-api-parent/maven-metadata.xml
[INFO] Uploaded to apache.snapshots.https: https://repository.apache.org/content/repositories/snapshots/org/apache/tomee/jakartaee-api-parent/maven-metadata.xml (527 B at 492 B/s)
[WARNING] Attempt to (de-)serialize anonymous class org.jfrog.hudson.maven2.MavenDependenciesRecorder$1; see: https://jenkins.io/redirect/serialization-of-anonymous-classes/
[INFO] 
[INFO] -------------------< org.apache.tomee:jakartaee-api >-------------------
[INFO] Building Apache TomEE :: Jakarta EE 11 Full API 11.0.0-M2-SNAPSHOT [2/3]
[INFO]   from api/pom.xml
[INFO] --------------------------------[ jar ]---------------------------------
[INFO] 
[INFO] --- clean:3.1.0:clean (default-clean) @ jakartaee-api ---
[INFO] 
[INFO] --- enforcer:3.6.2:enforce (enforce-maven-version) @ jakartaee-api ---
[INFO] 
[INFO] --- enforcer:3.6.2:enforce (enforce-java-version) @ jakartaee-api ---
[INFO] 
[INFO] --- remote-resources:3.3.0:process (process-resource-bundles) @ jakartaee-api ---
[INFO] Preparing remote bundle org.apache.apache.resources:apache-jar-resource-bundle:1.8
[INFO] Copying 3 resources from 1 bundle.
[INFO] 
[INFO] --- resources:3.5.0:resources (default-resources) @ jakartaee-api ---
[INFO] Copying 1 resource from src/main/resources to target/classes
[INFO] Copying 1 resource from src/main/filtered-resources to target/classes
[INFO] Copying 3 resources from target/maven-shared-archive-resources to target/classes
[INFO] 
[INFO] --- compiler:3.8.1:compile (default-compile) @ jakartaee-api ---
[INFO] Changes detected - recompiling the module!
[INFO] Compiling 2 source files to <https://ci-builds.apache.org/job/Tomee/job/tomee-jakartaee-api-master/ws/api/target/classes>
[INFO] -------------------------------------------------------------
[ERROR] COMPILATION ERROR : 
[INFO] -------------------------------------------------------------
[ERROR] error: release version 17 not supported
[INFO] 1 error
[INFO] -------------------------------------------------------------
[INFO] 
[INFO] -----------------< org.apache.tomee:jakartaee-api-tck >-----------------
[INFO] Building Apache TomEE :: Jakarta EE 11 Full API :: Signature Tests 11.0.0-M2-SNAPSHOT [3/3]
[INFO]   from tck/pom.xml
[INFO] --------------------------------[ pom ]---------------------------------
[INFO] 
[INFO] --- clean:3.5.0:clean (default-clean) @ jakartaee-api-tck ---
[INFO] 
[INFO] --- enforcer:3.6.2:enforce (enforce-maven-version) @ jakartaee-api-tck ---
[INFO] 
[INFO] --- enforcer:3.6.2:enforce (enforce-java-version) @ jakartaee-api-tck ---
[INFO] 
[INFO] --- dependency:3.10.0:unpack (unpack-classes) @ jakartaee-api-tck ---
[INFO] ------------------------------------------------------------------------
[INFO] Reactor Summary for Apache TomEE :: Jakarta EE 11 Full API :: Parent 11.0.0-M2-SNAPSHOT:
[INFO] 
[INFO] Apache TomEE :: Jakarta EE 11 Full API :: Parent ... SUCCESS [ 16.909 s]
[INFO] Apache TomEE :: Jakarta EE 11 Full API ............. FAILURE [ 22.666 s]
[INFO] Apache TomEE :: Jakarta EE 11 Full API :: Signature Tests FAILURE [  4.864 s]
[INFO] ------------------------------------------------------------------------
[INFO] BUILD FAILURE
[INFO] ------------------------------------------------------------------------
[INFO] Total time:  01:11 min
[INFO] Finished at: 2026-07-03T12:21:22Z
[INFO] ------------------------------------------------------------------------
Waiting for Jenkins to finish collecting data
[ERROR] Failed to execute goal org.apache.maven.plugins:maven-compiler-plugin:3.8.1:compile (default-compile) on project jakartaee-api: Compilation failure
[ERROR] error: release version 17 not supported
[ERROR] -> [Help 1]
[ERROR] Failed to execute goal org.apache.maven.plugins:maven-dependency-plugin:3.10.0:unpack (unpack-classes) on project jakartaee-api-tck: Unable to find/resolve artifact. The following artifacts could not be resolved: org.apache.tomee:jakartaee-api:jar:11.0.0-M2-SNAPSHOT (absent): Could not find artifact org.apache.tomee:jakartaee-api:jar:11.0.0-M2-SNAPSHOT -> [Help 2]
[ERROR] 
[ERROR] To see the full stack trace of the errors, re-run Maven with the -e switch.
[ERROR] Re-run Maven using the -X switch to enable full debug logging.
[ERROR] 
[ERROR] For more information about the errors and possible solutions, please read the following articles:
[ERROR] [Help 1] http://cwiki.apache.org/confluence/display/MAVEN/MojoFailureException
[ERROR] [Help 2] http://cwiki.apache.org/confluence/display/MAVEN/MojoExecutionException
[ERROR] 
[ERROR] After correcting the problems, you can resume the build with the command
[ERROR]   mvn <goals> -rf :jakartaee-api
[JENKINS] Archiving <https://ci-builds.apache.org/job/Tomee/job/tomee-jakartaee-api-master/ws/pom.xml> to org.apache.tomee/jakartaee-api-parent/11.0.0-M2-SNAPSHOT/jakartaee-api-parent-11.0.0-M2-SNAPSHOT.pom
[JENKINS] Archiving <https://ci-builds.apache.org/job/Tomee/job/tomee-jakartaee-api-master/ws/api/pom.xml> to org.apache.tomee/jakartaee-api/11.0.0-M2-SNAPSHOT/jakartaee-api-11.0.0-M2-SNAPSHOT.pom
[JENKINS] Archiving <https://ci-builds.apache.org/job/Tomee/job/tomee-jakartaee-api-master/ws/tck/pom.xml> to org.apache.tomee/jakartaee-api-tck/11.0.0-M2-SNAPSHOT/jakartaee-api-tck-11.0.0-M2-SNAPSHOT.pom
Sending e-mails to: commits@tomee.apache.org
Sending e-mails to: commits@tomee.apache.org
channel stopped

Build failed in Jenkins: TomEE » tomee-jakartaee-api-master #1621

Posted by Apache Jenkins Server <je...@builds.apache.org>.
See <https://ci-builds.apache.org/job/Tomee/job/tomee-jakartaee-api-master/1621/display/redirect>

Changes:


------------------------------------------
[...truncated 5.77 KiB...]
ERROR: ================================================================================
ERROR: Invalid project setup: Failed to load hudson.maven.AbstractMavenProcessFactory$ConfigureOriginalJDK
ERROR: [JENKINS-18403][JENKINS-28294] JDK 'jdk_11_latest' not supported to run Maven projects.
ERROR: Maven projects have to be launched with a Java version greater or equal to the minimum version required by the controller.
ERROR: Use the Maven JDK Toolchains (plugin) to build your maven project with an older JDK.
ERROR: Retrying with agent Java and setting compile/test properties to point to /home/jenkins/tools/java/latest11.
ERROR: ================================================================================
Established TCP socket on 36551
maven35-agent.jar already up to date
maven35-interceptor.jar already up to date
maven3-interceptor-commons.jar already up to date
[tomee-jakartaee-api-master] $ /usr/local/asfpackages/java/adoptium-jdk-17.0.12+7/bin/java -Xmx1536m -cp /home/jenkins/jenkins-agent/maven35-agent.jar:/home/jenkins/tools/maven/latest/boot/plexus-classworlds-2.9.0.jar:/home/jenkins/tools/maven/latest/conf/logging jenkins.maven3.agent.Maven35Main /home/jenkins/tools/maven/latest /home/jenkins/jenkins-agent/agent.jar /home/jenkins/jenkins-agent/maven35-interceptor.jar /home/jenkins/jenkins-agent/maven3-interceptor-commons.jar 36551
<===[JENKINS REMOTING CAPACITY]===>   channel started
Executing Maven:  -B -f <https://ci-builds.apache.org/job/Tomee/job/tomee-jakartaee-api-master/ws/pom.xml> -U --show-version --fail-at-end clean install deploy -Dfile.encoding=UTF-8
Apache Maven 3.9.11 (3e54c93a704957b63ee3494413a2b544fd3d825b)
Maven home: /usr/local/asfpackages/maven/apache-maven-3.9.11
Java version: 17.0.12, vendor: Eclipse Adoptium, runtime: /usr/local/asfpackages/java/adoptium-jdk-17.0.12+7
Default locale: en_US, platform encoding: UTF-8
OS name: "linux", version: "5.15.0-179-generic", arch: "amd64", family: "unix"
[INFO] Scanning for projects...
[INFO] ------------------------------------------------------------------------
[INFO] Reactor Build Order:
[INFO] 
[HUDSON] Collecting dependencies info
[HUDSON] Collecting dependencies info
[HUDSON] Collecting dependencies info
[INFO] Apache TomEE :: Jakarta EE 11 Full API :: Parent                   [pom]
[INFO] Apache TomEE :: Jakarta EE 11 Full API                             [jar]
[INFO] Apache TomEE :: Jakarta EE 11 Full API :: Signature Tests          [pom]
[INFO] 
[INFO] ---------------< org.apache.tomee:jakartaee-api-parent >----------------
[INFO] Building Apache TomEE :: Jakarta EE 11 Full API :: Parent 11.0.0-M2-SNAPSHOT [1/3]
[INFO]   from pom.xml
[INFO] --------------------------------[ pom ]---------------------------------
[INFO] 
[INFO] --- clean:3.5.0:clean (default-clean) @ jakartaee-api-parent ---
[INFO] 
[INFO] --- enforcer:3.6.2:enforce (enforce-maven-version) @ jakartaee-api-parent ---
[INFO] Rule 0: org.apache.maven.enforcer.rules.version.RequireMavenVersion passed
[INFO] 
[INFO] --- enforcer:3.6.2:enforce (enforce-java-version) @ jakartaee-api-parent ---
[INFO] Rule 0: org.apache.maven.enforcer.rules.version.RequireJavaVersion passed
[INFO] 
[INFO] --- remote-resources:3.3.0:process (process-resource-bundles) @ jakartaee-api-parent ---
[INFO] Preparing remote bundle org.apache.apache.resources:apache-jar-resource-bundle:1.8
[INFO] Copying 3 resources from 1 bundle.
[INFO] 
[INFO] --- install:3.1.4:install (default-install) @ jakartaee-api-parent ---
[INFO] Installing <https://ci-builds.apache.org/job/Tomee/job/tomee-jakartaee-api-master/ws/pom.xml> to /home/jenkins/.m2/repository/org/apache/tomee/jakartaee-api-parent/11.0.0-M2-SNAPSHOT/jakartaee-api-parent-11.0.0-M2-SNAPSHOT.pom
[INFO] 
[INFO] --- enforcer:3.6.2:enforce (enforce-maven-version) @ jakartaee-api-parent ---
[INFO] 
[INFO] --- enforcer:3.6.2:enforce (enforce-java-version) @ jakartaee-api-parent ---
[INFO] 
[INFO] --- remote-resources:3.3.0:process (process-resource-bundles) @ jakartaee-api-parent ---
[INFO] Preparing remote bundle org.apache.apache.resources:apache-jar-resource-bundle:1.8
[INFO] Copying 3 resources from 1 bundle.
[INFO] 
[INFO] --- install:3.1.4:install (default-install) @ jakartaee-api-parent ---
[INFO] Installing <https://ci-builds.apache.org/job/Tomee/job/tomee-jakartaee-api-master/ws/pom.xml> to /home/jenkins/.m2/repository/org/apache/tomee/jakartaee-api-parent/11.0.0-M2-SNAPSHOT/jakartaee-api-parent-11.0.0-M2-SNAPSHOT.pom
[INFO] 
[INFO] --- deploy:3.1.4:deploy (default-deploy) @ jakartaee-api-parent ---
[INFO] Downloading from apache.snapshots.https: https://repository.apache.org/content/repositories/snapshots/org/apache/tomee/jakartaee-api-parent/11.0.0-M2-SNAPSHOT/maven-metadata.xml
[INFO] Downloaded from apache.snapshots.https: https://repository.apache.org/content/repositories/snapshots/org/apache/tomee/jakartaee-api-parent/11.0.0-M2-SNAPSHOT/maven-metadata.xml (623 B at 810 B/s)
[INFO] Uploading to apache.snapshots.https: https://repository.apache.org/content/repositories/snapshots/org/apache/tomee/jakartaee-api-parent/11.0.0-M2-SNAPSHOT/jakartaee-api-parent-11.0.0-M2-20260702.121955-49.pom
[INFO] Uploaded to apache.snapshots.https: https://repository.apache.org/content/repositories/snapshots/org/apache/tomee/jakartaee-api-parent/11.0.0-M2-SNAPSHOT/jakartaee-api-parent-11.0.0-M2-20260702.121955-49.pom (2.3 kB at 2.1 kB/s)
[INFO] Downloading from apache.snapshots.https: https://repository.apache.org/content/repositories/snapshots/org/apache/tomee/jakartaee-api-parent/maven-metadata.xml
[INFO] Downloaded from apache.snapshots.https: https://repository.apache.org/content/repositories/snapshots/org/apache/tomee/jakartaee-api-parent/maven-metadata.xml (527 B at 2.8 kB/s)
[INFO] Uploading to apache.snapshots.https: https://repository.apache.org/content/repositories/snapshots/org/apache/tomee/jakartaee-api-parent/11.0.0-M2-SNAPSHOT/maven-metadata.xml
[INFO] Uploaded to apache.snapshots.https: https://repository.apache.org/content/repositories/snapshots/org/apache/tomee/jakartaee-api-parent/11.0.0-M2-SNAPSHOT/maven-metadata.xml (623 B at 580 B/s)
[INFO] Uploading to apache.snapshots.https: https://repository.apache.org/content/repositories/snapshots/org/apache/tomee/jakartaee-api-parent/maven-metadata.xml
[INFO] Uploaded to apache.snapshots.https: https://repository.apache.org/content/repositories/snapshots/org/apache/tomee/jakartaee-api-parent/maven-metadata.xml (527 B at 491 B/s)
[WARNING] Attempt to (de-)serialize anonymous class org.jfrog.hudson.maven2.MavenDependenciesRecorder$1; see: https://jenkins.io/redirect/serialization-of-anonymous-classes/
[INFO] 
[INFO] -------------------< org.apache.tomee:jakartaee-api >-------------------
[INFO] Building Apache TomEE :: Jakarta EE 11 Full API 11.0.0-M2-SNAPSHOT [2/3]
[INFO]   from api/pom.xml
[INFO] --------------------------------[ jar ]---------------------------------
[INFO] Artifact org.apache.geronimo.specs:geronimo-activation_2.0_spec:pom:1.0.0 is present in the local repository, but cached from a remote repository ID that is unavailable in current build context, verifying that is downloadable from [central (https://repo.maven.apache.org/maven2, default, releases)]
[INFO] Artifact org.apache.geronimo.specs:geronimo-activation_2.0_spec:pom:1.0.0 is present in the local repository, but cached from a remote repository ID that is unavailable in current build context, verifying that is downloadable from [central (https://repo.maven.apache.org/maven2, default, releases)]
[INFO] Downloading from central: https://repo.maven.apache.org/maven2/org/apache/geronimo/specs/geronimo-activation_2.0_spec/1.0.0/geronimo-activation_2.0_spec-1.0.0.pom
[INFO] Downloaded from central: https://repo.maven.apache.org/maven2/org/apache/geronimo/specs/geronimo-activation_2.0_spec/1.0.0/geronimo-activation_2.0_spec-1.0.0.pom (0 B at 0 B/s)
[INFO] Downloading from central: https://repo.maven.apache.org/maven2/org/apache/geronimo/specs/geronimo-jaxr_1.0_spec/2.1/geronimo-jaxr_1.0_spec-2.1.pom
[INFO] Downloaded from central: https://repo.maven.apache.org/maven2/org/apache/geronimo/specs/geronimo-jaxr_1.0_spec/2.1/geronimo-jaxr_1.0_spec-2.1.pom (4.5 kB at 98 kB/s)
[INFO] Downloading from central: https://repo.maven.apache.org/maven2/org/apache/geronimo/specs/geronimo-osgi-locator/1.1/geronimo-osgi-locator-1.1.pom
[INFO] Downloaded from central: https://repo.maven.apache.org/maven2/org/apache/geronimo/specs/geronimo-osgi-locator/1.1/geronimo-osgi-locator-1.1.pom (3.1 kB at 73 kB/s)
[INFO] Downloading from central: https://repo.maven.apache.org/maven2/org/apache/geronimo/specs/geronimo-osgi-support/1.1/geronimo-osgi-support-1.1.pom
[INFO] Downloaded from central: https://repo.maven.apache.org/maven2/org/apache/geronimo/specs/geronimo-osgi-support/1.1/geronimo-osgi-support-1.1.pom (7.9 kB at 155 kB/s)
[INFO] Downloading from central: https://repo.maven.apache.org/maven2/org/apache/tomcat/tomcat-websocket-api/11.0.11/tomcat-websocket-api-11.0.11.pom
[INFO] Downloaded from central: https://repo.maven.apache.org/maven2/org/apache/tomcat/tomcat-websocket-api/11.0.11/tomcat-websocket-api-11.0.11.pom (1.8 kB at 42 kB/s)
[INFO] Downloading from central: https://repo.maven.apache.org/maven2/org/apache/tomcat/tomcat-websocket-client-api/11.0.11/tomcat-websocket-client-api-11.0.11.pom
[INFO] Downloaded from central: https://repo.maven.apache.org/maven2/org/apache/tomcat/tomcat-websocket-client-api/11.0.11/tomcat-websocket-client-api-11.0.11.pom (1.5 kB at 10 kB/s)
[INFO] Downloading from central: https://repo.maven.apache.org/maven2/org/apache/tomcat/tomcat-servlet-api/11.0.11/tomcat-servlet-api-11.0.11.pom
[INFO] Downloaded from central: https://repo.maven.apache.org/maven2/org/apache/tomcat/tomcat-servlet-api/11.0.11/tomcat-servlet-api-11.0.11.pom (3.2 kB at 90 kB/s)
[INFO] Downloading from central: https://repo.maven.apache.org/maven2/org/apache/tomcat/tomcat-jaspic-api/11.0.11/tomcat-jaspic-api-11.0.11.pom
[INFO] Downloaded from central: https://repo.maven.apache.org/maven2/org/apache/tomcat/tomcat-jaspic-api/11.0.11/tomcat-jaspic-api-11.0.11.pom (1.5 kB at 37 kB/s)
[INFO] Downloading from central: https://repo.maven.apache.org/maven2/org/apache/tomcat/tomcat-jsp-api/11.0.11/tomcat-jsp-api-11.0.11.pom
[INFO] Downloaded from central: https://repo.maven.apache.org/maven2/org/apache/tomcat/tomcat-jsp-api/11.0.11/tomcat-jsp-api-11.0.11.pom (1.9 kB at 57 kB/s)
[INFO] Downloading from central: https://repo.maven.apache.org/maven2/jakarta/ws/rs/jakarta.ws.rs-api/4.0.0/jakarta.ws.rs-api-4.0.0-sources.jar
[INFO] Downloaded from central: https://repo.maven.apache.org/maven2/jakarta/ws/rs/jakarta.ws.rs-api/4.0.0/jakarta.ws.rs-api-4.0.0-sources.jar (255 kB at 4.1 MB/s)
[INFO] Downloading from central: https://repo.maven.apache.org/maven2/jakarta/json/jakarta.json-api/2.1.1/jakarta.json-api-2.1.1-sources.jar
[INFO] Downloading from central: https://repo.maven.apache.org/maven2/jakarta/json/bind/jakarta.json.bind-api/3.0.0/jakarta.json.bind-api-3.0.0-sources.jar
[INFO] Downloading from central: https://repo.maven.apache.org/maven2/jakarta/annotation/jakarta.annotation-api/3.0.0/jakarta.annotation-api-3.0.0-sources.jar
[INFO] Downloading from central: https://repo.maven.apache.org/maven2/jakarta/ejb/jakarta.ejb-api/4.0.1/jakarta.ejb-api-4.0.1-sources.jar
[INFO] Downloading from central: https://repo.maven.apache.org/maven2/jakarta/transaction/jakarta.transaction-api/2.0.1/jakarta.transaction-api-2.0.1-sources.jar
[INFO] Downloaded from central: https://repo.maven.apache.org/maven2/jakarta/ejb/jakarta.ejb-api/4.0.1/jakarta.ejb-api-4.0.1-sources.jar (117 kB at 2.7 MB/s)
[INFO] Downloading from central: https://repo.maven.apache.org/maven2/jakarta/persistence/jakarta.persistence-api/3.2.0/jakarta.persistence-api-3.2.0-sources.jar
[INFO] Downloaded from central: https://repo.maven.apache.org/maven2/jakarta/annotation/jakarta.annotation-api/3.0.0/jakarta.annotation-api-3.0.0-sources.jar (36 kB at 594 kB/s)
[INFO] Downloading from central: https://repo.maven.apache.org/maven2/jakarta/validation/jakarta.validation-api/3.1.1/jakarta.validation-api-3.1.1-sources.jar
[INFO] Downloaded from central: https://repo.maven.apache.org/maven2/jakarta/transaction/jakarta.transaction-api/2.0.1/jakarta.transaction-api-2.0.1-sources.jar (40 kB at 584 kB/s)
[INFO] Downloading from central: https://repo.maven.apache.org/maven2/jakarta/interceptor/jakarta.interceptor-api/2.2.0/jakarta.interceptor-api-2.2.0-sources.jar
[INFO] Downloaded from central: https://repo.maven.apache.org/maven2/jakarta/json/bind/jakarta.json.bind-api/3.0.0/jakarta.json.bind-api-3.0.0-sources.jar (47 kB at 606 kB/s)
[INFO] Downloading from central: https://repo.maven.apache.org/maven2/jakarta/enterprise/jakarta.enterprise.cdi-api/4.1.0/jakarta.enterprise.cdi-api-4.1.0-sources.jar
[INFO] Downloaded from central: https://repo.maven.apache.org/maven2/jakarta/json/jakarta.json-api/2.1.1/jakarta.json-api-2.1.1-sources.jar (77 kB at 889 kB/s)
[INFO] Downloading from central: https://repo.maven.apache.org/maven2/jakarta/enterprise/jakarta.enterprise.cdi-el-api/4.1.0/jakarta.enterprise.cdi-el-api-4.1.0-sources.jar
[INFO] Downloaded from central: https://repo.maven.apache.org/maven2/jakarta/persistence/jakarta.persistence-api/3.2.0/jakarta.persistence-api-3.2.0-sources.jar (311 kB at 3.5 MB/s)
[INFO] Downloading from central: https://repo.maven.apache.org/maven2/jakarta/inject/jakarta.inject-api/2.0.0/jakarta.inject-api-2.0.0-sources.jar
[INFO] Downloaded from central: https://repo.maven.apache.org/maven2/jakarta/validation/jakarta.validation-api/3.1.1/jakarta.validation-api-3.1.1-sources.jar (109 kB at 1.2 MB/s)
[INFO] Downloading from central: https://repo.maven.apache.org/maven2/jakarta/security/enterprise/jakarta.security.enterprise-api/4.0.0/jakarta.security.enterprise-api-4.0.0-sources.jar
[INFO] Downloaded from central: https://repo.maven.apache.org/maven2/jakarta/interceptor/jakarta.interceptor-api/2.2.0/jakarta.interceptor-api-2.2.0-sources.jar (31 kB at 331 kB/s)
[INFO] Downloading from central: https://repo.maven.apache.org/maven2/jakarta/data/jakarta.data-api/1.0.1/jakarta.data-api-1.0.1-sources.jar
[INFO] Downloaded from central: https://repo.maven.apache.org/maven2/jakarta/inject/jakarta.inject-api/2.0.0/jakarta.inject-api-2.0.0-sources.jar (18 kB at 164 kB/s)
[INFO] Downloading from central: https://repo.maven.apache.org/maven2/jakarta/jms/jakarta.jms-api/3.1.0/jakarta.jms-api-3.1.0-sources.jar
[INFO] Downloaded from central: https://repo.maven.apache.org/maven2/jakarta/enterprise/jakarta.enterprise.cdi-api/4.1.0/jakarta.enterprise.cdi-api-4.1.0-sources.jar (254 kB at 2.2 MB/s)
[INFO] Downloading from central: https://repo.maven.apache.org/maven2/org/apache/geronimo/specs/geronimo-activation_2.0_spec/1.0.0/geronimo-activation_2.0_spec-1.0.0-sources.jar
[INFO] Downloaded from central: https://repo.maven.apache.org/maven2/jakarta/enterprise/jakarta.enterprise.cdi-el-api/4.1.0/jakarta.enterprise.cdi-el-api-4.1.0-sources.jar (9.8 kB at 82 kB/s)
[INFO] Downloading from central: https://repo.maven.apache.org/maven2/jakarta/resource/jakarta.resource-api/2.1.0/jakarta.resource-api-2.1.0-sources.jar
[INFO] Downloaded from central: https://repo.maven.apache.org/maven2/jakarta/data/jakarta.data-api/1.0.1/jakarta.data-api-1.0.1-sources.jar (82 kB at 681 kB/s)
[INFO] Downloading from central: https://repo.maven.apache.org/maven2/jakarta/authorization/jakarta.authorization-api/3.0.0/jakarta.authorization-api-3.0.0-sources.jar
[INFO] Downloaded from central: https://repo.maven.apache.org/maven2/jakarta/security/enterprise/jakarta.security.enterprise-api/4.0.0/jakarta.security.enterprise-api-4.0.0-sources.jar (99 kB at 756 kB/s)
[INFO] Downloading from central: https://repo.maven.apache.org/maven2/jakarta/enterprise/concurrent/jakarta.enterprise.concurrent-api/3.1.1/jakarta.enterprise.concurrent-api-3.1.1-sources.jar
[INFO] Downloaded from central: https://repo.maven.apache.org/maven2/jakarta/jms/jakarta.jms-api/3.1.0/jakarta.jms-api-3.1.0-sources.jar (183 kB at 1.3 MB/s)
[INFO] Downloading from central: https://repo.maven.apache.org/maven2/jakarta/batch/jakarta.batch-api/2.1.1/jakarta.batch-api-2.1.1-sources.jar
[INFO] Downloaded from central: https://repo.maven.apache.org/maven2/org/apache/geronimo/specs/geronimo-activation_2.0_spec/1.0.0/geronimo-activation_2.0_spec-1.0.0-sources.jar (38 kB at 260 kB/s)
[INFO] Downloading from central: https://repo.maven.apache.org/maven2/org/apache/geronimo/specs/geronimo-j2ee-deployment_1.1_spec/1.1/geronimo-j2ee-deployment_1.1_spec-1.1-sources.jar
[INFO] Downloaded from central: https://repo.maven.apache.org/maven2/jakarta/authorization/jakarta.authorization-api/3.0.0/jakarta.authorization-api-3.0.0-sources.jar (67 kB at 457 kB/s)
[INFO] Downloading from central: https://repo.maven.apache.org/maven2/org/apache/geronimo/specs/geronimo-j2ee-management_1.1_spec/1.0.1/geronimo-j2ee-management_1.1_spec-1.0.1-sources.jar
[INFO] Downloaded from central: https://repo.maven.apache.org/maven2/jakarta/resource/jakarta.resource-api/2.1.0/jakarta.resource-api-2.1.0-sources.jar (132 kB at 871 kB/s)
[INFO] Downloading from central: https://repo.maven.apache.org/maven2/org/apache/geronimo/specs/geronimo-jaxr_1.0_spec/2.1/geronimo-jaxr_1.0_spec-2.1-sources.jar
[INFO] Downloaded from central: https://repo.maven.apache.org/maven2/jakarta/batch/jakarta.batch-api/2.1.1/jakarta.batch-api-2.1.1-sources.jar (79 kB at 494 kB/s)
[INFO] Downloading from central: https://repo.maven.apache.org/maven2/org/apache/geronimo/specs/geronimo-jaxr_1.0_spec/2.1/geronimo-jaxr_1.0_spec-2.1.jar
[INFO] Downloaded from central: https://repo.maven.apache.org/maven2/jakarta/enterprise/concurrent/jakarta.enterprise.concurrent-api/3.1.1/jakarta.enterprise.concurrent-api-3.1.1-sources.jar (78 kB at 477 kB/s)
[INFO] Downloading from central: https://repo.maven.apache.org/maven2/org/apache/geronimo/specs/geronimo-osgi-locator/1.1/geronimo-osgi-locator-1.1.jar
[INFO] Downloaded from central: https://repo.maven.apache.org/maven2/org/apache/geronimo/specs/geronimo-j2ee-deployment_1.1_spec/1.1/geronimo-j2ee-deployment_1.1_spec-1.1-sources.jar (54 kB at 316 kB/s)
[INFO] Downloading from central: https://repo.maven.apache.org/maven2/org/apache/geronimo/specs/geronimo-osgi-locator/1.1/geronimo-osgi-locator-1.1-sources.jar
[INFO] Downloaded from central: https://repo.maven.apache.org/maven2/org/apache/geronimo/specs/geronimo-j2ee-management_1.1_spec/1.0.1/geronimo-j2ee-management_1.1_spec-1.0.1-sources.jar (34 kB at 190 kB/s)
[INFO] Downloading from central: https://repo.maven.apache.org/maven2/org/apache/tomcat/tomcat-websocket-api/11.0.11/tomcat-websocket-api-11.0.11-sources.jar
[INFO] Downloaded from central: https://repo.maven.apache.org/maven2/org/apache/geronimo/specs/geronimo-osgi-locator/1.1/geronimo-osgi-locator-1.1.jar (13 kB at 74 kB/s)
[INFO] Downloading from central: https://repo.maven.apache.org/maven2/org/apache/tomcat/tomcat-websocket-client-api/11.0.11/tomcat-websocket-client-api-11.0.11.jar
[INFO] Downloaded from central: https://repo.maven.apache.org/maven2/org/apache/geronimo/specs/geronimo-osgi-locator/1.1/geronimo-osgi-locator-1.1-sources.jar (12 kB at 62 kB/s)
[INFO] Downloading from central: https://repo.maven.apache.org/maven2/org/apache/tomcat/tomcat-websocket-api/11.0.11/tomcat-websocket-api-11.0.11.jar
[INFO] Downloaded from central: https://repo.maven.apache.org/maven2/org/apache/geronimo/specs/geronimo-jaxr_1.0_spec/2.1/geronimo-jaxr_1.0_spec-2.1.jar (42 kB at 217 kB/s)
[INFO] Downloading from central: https://repo.maven.apache.org/maven2/org/apache/tomcat/tomcat-servlet-api/11.0.11/tomcat-servlet-api-11.0.11-sources.jar
[INFO] Downloaded from central: https://repo.maven.apache.org/maven2/org/apache/tomcat/tomcat-servlet-api/11.0.11/tomcat-servlet-api-11.0.11-sources.jar (485 kB at 2.1 MB/s)
[INFO] Downloading from central: https://repo.maven.apache.org/maven2/org/apache/tomcat/tomcat-servlet-api/11.0.11/tomcat-servlet-api-11.0.11.jar
[INFO] Downloaded from central: https://repo.maven.apache.org/maven2/org/apache/tomcat/tomcat-servlet-api/11.0.11/tomcat-servlet-api-11.0.11.jar (408 kB at 1.5 MB/s)
[INFO] Downloading from central: https://repo.maven.apache.org/maven2/org/apache/tomcat/tomcat-jaspic-api/11.0.11/tomcat-jaspic-api-11.0.11-sources.jar
[INFO] Downloaded from central: https://repo.maven.apache.org/maven2/org/apache/geronimo/specs/geronimo-jaxr_1.0_spec/2.1/geronimo-jaxr_1.0_spec-2.1-sources.jar (55 kB at 180 kB/s)
[INFO] Downloading from central: https://repo.maven.apache.org/maven2/org/apache/tomcat/tomcat-jaspic-api/11.0.11/tomcat-jaspic-api-11.0.11.jar
[INFO] Downloaded from central: https://repo.maven.apache.org/maven2/org/apache/tomcat/tomcat-jaspic-api/11.0.11/tomcat-jaspic-api-11.0.11.jar (28 kB at 82 kB/s)
[INFO] Downloading from central: https://repo.maven.apache.org/maven2/org/apache/tomcat/tomcat-jsp-api/11.0.11/tomcat-jsp-api-11.0.11-sources.jar
[INFO] Downloaded from central: https://repo.maven.apache.org/maven2/org/apache/tomcat/tomcat-websocket-api/11.0.11/tomcat-websocket-api-11.0.11-sources.jar (14 kB at 38 kB/s)
[INFO] Downloading from central: https://repo.maven.apache.org/maven2/org/apache/tomcat/tomcat-jsp-api/11.0.11/tomcat-jsp-api-11.0.11.jar
[INFO] Downloaded from central: https://repo.maven.apache.org/maven2/org/apache/tomcat/tomcat-websocket-client-api/11.0.11/tomcat-websocket-client-api-11.0.11.jar (32 kB at 86 kB/s)
[INFO] Downloading from central: https://repo.maven.apache.org/maven2/org/apache/tomcat/tomcat-el-api/11.0.11/tomcat-el-api-11.0.11-sources.jar
[INFO] Downloaded from central: https://repo.maven.apache.org/maven2/org/apache/tomcat/tomcat-websocket-api/11.0.11/tomcat-websocket-api-11.0.11.jar (14 kB at 37 kB/s)
[INFO] Downloaded from central: https://repo.maven.apache.org/maven2/org/apache/tomcat/tomcat-jaspic-api/11.0.11/tomcat-jaspic-api-11.0.11-sources.jar (23 kB at 59 kB/s)
[INFO] Downloaded from central: https://repo.maven.apache.org/maven2/org/apache/tomcat/tomcat-jsp-api/11.0.11/tomcat-jsp-api-11.0.11.jar (73 kB at 185 kB/s)
[INFO] Downloaded from central: https://repo.maven.apache.org/maven2/org/apache/tomcat/tomcat-el-api/11.0.11/tomcat-el-api-11.0.11-sources.jar (88 kB at 222 kB/s)
[INFO] Downloaded from central: https://repo.maven.apache.org/maven2/org/apache/tomcat/tomcat-jsp-api/11.0.11/tomcat-jsp-api-11.0.11-sources.jar (106 kB at 189 kB/s)
[INFO] 
[INFO] --- clean:3.1.0:clean (default-clean) @ jakartaee-api ---
[INFO] 
[INFO] --- enforcer:3.6.2:enforce (enforce-maven-version) @ jakartaee-api ---
[INFO] 
[INFO] --- enforcer:3.6.2:enforce (enforce-java-version) @ jakartaee-api ---
[INFO] 
[INFO] --- remote-resources:3.3.0:process (process-resource-bundles) @ jakartaee-api ---
[INFO] Preparing remote bundle org.apache.apache.resources:apache-jar-resource-bundle:1.8
[INFO] Copying 3 resources from 1 bundle.
[INFO] 
[INFO] --- resources:3.5.0:resources (default-resources) @ jakartaee-api ---
[INFO] Copying 1 resource from src/main/resources to target/classes
[INFO] Copying 1 resource from src/main/filtered-resources to target/classes
[INFO] Copying 3 resources from target/maven-shared-archive-resources to target/classes
[INFO] 
[INFO] --- compiler:3.8.1:compile (default-compile) @ jakartaee-api ---
[INFO] Changes detected - recompiling the module!
[INFO] Compiling 2 source files to <https://ci-builds.apache.org/job/Tomee/job/tomee-jakartaee-api-master/ws/api/target/classes>
[INFO] -------------------------------------------------------------
[ERROR] COMPILATION ERROR : 
[INFO] -------------------------------------------------------------
[ERROR] error: release version 17 not supported
[INFO] 1 error
[INFO] -------------------------------------------------------------
[INFO] 
[INFO] -----------------< org.apache.tomee:jakartaee-api-tck >-----------------
[INFO] Building Apache TomEE :: Jakarta EE 11 Full API :: Signature Tests 11.0.0-M2-SNAPSHOT [3/3]
[INFO]   from tck/pom.xml
[INFO] --------------------------------[ pom ]---------------------------------
[INFO] Downloading from central: https://repo.maven.apache.org/maven2/com/googlecode/maven-download-plugin/download-maven-plugin/1.11.0/download-maven-plugin-1.11.0.pom
[INFO] Downloaded from central: https://repo.maven.apache.org/maven2/com/googlecode/maven-download-plugin/download-maven-plugin/1.11.0/download-maven-plugin-1.11.0.pom (16 kB at 92 kB/s)
[INFO] Downloading from central: https://repo.maven.apache.org/maven2/com/googlecode/maven-download-plugin/download-maven-plugin/1.11.0/download-maven-plugin-1.11.0.jar
[INFO] Downloaded from central: https://repo.maven.apache.org/maven2/com/googlecode/maven-download-plugin/download-maven-plugin/1.11.0/download-maven-plugin-1.11.0.jar (62 kB at 367 kB/s)
[INFO] Downloading from central: https://repo.maven.apache.org/maven2/org/apache/maven/plugins/maven-antrun-plugin/3.0.0/maven-antrun-plugin-3.0.0.pom
[INFO] Downloaded from central: https://repo.maven.apache.org/maven2/org/apache/maven/plugins/maven-antrun-plugin/3.0.0/maven-antrun-plugin-3.0.0.pom (4.7 kB at 163 kB/s)
[INFO] Downloading from central: https://repo.maven.apache.org/maven2/org/apache/maven/plugins/maven-antrun-plugin/3.0.0/maven-antrun-plugin-3.0.0.jar
[INFO] Downloaded from central: https://repo.maven.apache.org/maven2/org/apache/maven/plugins/maven-antrun-plugin/3.0.0/maven-antrun-plugin-3.0.0.jar (39 kB at 1.4 MB/s)
[INFO] 
[INFO] --- clean:3.5.0:clean (default-clean) @ jakartaee-api-tck ---
[INFO] 
[INFO] --- enforcer:3.6.2:enforce (enforce-maven-version) @ jakartaee-api-tck ---
[INFO] 
[INFO] --- enforcer:3.6.2:enforce (enforce-java-version) @ jakartaee-api-tck ---
[INFO] 
[INFO] --- dependency:3.10.0:unpack (unpack-classes) @ jakartaee-api-tck ---
[INFO] ------------------------------------------------------------------------
[INFO] Reactor Summary for Apache TomEE :: Jakarta EE 11 Full API :: Parent 11.0.0-M2-SNAPSHOT:
[INFO] 
[INFO] Apache TomEE :: Jakarta EE 11 Full API :: Parent ... SUCCESS [ 14.868 s]
[INFO] Apache TomEE :: Jakarta EE 11 Full API ............. FAILURE [  5.288 s]
[INFO] Apache TomEE :: Jakarta EE 11 Full API :: Signature Tests FAILURE [  2.650 s]
[INFO] ------------------------------------------------------------------------
[INFO] BUILD FAILURE
[INFO] ------------------------------------------------------------------------
[INFO] Total time:  35.058 s
[INFO] Finished at: 2026-07-02T12:20:30Z
[INFO] ------------------------------------------------------------------------
Waiting for Jenkins to finish collecting data
[ERROR] Failed to execute goal org.apache.maven.plugins:maven-compiler-plugin:3.8.1:compile (default-compile) on project jakartaee-api: Compilation failure
[ERROR] error: release version 17 not supported
[ERROR] -> [Help 1]
[ERROR] Failed to execute goal org.apache.maven.plugins:maven-dependency-plugin:3.10.0:unpack (unpack-classes) on project jakartaee-api-tck: Unable to find/resolve artifact. The following artifacts could not be resolved: org.apache.tomee:jakartaee-api:jar:11.0.0-M2-SNAPSHOT (absent): Could not find artifact org.apache.tomee:jakartaee-api:jar:11.0.0-M2-SNAPSHOT -> [Help 2]
[ERROR] 
[ERROR] To see the full stack trace of the errors, re-run Maven with the -e switch.
[ERROR] Re-run Maven using the -X switch to enable full debug logging.
[ERROR] 
[ERROR] For more information about the errors and possible solutions, please read the following articles:
[ERROR] [Help 1] http://cwiki.apache.org/confluence/display/MAVEN/MojoFailureException
[ERROR] [Help 2] http://cwiki.apache.org/confluence/display/MAVEN/MojoExecutionException
[ERROR] 
[ERROR] After correcting the problems, you can resume the build with the command
[ERROR]   mvn <goals> -rf :jakartaee-api
[JENKINS] Archiving <https://ci-builds.apache.org/job/Tomee/job/tomee-jakartaee-api-master/ws/pom.xml> to org.apache.tomee/jakartaee-api-parent/11.0.0-M2-SNAPSHOT/jakartaee-api-parent-11.0.0-M2-SNAPSHOT.pom
[JENKINS] Archiving <https://ci-builds.apache.org/job/Tomee/job/tomee-jakartaee-api-master/ws/api/pom.xml> to org.apache.tomee/jakartaee-api/11.0.0-M2-SNAPSHOT/jakartaee-api-11.0.0-M2-SNAPSHOT.pom
[JENKINS] Archiving <https://ci-builds.apache.org/job/Tomee/job/tomee-jakartaee-api-master/ws/tck/pom.xml> to org.apache.tomee/jakartaee-api-tck/11.0.0-M2-SNAPSHOT/jakartaee-api-tck-11.0.0-M2-SNAPSHOT.pom
Sending e-mails to: commits@tomee.apache.org
Sending e-mails to: commits@tomee.apache.org
channel stopped

Build failed in Jenkins: TomEE » tomee-jakartaee-api-master #1620

Posted by Apache Jenkins Server <je...@builds.apache.org>.
See <https://ci-builds.apache.org/job/Tomee/job/tomee-jakartaee-api-master/1620/display/redirect>

Changes:


------------------------------------------
Started by timer
Running as SYSTEM
[EnvInject] - Loading node environment variables.
Building remotely on builds32 (ubuntu) in workspace <https://ci-builds.apache.org/job/Tomee/job/tomee-jakartaee-api-master/ws/>
The recommended git tool is: NONE
No credentials specified
 > git rev-parse --resolve-git-dir <https://ci-builds.apache.org/job/Tomee/job/tomee-jakartaee-api-master/ws/.git> # timeout=10
Fetching changes from the remote Git repository
 > git config remote.origin.url https://github.com/apache/tomee-jakartaee-api # timeout=10
Cleaning workspace
 > git rev-parse --verify HEAD # timeout=10
Resetting working tree
 > git reset --hard # timeout=10
 > git clean -fdx # timeout=10
Fetching upstream changes from https://github.com/apache/tomee-jakartaee-api
 > git --version # timeout=10
 > git --version # 'git version 2.34.1'
 > git fetch --tags --force --progress -- https://github.com/apache/tomee-jakartaee-api +refs/heads/*:refs/remotes/origin/* # timeout=10
 > git rev-parse refs/remotes/origin/main^{commit} # timeout=10
Checking out Revision c531599fb0d0f9bdb326e28cff23baaaf65af5f5 (refs/remotes/origin/main)
 > git config core.sparsecheckout # timeout=10
 > git checkout -f c531599fb0d0f9bdb326e28cff23baaaf65af5f5 # timeout=10
Commit message: "[maven-release-plugin] prepare for next development iteration"
 > git rev-list --no-walk c531599fb0d0f9bdb326e28cff23baaaf65af5f5 # timeout=10
Parsing POMs
Established TCP socket on 42383
maven35-agent.jar already up to date
maven35-interceptor.jar already up to date
maven3-interceptor-commons.jar already up to date
[tomee-jakartaee-api-master] $ /home/jenkins/tools/java/latest11/bin/java -Xmx1536m -cp /home/jenkins/jenkins-agent/maven35-agent.jar:/home/jenkins/tools/maven/latest/boot/plexus-classworlds-2.9.0.jar:/home/jenkins/tools/maven/latest/conf/logging jenkins.maven3.agent.Maven35Main /home/jenkins/tools/maven/latest /home/jenkins/jenkins-agent/agent.jar /home/jenkins/jenkins-agent/maven35-interceptor.jar /home/jenkins/jenkins-agent/maven3-interceptor-commons.jar 42383
<===[JENKINS REMOTING CAPACITY]===>   channel started
Jul 01, 2026 12:19:15 PM hudson.remoting.UserRequest perform
WARNING: LinkageError while performing UserRequest:hudson.maven.AbstractMavenProcessFactory$ConfigureOriginalJDK@34757f9a
java.lang.UnsupportedClassVersionError: Failed to load hudson.maven.AbstractMavenProcessFactory$ConfigureOriginalJDK
	at hudson.remoting.RemoteClassLoader.loadClassFile(RemoteClassLoader.java:472)
	at hudson.remoting.RemoteClassLoader.loadRemoteClass(RemoteClassLoader.java:301)
	at hudson.remoting.RemoteClassLoader.loadWithMultiClassLoader(RemoteClassLoader.java:277)
	at hudson.remoting.RemoteClassLoader.findClass(RemoteClassLoader.java:236)
	at java.base/java.lang.ClassLoader.loadClass(ClassLoader.java:594)
	at java.base/java.lang.ClassLoader.loadClass(ClassLoader.java:527)
	at java.base/java.lang.Class.forName0(Native Method)
	at java.base/java.lang.Class.forName(Class.java:398)
	at hudson.remoting.MultiClassLoaderSerializer$Input.resolveClass(MultiClassLoaderSerializer.java:133)
	at java.base/java.io.ObjectInputStream.readNonProxyDesc(ObjectInputStream.java:2003)
	at java.base/java.io.ObjectInputStream.readClassDesc(ObjectInputStream.java:1870)
	at java.base/java.io.ObjectInputStream.readOrdinaryObject(ObjectInputStream.java:2201)
	at java.base/java.io.ObjectInputStream.readObject0(ObjectInputStream.java:1687)
	at java.base/java.io.ObjectInputStream.readObject(ObjectInputStream.java:489)
	at java.base/java.io.ObjectInputStream.readObject(ObjectInputStream.java:447)
	at hudson.remoting.UserRequest.deserialize(UserRequest.java:312)
	at hudson.remoting.UserRequest.perform(UserRequest.java:196)
	at hudson.remoting.UserRequest.perform(UserRequest.java:50)
	at hudson.remoting.Request$2.run(Request.java:391)
	at hudson.remoting.InterceptingExecutorService.lambda$wrap$0(InterceptingExecutorService.java:81)
	at java.base/java.util.concurrent.FutureTask.run(FutureTask.java:264)
	at java.base/java.util.concurrent.ThreadPoolExecutor.runWorker(ThreadPoolExecutor.java:1128)
	at java.base/java.util.concurrent.ThreadPoolExecutor$Worker.run(ThreadPoolExecutor.java:628)
	at java.base/java.lang.Thread.run(Thread.java:829)
Caused by: java.lang.UnsupportedClassVersionError: Failed to load jenkins.security.MasterToSlaveCallable
	at hudson.remoting.RemoteClassLoader.loadClassFile(RemoteClassLoader.java:472)
	at hudson.remoting.RemoteClassLoader.loadRemoteClass(RemoteClassLoader.java:301)
	at hudson.remoting.RemoteClassLoader.loadWithMultiClassLoader(RemoteClassLoader.java:277)
	at hudson.remoting.RemoteClassLoader.findClass(RemoteClassLoader.java:236)
	at java.base/java.lang.ClassLoader.loadClass(ClassLoader.java:594)
	at java.base/java.lang.ClassLoader.loadClass(ClassLoader.java:527)
	at java.base/java.lang.ClassLoader.defineClass1(Native Method)
	at java.base/java.lang.ClassLoader.defineClass(ClassLoader.java:1022)
	at java.base/java.lang.ClassLoader.defineClass(ClassLoader.java:883)
	at hudson.remoting.RemoteClassLoader.loadClassFile(RemoteClassLoader.java:470)
	... 23 more
Caused by: java.lang.UnsupportedClassVersionError: jenkins/security/MasterToSlaveCallable has been compiled by a more recent version of the Java Runtime (class file version 61.0), this version of the Java Runtime only recognizes class file versions up to 55.0
	at java.base/java.lang.ClassLoader.defineClass1(Native Method)
	at java.base/java.lang.ClassLoader.defineClass(ClassLoader.java:1022)
	at java.base/java.lang.ClassLoader.defineClass(ClassLoader.java:883)
	at hudson.remoting.RemoteClassLoader.loadClassFile(RemoteClassLoader.java:470)
	... 32 more

ERROR: ================================================================================
ERROR: Invalid project setup: Failed to load hudson.maven.AbstractMavenProcessFactory$ConfigureOriginalJDK
ERROR: [JENKINS-18403][JENKINS-28294] JDK 'jdk_11_latest' not supported to run Maven projects.
ERROR: Maven projects have to be launched with a Java version greater or equal to the minimum version required by the controller.
ERROR: Use the Maven JDK Toolchains (plugin) to build your maven project with an older JDK.
ERROR: Retrying with agent Java and setting compile/test properties to point to /home/jenkins/tools/java/latest11.
ERROR: ================================================================================
Established TCP socket on 34721
maven35-agent.jar already up to date
maven35-interceptor.jar already up to date
maven3-interceptor-commons.jar already up to date
[tomee-jakartaee-api-master] $ /usr/local/asfpackages/java/adoptium-jdk-17.0.12+7/bin/java -Xmx1536m -cp /home/jenkins/jenkins-agent/maven35-agent.jar:/home/jenkins/tools/maven/latest/boot/plexus-classworlds-2.9.0.jar:/home/jenkins/tools/maven/latest/conf/logging jenkins.maven3.agent.Maven35Main /home/jenkins/tools/maven/latest /home/jenkins/jenkins-agent/agent.jar /home/jenkins/jenkins-agent/maven35-interceptor.jar /home/jenkins/jenkins-agent/maven3-interceptor-commons.jar 34721
<===[JENKINS REMOTING CAPACITY]===>   channel started
Executing Maven:  -B -f <https://ci-builds.apache.org/job/Tomee/job/tomee-jakartaee-api-master/ws/pom.xml> -U --show-version --fail-at-end clean install deploy -Dfile.encoding=UTF-8
Apache Maven 3.9.11 (3e54c93a704957b63ee3494413a2b544fd3d825b)
Maven home: /usr/local/asfpackages/maven/apache-maven-3.9.11
Java version: 17.0.12, vendor: Eclipse Adoptium, runtime: /usr/local/asfpackages/java/adoptium-jdk-17.0.12+7
Default locale: en_US, platform encoding: UTF-8
OS name: "linux", version: "5.15.0-164-generic", arch: "amd64", family: "unix"
[INFO] Scanning for projects...
[HUDSON] Collecting dependencies info
[HUDSON] Collecting dependencies info
[HUDSON] Collecting dependencies info
[INFO] ------------------------------------------------------------------------
[INFO] Reactor Build Order:
[INFO] 
[INFO] Apache TomEE :: Jakarta EE 11 Full API :: Parent                   [pom]
[INFO] Apache TomEE :: Jakarta EE 11 Full API                             [jar]
[INFO] Apache TomEE :: Jakarta EE 11 Full API :: Signature Tests          [pom]
[INFO] 
[INFO] ---------------< org.apache.tomee:jakartaee-api-parent >----------------
[INFO] Building Apache TomEE :: Jakarta EE 11 Full API :: Parent 11.0.0-M2-SNAPSHOT [1/3]
[INFO]   from pom.xml
[INFO] --------------------------------[ pom ]---------------------------------
[INFO] 
[INFO] --- clean:3.5.0:clean (default-clean) @ jakartaee-api-parent ---
[INFO] 
[INFO] --- enforcer:3.6.2:enforce (enforce-maven-version) @ jakartaee-api-parent ---
[INFO] Rule 0: org.apache.maven.enforcer.rules.version.RequireMavenVersion passed
[INFO] 
[INFO] --- enforcer:3.6.2:enforce (enforce-java-version) @ jakartaee-api-parent ---
[INFO] Rule 0: org.apache.maven.enforcer.rules.version.RequireJavaVersion passed
[INFO] 
[INFO] --- remote-resources:3.3.0:process (process-resource-bundles) @ jakartaee-api-parent ---
[INFO] Preparing remote bundle org.apache.apache.resources:apache-jar-resource-bundle:1.8
[INFO] Copying 3 resources from 1 bundle.
[INFO] 
[INFO] --- install:3.1.4:install (default-install) @ jakartaee-api-parent ---
[INFO] Installing <https://ci-builds.apache.org/job/Tomee/job/tomee-jakartaee-api-master/ws/pom.xml> to /home/jenkins/.m2/repository/org/apache/tomee/jakartaee-api-parent/11.0.0-M2-SNAPSHOT/jakartaee-api-parent-11.0.0-M2-SNAPSHOT.pom
[INFO] 
[INFO] --- enforcer:3.6.2:enforce (enforce-maven-version) @ jakartaee-api-parent ---
[INFO] 
[INFO] --- enforcer:3.6.2:enforce (enforce-java-version) @ jakartaee-api-parent ---
[INFO] 
[INFO] --- remote-resources:3.3.0:process (process-resource-bundles) @ jakartaee-api-parent ---
[INFO] Preparing remote bundle org.apache.apache.resources:apache-jar-resource-bundle:1.8
[INFO] Copying 3 resources from 1 bundle.
[INFO] 
[INFO] --- install:3.1.4:install (default-install) @ jakartaee-api-parent ---
[INFO] Installing <https://ci-builds.apache.org/job/Tomee/job/tomee-jakartaee-api-master/ws/pom.xml> to /home/jenkins/.m2/repository/org/apache/tomee/jakartaee-api-parent/11.0.0-M2-SNAPSHOT/jakartaee-api-parent-11.0.0-M2-SNAPSHOT.pom
[INFO] 
[INFO] --- deploy:3.1.4:deploy (default-deploy) @ jakartaee-api-parent ---
[INFO] Downloading from apache.snapshots.https: https://repository.apache.org/content/repositories/snapshots/org/apache/tomee/jakartaee-api-parent/11.0.0-M2-SNAPSHOT/maven-metadata.xml
[INFO] Downloaded from apache.snapshots.https: https://repository.apache.org/content/repositories/snapshots/org/apache/tomee/jakartaee-api-parent/11.0.0-M2-SNAPSHOT/maven-metadata.xml (623 B at 686 B/s)
[INFO] Uploading to apache.snapshots.https: https://repository.apache.org/content/repositories/snapshots/org/apache/tomee/jakartaee-api-parent/11.0.0-M2-SNAPSHOT/jakartaee-api-parent-11.0.0-M2-20260701.121946-47.pom
[INFO] Uploaded to apache.snapshots.https: https://repository.apache.org/content/repositories/snapshots/org/apache/tomee/jakartaee-api-parent/11.0.0-M2-SNAPSHOT/jakartaee-api-parent-11.0.0-M2-20260701.121946-47.pom (2.3 kB at 2.1 kB/s)
[INFO] Downloading from apache.snapshots.https: https://repository.apache.org/content/repositories/snapshots/org/apache/tomee/jakartaee-api-parent/maven-metadata.xml
[INFO] Downloaded from apache.snapshots.https: https://repository.apache.org/content/repositories/snapshots/org/apache/tomee/jakartaee-api-parent/maven-metadata.xml (527 B at 2.9 kB/s)
[INFO] Uploading to apache.snapshots.https: https://repository.apache.org/content/repositories/snapshots/org/apache/tomee/jakartaee-api-parent/11.0.0-M2-SNAPSHOT/maven-metadata.xml
[INFO] Uploaded to apache.snapshots.https: https://repository.apache.org/content/repositories/snapshots/org/apache/tomee/jakartaee-api-parent/11.0.0-M2-SNAPSHOT/maven-metadata.xml (623 B at 583 B/s)
[INFO] Uploading to apache.snapshots.https: https://repository.apache.org/content/repositories/snapshots/org/apache/tomee/jakartaee-api-parent/maven-metadata.xml
[INFO] Uploaded to apache.snapshots.https: https://repository.apache.org/content/repositories/snapshots/org/apache/tomee/jakartaee-api-parent/maven-metadata.xml (527 B at 496 B/s)
[WARNING] Attempt to (de-)serialize anonymous class org.jfrog.hudson.maven2.MavenDependenciesRecorder$1; see: https://jenkins.io/redirect/serialization-of-anonymous-classes/
[INFO] 
[INFO] -------------------< org.apache.tomee:jakartaee-api >-------------------
[INFO] Building Apache TomEE :: Jakarta EE 11 Full API 11.0.0-M2-SNAPSHOT [2/3]
[INFO]   from api/pom.xml
[INFO] --------------------------------[ jar ]---------------------------------
[INFO] 
[INFO] --- clean:3.1.0:clean (default-clean) @ jakartaee-api ---
[INFO] 
[INFO] --- enforcer:3.6.2:enforce (enforce-maven-version) @ jakartaee-api ---
[INFO] 
[INFO] --- enforcer:3.6.2:enforce (enforce-java-version) @ jakartaee-api ---
[INFO] 
[INFO] --- remote-resources:3.3.0:process (process-resource-bundles) @ jakartaee-api ---
[INFO] Preparing remote bundle org.apache.apache.resources:apache-jar-resource-bundle:1.8
[INFO] Copying 3 resources from 1 bundle.
[INFO] 
[INFO] --- resources:3.5.0:resources (default-resources) @ jakartaee-api ---
[INFO] Copying 1 resource from src/main/resources to target/classes
[INFO] Copying 1 resource from src/main/filtered-resources to target/classes
[INFO] Copying 3 resources from target/maven-shared-archive-resources to target/classes
[INFO] 
[INFO] --- compiler:3.8.1:compile (default-compile) @ jakartaee-api ---
[INFO] Changes detected - recompiling the module!
[INFO] Compiling 2 source files to <https://ci-builds.apache.org/job/Tomee/job/tomee-jakartaee-api-master/ws/api/target/classes>
[INFO] -------------------------------------------------------------
[ERROR] COMPILATION ERROR : 
[INFO] -------------------------------------------------------------
[ERROR] error: release version 17 not supported
[INFO] 1 error
[INFO] -------------------------------------------------------------
[INFO] 
[INFO] -----------------< org.apache.tomee:jakartaee-api-tck >-----------------
[INFO] Building Apache TomEE :: Jakarta EE 11 Full API :: Signature Tests 11.0.0-M2-SNAPSHOT [3/3]
[INFO]   from tck/pom.xml
[INFO] --------------------------------[ pom ]---------------------------------
[INFO] 
[INFO] --- clean:3.5.0:clean (default-clean) @ jakartaee-api-tck ---
[INFO] 
[INFO] --- enforcer:3.6.2:enforce (enforce-maven-version) @ jakartaee-api-tck ---
[INFO] 
[INFO] --- enforcer:3.6.2:enforce (enforce-java-version) @ jakartaee-api-tck ---
[INFO] 
[INFO] --- dependency:3.10.0:unpack (unpack-classes) @ jakartaee-api-tck ---
[INFO] ------------------------------------------------------------------------
[INFO] Reactor Summary for Apache TomEE :: Jakarta EE 11 Full API :: Parent 11.0.0-M2-SNAPSHOT:
[INFO] 
[INFO] Apache TomEE :: Jakarta EE 11 Full API :: Parent ... SUCCESS [ 16.810 s]
[INFO] Apache TomEE :: Jakarta EE 11 Full API ............. FAILURE [  5.678 s]
[INFO] Apache TomEE :: Jakarta EE 11 Full API :: Signature Tests FAILURE [  3.015 s]
[INFO] ------------------------------------------------------------------------
[INFO] BUILD FAILURE
[INFO] ------------------------------------------------------------------------
[INFO] Total time:  39.450 s
[INFO] Finished at: 2026-07-01T12:20:26Z
[INFO] ------------------------------------------------------------------------
Waiting for Jenkins to finish collecting data
[ERROR] Failed to execute goal org.apache.maven.plugins:maven-compiler-plugin:3.8.1:compile (default-compile) on project jakartaee-api: Compilation failure
[ERROR] error: release version 17 not supported
[ERROR] -> [Help 1]
[ERROR] Failed to execute goal org.apache.maven.plugins:maven-dependency-plugin:3.10.0:unpack (unpack-classes) on project jakartaee-api-tck: Unable to find/resolve artifact. The following artifacts could not be resolved: org.apache.tomee:jakartaee-api:jar:11.0.0-M2-SNAPSHOT (absent): Could not find artifact org.apache.tomee:jakartaee-api:jar:11.0.0-M2-SNAPSHOT -> [Help 2]
[ERROR] 
[ERROR] To see the full stack trace of the errors, re-run Maven with the -e switch.
[ERROR] Re-run Maven using the -X switch to enable full debug logging.
[ERROR] 
[ERROR] For more information about the errors and possible solutions, please read the following articles:
[ERROR] [Help 1] http://cwiki.apache.org/confluence/display/MAVEN/MojoFailureException
[ERROR] [Help 2] http://cwiki.apache.org/confluence/display/MAVEN/MojoExecutionException
[ERROR] 
[ERROR] After correcting the problems, you can resume the build with the command
[ERROR]   mvn <goals> -rf :jakartaee-api
[JENKINS] Archiving <https://ci-builds.apache.org/job/Tomee/job/tomee-jakartaee-api-master/ws/pom.xml> to org.apache.tomee/jakartaee-api-parent/11.0.0-M2-SNAPSHOT/jakartaee-api-parent-11.0.0-M2-SNAPSHOT.pom
[JENKINS] Archiving <https://ci-builds.apache.org/job/Tomee/job/tomee-jakartaee-api-master/ws/api/pom.xml> to org.apache.tomee/jakartaee-api/11.0.0-M2-SNAPSHOT/jakartaee-api-11.0.0-M2-SNAPSHOT.pom
[JENKINS] Archiving <https://ci-builds.apache.org/job/Tomee/job/tomee-jakartaee-api-master/ws/tck/pom.xml> to org.apache.tomee/jakartaee-api-tck/11.0.0-M2-SNAPSHOT/jakartaee-api-tck-11.0.0-M2-SNAPSHOT.pom
Sending e-mails to: commits@tomee.apache.org
Sending e-mails to: commits@tomee.apache.org
channel stopped

Build failed in Jenkins: TomEE » tomee-jakartaee-api-master #1619

Posted by Apache Jenkins Server <je...@builds.apache.org>.
See <https://ci-builds.apache.org/job/Tomee/job/tomee-jakartaee-api-master/1619/display/redirect>

Changes:


------------------------------------------
Started by timer
Running as SYSTEM
[EnvInject] - Loading node environment variables.
Building remotely on builds32 (ubuntu) in workspace <https://ci-builds.apache.org/job/Tomee/job/tomee-jakartaee-api-master/ws/>
The recommended git tool is: NONE
No credentials specified
 > git rev-parse --resolve-git-dir <https://ci-builds.apache.org/job/Tomee/job/tomee-jakartaee-api-master/ws/.git> # timeout=10
Fetching changes from the remote Git repository
 > git config remote.origin.url https://github.com/apache/tomee-jakartaee-api # timeout=10
Cleaning workspace
 > git rev-parse --verify HEAD # timeout=10
Resetting working tree
 > git reset --hard # timeout=10
 > git clean -fdx # timeout=10
Fetching upstream changes from https://github.com/apache/tomee-jakartaee-api
 > git --version # timeout=10
 > git --version # 'git version 2.34.1'
 > git fetch --tags --force --progress -- https://github.com/apache/tomee-jakartaee-api +refs/heads/*:refs/remotes/origin/* # timeout=10
 > git rev-parse refs/remotes/origin/main^{commit} # timeout=10
Checking out Revision c531599fb0d0f9bdb326e28cff23baaaf65af5f5 (refs/remotes/origin/main)
 > git config core.sparsecheckout # timeout=10
 > git checkout -f c531599fb0d0f9bdb326e28cff23baaaf65af5f5 # timeout=10
Commit message: "[maven-release-plugin] prepare for next development iteration"
 > git rev-list --no-walk c531599fb0d0f9bdb326e28cff23baaaf65af5f5 # timeout=10
Parsing POMs
Established TCP socket on 32923
maven35-agent.jar already up to date
maven35-interceptor.jar already up to date
maven3-interceptor-commons.jar already up to date
[tomee-jakartaee-api-master] $ /home/jenkins/tools/java/latest11/bin/java -Xmx1536m -cp /home/jenkins/jenkins-agent/maven35-agent.jar:/home/jenkins/tools/maven/latest/boot/plexus-classworlds-2.9.0.jar:/home/jenkins/tools/maven/latest/conf/logging jenkins.maven3.agent.Maven35Main /home/jenkins/tools/maven/latest /home/jenkins/jenkins-agent/agent.jar /home/jenkins/jenkins-agent/maven35-interceptor.jar /home/jenkins/jenkins-agent/maven3-interceptor-commons.jar 32923
<===[JENKINS REMOTING CAPACITY]===>   channel started
Jun 30, 2026 12:19:12 PM hudson.remoting.UserRequest perform
WARNING: LinkageError while performing UserRequest:hudson.maven.AbstractMavenProcessFactory$ConfigureOriginalJDK@5f3e81f4
java.lang.UnsupportedClassVersionError: Failed to load hudson.maven.AbstractMavenProcessFactory$ConfigureOriginalJDK
	at hudson.remoting.RemoteClassLoader.loadClassFile(RemoteClassLoader.java:472)
	at hudson.remoting.RemoteClassLoader.loadRemoteClass(RemoteClassLoader.java:301)
	at hudson.remoting.RemoteClassLoader.loadWithMultiClassLoader(RemoteClassLoader.java:277)
	at hudson.remoting.RemoteClassLoader.findClass(RemoteClassLoader.java:236)
	at java.base/java.lang.ClassLoader.loadClass(ClassLoader.java:594)
	at java.base/java.lang.ClassLoader.loadClass(ClassLoader.java:527)
	at java.base/java.lang.Class.forName0(Native Method)
	at java.base/java.lang.Class.forName(Class.java:398)
	at hudson.remoting.MultiClassLoaderSerializer$Input.resolveClass(MultiClassLoaderSerializer.java:133)
	at java.base/java.io.ObjectInputStream.readNonProxyDesc(ObjectInputStream.java:2003)
	at java.base/java.io.ObjectInputStream.readClassDesc(ObjectInputStream.java:1870)
	at java.base/java.io.ObjectInputStream.readOrdinaryObject(ObjectInputStream.java:2201)
	at java.base/java.io.ObjectInputStream.readObject0(ObjectInputStream.java:1687)
	at java.base/java.io.ObjectInputStream.readObject(ObjectInputStream.java:489)
	at java.base/java.io.ObjectInputStream.readObject(ObjectInputStream.java:447)
	at hudson.remoting.UserRequest.deserialize(UserRequest.java:312)
	at hudson.remoting.UserRequest.perform(UserRequest.java:196)
	at hudson.remoting.UserRequest.perform(UserRequest.java:50)
	at hudson.remoting.Request$2.run(Request.java:391)
	at hudson.remoting.InterceptingExecutorService.lambda$wrap$0(InterceptingExecutorService.java:81)
	at java.base/java.util.concurrent.FutureTask.run(FutureTask.java:264)
	at java.base/java.util.concurrent.ThreadPoolExecutor.runWorker(ThreadPoolExecutor.java:1128)
	at java.base/java.util.concurrent.ThreadPoolExecutor$Worker.run(ThreadPoolExecutor.java:628)
	at java.base/java.lang.Thread.run(Thread.java:829)
Caused by: java.lang.UnsupportedClassVersionError: Failed to load jenkins.security.MasterToSlaveCallable
	at hudson.remoting.RemoteClassLoader.loadClassFile(RemoteClassLoader.java:472)
	at hudson.remoting.RemoteClassLoader.loadRemoteClass(RemoteClassLoader.java:301)
	at hudson.remoting.RemoteClassLoader.loadWithMultiClassLoader(RemoteClassLoader.java:277)
	at hudson.remoting.RemoteClassLoader.findClass(RemoteClassLoader.java:236)
	at java.base/java.lang.ClassLoader.loadClass(ClassLoader.java:594)
	at java.base/java.lang.ClassLoader.loadClass(ClassLoader.java:527)
	at java.base/java.lang.ClassLoader.defineClass1(Native Method)
	at java.base/java.lang.ClassLoader.defineClass(ClassLoader.java:1022)
	at java.base/java.lang.ClassLoader.defineClass(ClassLoader.java:883)
	at hudson.remoting.RemoteClassLoader.loadClassFile(RemoteClassLoader.java:470)
	... 23 more
Caused by: java.lang.UnsupportedClassVersionError: jenkins/security/MasterToSlaveCallable has been compiled by a more recent version of the Java Runtime (class file version 61.0), this version of the Java Runtime only recognizes class file versions up to 55.0
	at java.base/java.lang.ClassLoader.defineClass1(Native Method)
	at java.base/java.lang.ClassLoader.defineClass(ClassLoader.java:1022)
	at java.base/java.lang.ClassLoader.defineClass(ClassLoader.java:883)
	at hudson.remoting.RemoteClassLoader.loadClassFile(RemoteClassLoader.java:470)
	... 32 more

ERROR: ================================================================================
ERROR: Invalid project setup: Failed to load hudson.maven.AbstractMavenProcessFactory$ConfigureOriginalJDK
ERROR: [JENKINS-18403][JENKINS-28294] JDK 'jdk_11_latest' not supported to run Maven projects.
ERROR: Maven projects have to be launched with a Java version greater or equal to the minimum version required by the controller.
ERROR: Use the Maven JDK Toolchains (plugin) to build your maven project with an older JDK.
ERROR: Retrying with agent Java and setting compile/test properties to point to /home/jenkins/tools/java/latest11.
ERROR: ================================================================================
Established TCP socket on 38515
maven35-agent.jar already up to date
maven35-interceptor.jar already up to date
maven3-interceptor-commons.jar already up to date
[tomee-jakartaee-api-master] $ /usr/local/asfpackages/java/adoptium-jdk-17.0.12+7/bin/java -Xmx1536m -cp /home/jenkins/jenkins-agent/maven35-agent.jar:/home/jenkins/tools/maven/latest/boot/plexus-classworlds-2.9.0.jar:/home/jenkins/tools/maven/latest/conf/logging jenkins.maven3.agent.Maven35Main /home/jenkins/tools/maven/latest /home/jenkins/jenkins-agent/agent.jar /home/jenkins/jenkins-agent/maven35-interceptor.jar /home/jenkins/jenkins-agent/maven3-interceptor-commons.jar 38515
<===[JENKINS REMOTING CAPACITY]===>   channel started
Executing Maven:  -B -f <https://ci-builds.apache.org/job/Tomee/job/tomee-jakartaee-api-master/ws/pom.xml> -U --show-version --fail-at-end clean install deploy -Dfile.encoding=UTF-8
Apache Maven 3.9.11 (3e54c93a704957b63ee3494413a2b544fd3d825b)
Maven home: /usr/local/asfpackages/maven/apache-maven-3.9.11
Java version: 17.0.12, vendor: Eclipse Adoptium, runtime: /usr/local/asfpackages/java/adoptium-jdk-17.0.12+7
Default locale: en_US, platform encoding: UTF-8
OS name: "linux", version: "5.15.0-164-generic", arch: "amd64", family: "unix"
[INFO] Scanning for projects...
[HUDSON] Collecting dependencies info
[INFO] ------------------------------------------------------------------------
[INFO] Reactor Build Order:
[INFO] 
[HUDSON] Collecting dependencies info
[HUDSON] Collecting dependencies info
[INFO] Apache TomEE :: Jakarta EE 11 Full API :: Parent                   [pom]
[INFO] Apache TomEE :: Jakarta EE 11 Full API                             [jar]
[INFO] Apache TomEE :: Jakarta EE 11 Full API :: Signature Tests          [pom]
[INFO] 
[INFO] ---------------< org.apache.tomee:jakartaee-api-parent >----------------
[INFO] Building Apache TomEE :: Jakarta EE 11 Full API :: Parent 11.0.0-M2-SNAPSHOT [1/3]
[INFO]   from pom.xml
[INFO] --------------------------------[ pom ]---------------------------------
[INFO] 
[INFO] --- clean:3.5.0:clean (default-clean) @ jakartaee-api-parent ---
[INFO] 
[INFO] --- enforcer:3.6.2:enforce (enforce-maven-version) @ jakartaee-api-parent ---
[INFO] Rule 0: org.apache.maven.enforcer.rules.version.RequireMavenVersion passed
[INFO] 
[INFO] --- enforcer:3.6.2:enforce (enforce-java-version) @ jakartaee-api-parent ---
[INFO] Rule 0: org.apache.maven.enforcer.rules.version.RequireJavaVersion passed
[INFO] 
[INFO] --- remote-resources:3.3.0:process (process-resource-bundles) @ jakartaee-api-parent ---
[INFO] Preparing remote bundle org.apache.apache.resources:apache-jar-resource-bundle:1.8
[INFO] Copying 3 resources from 1 bundle.
[INFO] 
[INFO] --- install:3.1.4:install (default-install) @ jakartaee-api-parent ---
[INFO] Installing <https://ci-builds.apache.org/job/Tomee/job/tomee-jakartaee-api-master/ws/pom.xml> to /home/jenkins/.m2/repository/org/apache/tomee/jakartaee-api-parent/11.0.0-M2-SNAPSHOT/jakartaee-api-parent-11.0.0-M2-SNAPSHOT.pom
[INFO] 
[INFO] --- enforcer:3.6.2:enforce (enforce-maven-version) @ jakartaee-api-parent ---
[INFO] 
[INFO] --- enforcer:3.6.2:enforce (enforce-java-version) @ jakartaee-api-parent ---
[INFO] 
[INFO] --- remote-resources:3.3.0:process (process-resource-bundles) @ jakartaee-api-parent ---
[INFO] Preparing remote bundle org.apache.apache.resources:apache-jar-resource-bundle:1.8
[INFO] Copying 3 resources from 1 bundle.
[INFO] 
[INFO] --- install:3.1.4:install (default-install) @ jakartaee-api-parent ---
[INFO] Installing <https://ci-builds.apache.org/job/Tomee/job/tomee-jakartaee-api-master/ws/pom.xml> to /home/jenkins/.m2/repository/org/apache/tomee/jakartaee-api-parent/11.0.0-M2-SNAPSHOT/jakartaee-api-parent-11.0.0-M2-SNAPSHOT.pom
[INFO] 
[INFO] --- deploy:3.1.4:deploy (default-deploy) @ jakartaee-api-parent ---
[INFO] Downloading from apache.snapshots.https: https://repository.apache.org/content/repositories/snapshots/org/apache/tomee/jakartaee-api-parent/11.0.0-M2-SNAPSHOT/maven-metadata.xml
[INFO] Downloaded from apache.snapshots.https: https://repository.apache.org/content/repositories/snapshots/org/apache/tomee/jakartaee-api-parent/11.0.0-M2-SNAPSHOT/maven-metadata.xml (623 B at 712 B/s)
[INFO] Uploading to apache.snapshots.https: https://repository.apache.org/content/repositories/snapshots/org/apache/tomee/jakartaee-api-parent/11.0.0-M2-SNAPSHOT/jakartaee-api-parent-11.0.0-M2-20260630.121956-45.pom
[INFO] Uploaded to apache.snapshots.https: https://repository.apache.org/content/repositories/snapshots/org/apache/tomee/jakartaee-api-parent/11.0.0-M2-SNAPSHOT/jakartaee-api-parent-11.0.0-M2-20260630.121956-45.pom (2.3 kB at 2.1 kB/s)
[INFO] Downloading from apache.snapshots.https: https://repository.apache.org/content/repositories/snapshots/org/apache/tomee/jakartaee-api-parent/maven-metadata.xml
[INFO] Downloaded from apache.snapshots.https: https://repository.apache.org/content/repositories/snapshots/org/apache/tomee/jakartaee-api-parent/maven-metadata.xml (527 B at 2.8 kB/s)
[INFO] Uploading to apache.snapshots.https: https://repository.apache.org/content/repositories/snapshots/org/apache/tomee/jakartaee-api-parent/11.0.0-M2-SNAPSHOT/maven-metadata.xml
[INFO] Uploaded to apache.snapshots.https: https://repository.apache.org/content/repositories/snapshots/org/apache/tomee/jakartaee-api-parent/11.0.0-M2-SNAPSHOT/maven-metadata.xml (623 B at 587 B/s)
[INFO] Uploading to apache.snapshots.https: https://repository.apache.org/content/repositories/snapshots/org/apache/tomee/jakartaee-api-parent/maven-metadata.xml
[INFO] Uploaded to apache.snapshots.https: https://repository.apache.org/content/repositories/snapshots/org/apache/tomee/jakartaee-api-parent/maven-metadata.xml (527 B at 493 B/s)
[WARNING] Attempt to (de-)serialize anonymous class org.jfrog.hudson.maven2.MavenDependenciesRecorder$1; see: https://jenkins.io/redirect/serialization-of-anonymous-classes/
[INFO] 
[INFO] -------------------< org.apache.tomee:jakartaee-api >-------------------
[INFO] Building Apache TomEE :: Jakarta EE 11 Full API 11.0.0-M2-SNAPSHOT [2/3]
[INFO]   from api/pom.xml
[INFO] --------------------------------[ jar ]---------------------------------
[INFO] 
[INFO] --- clean:3.1.0:clean (default-clean) @ jakartaee-api ---
[INFO] 
[INFO] --- enforcer:3.6.2:enforce (enforce-maven-version) @ jakartaee-api ---
[INFO] 
[INFO] --- enforcer:3.6.2:enforce (enforce-java-version) @ jakartaee-api ---
[INFO] 
[INFO] --- remote-resources:3.3.0:process (process-resource-bundles) @ jakartaee-api ---
[INFO] Preparing remote bundle org.apache.apache.resources:apache-jar-resource-bundle:1.8
[INFO] Copying 3 resources from 1 bundle.
[INFO] 
[INFO] --- resources:3.5.0:resources (default-resources) @ jakartaee-api ---
[INFO] Copying 1 resource from src/main/resources to target/classes
[INFO] Copying 1 resource from src/main/filtered-resources to target/classes
[INFO] Copying 3 resources from target/maven-shared-archive-resources to target/classes
[INFO] 
[INFO] --- compiler:3.8.1:compile (default-compile) @ jakartaee-api ---
[INFO] Changes detected - recompiling the module!
[INFO] Compiling 2 source files to <https://ci-builds.apache.org/job/Tomee/job/tomee-jakartaee-api-master/ws/api/target/classes>
[INFO] -------------------------------------------------------------
[ERROR] COMPILATION ERROR : 
[INFO] -------------------------------------------------------------
[ERROR] error: release version 17 not supported
[INFO] 1 error
[INFO] -------------------------------------------------------------
[INFO] 
[INFO] -----------------< org.apache.tomee:jakartaee-api-tck >-----------------
[INFO] Building Apache TomEE :: Jakarta EE 11 Full API :: Signature Tests 11.0.0-M2-SNAPSHOT [3/3]
[INFO]   from tck/pom.xml
[INFO] --------------------------------[ pom ]---------------------------------
[INFO] 
[INFO] --- clean:3.5.0:clean (default-clean) @ jakartaee-api-tck ---
[INFO] 
[INFO] --- enforcer:3.6.2:enforce (enforce-maven-version) @ jakartaee-api-tck ---
[INFO] 
[INFO] --- enforcer:3.6.2:enforce (enforce-java-version) @ jakartaee-api-tck ---
[INFO] 
[INFO] --- dependency:3.10.0:unpack (unpack-classes) @ jakartaee-api-tck ---
[INFO] ------------------------------------------------------------------------
[INFO] Reactor Summary for Apache TomEE :: Jakarta EE 11 Full API :: Parent 11.0.0-M2-SNAPSHOT:
[INFO] 
[INFO] Apache TomEE :: Jakarta EE 11 Full API :: Parent ... SUCCESS [ 16.768 s]
[INFO] Apache TomEE :: Jakarta EE 11 Full API ............. FAILURE [  5.898 s]
[INFO] Apache TomEE :: Jakarta EE 11 Full API :: Signature Tests FAILURE [  2.952 s]
[INFO] ------------------------------------------------------------------------
[INFO] BUILD FAILURE
[INFO] ------------------------------------------------------------------------
[INFO] Total time:  39.667 s
[INFO] Finished at: 2026-06-30T12:20:36Z
[INFO] ------------------------------------------------------------------------
Waiting for Jenkins to finish collecting data
[ERROR] Failed to execute goal org.apache.maven.plugins:maven-compiler-plugin:3.8.1:compile (default-compile) on project jakartaee-api: Compilation failure
[ERROR] error: release version 17 not supported
[ERROR] -> [Help 1]
[ERROR] Failed to execute goal org.apache.maven.plugins:maven-dependency-plugin:3.10.0:unpack (unpack-classes) on project jakartaee-api-tck: Unable to find/resolve artifact. The following artifacts could not be resolved: org.apache.tomee:jakartaee-api:jar:11.0.0-M2-SNAPSHOT (absent): Could not find artifact org.apache.tomee:jakartaee-api:jar:11.0.0-M2-SNAPSHOT -> [Help 2]
[ERROR] 
[ERROR] To see the full stack trace of the errors, re-run Maven with the -e switch.
[ERROR] Re-run Maven using the -X switch to enable full debug logging.
[ERROR] 
[ERROR] For more information about the errors and possible solutions, please read the following articles:
[ERROR] [Help 1] http://cwiki.apache.org/confluence/display/MAVEN/MojoFailureException
[ERROR] [Help 2] http://cwiki.apache.org/confluence/display/MAVEN/MojoExecutionException
[ERROR] 
[ERROR] After correcting the problems, you can resume the build with the command
[ERROR]   mvn <goals> -rf :jakartaee-api
[JENKINS] Archiving <https://ci-builds.apache.org/job/Tomee/job/tomee-jakartaee-api-master/ws/pom.xml> to org.apache.tomee/jakartaee-api-parent/11.0.0-M2-SNAPSHOT/jakartaee-api-parent-11.0.0-M2-SNAPSHOT.pom
[JENKINS] Archiving <https://ci-builds.apache.org/job/Tomee/job/tomee-jakartaee-api-master/ws/api/pom.xml> to org.apache.tomee/jakartaee-api/11.0.0-M2-SNAPSHOT/jakartaee-api-11.0.0-M2-SNAPSHOT.pom
[JENKINS] Archiving <https://ci-builds.apache.org/job/Tomee/job/tomee-jakartaee-api-master/ws/tck/pom.xml> to org.apache.tomee/jakartaee-api-tck/11.0.0-M2-SNAPSHOT/jakartaee-api-tck-11.0.0-M2-SNAPSHOT.pom
Sending e-mails to: commits@tomee.apache.org
Sending e-mails to: commits@tomee.apache.org
channel stopped