You are viewing a plain text version of this content. The canonical link for it is here.
Posted to dev@kafka.apache.org by Apache Jenkins Server <je...@builds.apache.org> on 2015/12/11 09:00:26 UTC
Build failed in Jenkins: kafka-trunk-jdk7 #899
See <https://builds.apache.org/job/kafka-trunk-jdk7/899/changes>
Changes:
[wangguoz] MINOR: test ktable state store creation
------------------------------------------
[...truncated 1455 lines...]
kafka.log.LogTest > testTruncateTo PASSED
kafka.log.LogTest > testCleanShutdownFile PASSED
kafka.log.OffsetIndexTest > lookupExtremeCases PASSED
kafka.log.OffsetIndexTest > appendTooMany PASSED
kafka.log.OffsetIndexTest > randomLookupTest PASSED
kafka.log.OffsetIndexTest > testReopen PASSED
kafka.log.OffsetIndexTest > appendOutOfOrder PASSED
kafka.log.OffsetIndexTest > truncate PASSED
kafka.log.LogSegmentTest > testRecoveryWithCorruptMessage PASSED
kafka.log.LogSegmentTest > testRecoveryFixesCorruptIndex PASSED
kafka.log.LogSegmentTest > testReadFromGap PASSED
kafka.log.LogSegmentTest > testTruncate PASSED
kafka.log.LogSegmentTest > testReadBeforeFirstOffset PASSED
kafka.log.LogSegmentTest > testCreateWithInitFileSizeAppendMessage PASSED
kafka.log.LogSegmentTest > testChangeFileSuffixes PASSED
kafka.log.LogSegmentTest > testMaxOffset PASSED
kafka.log.LogSegmentTest > testNextOffsetCalculation PASSED
kafka.log.LogSegmentTest > testReadOnEmptySegment PASSED
kafka.log.LogSegmentTest > testReadAfterLast PASSED
kafka.log.LogSegmentTest > testCreateWithInitFileSizeClearShutdown PASSED
kafka.log.LogSegmentTest > testTruncateFull PASSED
kafka.log.CleanerTest > testBuildOffsetMap PASSED
kafka.log.CleanerTest > testSegmentGrouping PASSED
kafka.log.CleanerTest > testCleanSegmentsWithAbort PASSED
kafka.log.CleanerTest > testSegmentGroupingWithSparseOffsets PASSED
kafka.log.CleanerTest > testRecoveryAfterCrash PASSED
kafka.log.CleanerTest > testLogToClean PASSED
kafka.log.CleanerTest > testCleaningWithDeletes PASSED
kafka.log.CleanerTest > testCleanSegments PASSED
kafka.log.CleanerTest > testCleaningWithUnkeyedMessages PASSED
kafka.log.OffsetMapTest > testClear PASSED
kafka.log.OffsetMapTest > testBasicValidation PASSED
kafka.coordinator.GroupCoordinatorResponseTest > testHeartbeatWrongCoordinator PASSED
kafka.coordinator.GroupCoordinatorResponseTest > testDescribeGroupStable PASSED
kafka.coordinator.GroupCoordinatorResponseTest > testHeartbeatIllegalGeneration PASSED
kafka.coordinator.GroupCoordinatorResponseTest > testDescribeGroupWrongCoordinator PASSED
kafka.coordinator.GroupCoordinatorResponseTest > testDescribeGroupRebalancing PASSED
kafka.coordinator.GroupCoordinatorResponseTest > testLeaderFailureInSyncGroup PASSED
kafka.coordinator.GroupCoordinatorResponseTest > testGenerationIdIncrementsOnRebalance PASSED
kafka.coordinator.GroupCoordinatorResponseTest > testSyncGroupFromIllegalGeneration PASSED
kafka.coordinator.GroupCoordinatorResponseTest > testInvalidGroupId PASSED
kafka.coordinator.GroupCoordinatorResponseTest > testHeartbeatUnknownGroup PASSED
kafka.coordinator.GroupCoordinatorResponseTest > testListGroupsIncludesStableGroups PASSED
kafka.coordinator.GroupCoordinatorResponseTest > testHeartbeatDuringRebalanceCausesRebalanceInProgress PASSED
kafka.coordinator.GroupCoordinatorResponseTest > testJoinGroupInconsistentGroupProtocol PASSED
kafka.coordinator.GroupCoordinatorResponseTest > testJoinGroupSessionTimeoutTooLarge PASSED
kafka.coordinator.GroupCoordinatorResponseTest > testJoinGroupSessionTimeoutTooSmall PASSED
kafka.coordinator.GroupCoordinatorResponseTest > testSyncGroupEmptyAssignment PASSED
kafka.coordinator.GroupCoordinatorResponseTest > testCommitOffsetWithDefaultGeneration PASSED
kafka.coordinator.GroupCoordinatorResponseTest > testJoinGroupFromUnchangedLeaderShouldRebalance PASSED
kafka.coordinator.GroupCoordinatorResponseTest > testHeartbeatRebalanceInProgress PASSED
kafka.coordinator.GroupCoordinatorResponseTest > testLeaveGroupUnknownGroup PASSED
kafka.coordinator.GroupCoordinatorResponseTest > testListGroupsIncludesRebalancingGroups PASSED
kafka.coordinator.GroupCoordinatorResponseTest > testSyncGroupFollowerAfterLeader PASSED
kafka.coordinator.GroupCoordinatorResponseTest > testCommitOffsetInAwaitingSync PASSED
kafka.coordinator.GroupCoordinatorResponseTest > testJoinGroupWrongCoordinator PASSED
kafka.coordinator.GroupCoordinatorResponseTest > testJoinGroupUnknownConsumerExistingGroup PASSED
kafka.coordinator.GroupCoordinatorResponseTest > testSyncGroupFromUnknownGroup PASSED
kafka.coordinator.GroupCoordinatorResponseTest > testJoinGroupInconsistentProtocolType PASSED
kafka.coordinator.GroupCoordinatorResponseTest > testCommitOffsetFromUnknownGroup PASSED
kafka.coordinator.GroupCoordinatorResponseTest > testLeaveGroupWrongCoordinator PASSED
kafka.coordinator.GroupCoordinatorResponseTest > testLeaveGroupUnknownConsumerExistingGroup PASSED
kafka.coordinator.GroupCoordinatorResponseTest > testJoinGroupUnknownConsumerNewGroup PASSED
kafka.coordinator.GroupCoordinatorResponseTest > testJoinGroupFromUnchangedFollowerDoesNotRebalance PASSED
kafka.coordinator.GroupCoordinatorResponseTest > testValidJoinGroup PASSED
kafka.coordinator.GroupCoordinatorResponseTest > testSyncGroupLeaderAfterFollower PASSED
kafka.coordinator.GroupCoordinatorResponseTest > testSyncGroupFromUnknownMember PASSED
kafka.coordinator.GroupCoordinatorResponseTest > testValidLeaveGroup PASSED
kafka.coordinator.GroupCoordinatorResponseTest > testDescribeGroupInactiveGroup PASSED
kafka.coordinator.GroupCoordinatorResponseTest > testSyncGroupNotCoordinator PASSED
kafka.coordinator.GroupCoordinatorResponseTest > testHeartbeatUnknownConsumerExistingGroup PASSED
kafka.coordinator.GroupCoordinatorResponseTest > testValidHeartbeat PASSED
kafka.coordinator.MemberMetadataTest > testMatchesSupportedProtocols PASSED
kafka.coordinator.MemberMetadataTest > testMetadata PASSED
kafka.coordinator.MemberMetadataTest > testMetadataRaisesOnUnsupportedProtocol PASSED
kafka.coordinator.MemberMetadataTest > testVoteForPreferredProtocol PASSED
kafka.coordinator.MemberMetadataTest > testVoteRaisesOnNoSupportedProtocols PASSED
kafka.coordinator.GroupMetadataTest > testDeadToAwaitingSyncIllegalTransition PASSED
kafka.coordinator.GroupMetadataTest > testPreparingRebalanceToStableIllegalTransition PASSED
kafka.coordinator.GroupMetadataTest > testCannotRebalanceWhenDead PASSED
kafka.coordinator.GroupMetadataTest > testSelectProtocol PASSED
kafka.coordinator.GroupMetadataTest > testCannotRebalanceWhenPreparingRebalance PASSED
kafka.coordinator.GroupMetadataTest > testDeadToPreparingRebalanceIllegalTransition PASSED
kafka.coordinator.GroupMetadataTest > testCanRebalanceWhenAwaitingSync PASSED
kafka.coordinator.GroupMetadataTest > testAwaitingSyncToPreparingRebalanceTransition PASSED
kafka.coordinator.GroupMetadataTest > testStableToAwaitingSyncIllegalTransition PASSED
kafka.coordinator.GroupMetadataTest > testDeadToDeadIllegalTransition PASSED
kafka.coordinator.GroupMetadataTest > testSelectProtocolRaisesIfNoMembers PASSED
kafka.coordinator.GroupMetadataTest > testStableToPreparingRebalanceTransition PASSED
kafka.coordinator.GroupMetadataTest > testPreparingRebalanceToDeadTransition PASSED
kafka.coordinator.GroupMetadataTest > testStableToStableIllegalTransition PASSED
kafka.coordinator.GroupMetadataTest > testAwaitingSyncToStableTransition PASSED
kafka.coordinator.GroupMetadataTest > testDeadToStableIllegalTransition PASSED
kafka.coordinator.GroupMetadataTest > testAwaitingSyncToAwaitingSyncIllegalTransition PASSED
kafka.coordinator.GroupMetadataTest > testSupportsProtocols PASSED
kafka.coordinator.GroupMetadataTest > testCanRebalanceWhenStable PASSED
kafka.coordinator.GroupMetadataTest > testPreparingRebalanceToPreparingRebalanceIllegalTransition PASSED
kafka.coordinator.GroupMetadataTest > testSelectProtocolChoosesCompatibleProtocol PASSED
kafka.javaapi.message.ByteBufferMessageSetTest > testSizeInBytesWithCompression PASSED
kafka.javaapi.message.ByteBufferMessageSetTest > testIteratorIsConsistentWithCompression PASSED
kafka.javaapi.message.ByteBufferMessageSetTest > testIteratorIsConsistent PASSED
kafka.javaapi.message.ByteBufferMessageSetTest > testEqualsWithCompression PASSED
kafka.javaapi.message.ByteBufferMessageSetTest > testWrittenEqualsRead PASSED
kafka.javaapi.message.ByteBufferMessageSetTest > testEquals PASSED
kafka.javaapi.message.ByteBufferMessageSetTest > testSizeInBytes PASSED
kafka.javaapi.consumer.ZookeeperConsumerConnectorTest > testBasic PASSED
kafka.KafkaTest > testGetKafkaConfigFromArgsWrongSetValue PASSED
kafka.KafkaTest > testKafkaSslPasswords PASSED
kafka.KafkaTest > testGetKafkaConfigFromArgs PASSED
kafka.KafkaTest > testGetKafkaConfigFromArgsNonArgsAtTheEnd PASSED
kafka.KafkaTest > testGetKafkaConfigFromArgsNonArgsOnly PASSED
kafka.KafkaTest > testGetKafkaConfigFromArgsNonArgsAtTheBegging PASSED
kafka.controller.ControllerFailoverTest > testMetadataUpdate PASSED
647 tests completed, 1 failed
:kafka-trunk-jdk7:core:test FAILED
:test_core_2_10 FAILED
FAILURE: Build failed with an exception.
* What went wrong:
Execution failed for task ':core:test'.
> There were failing tests. See the report at: file://<https://builds.apache.org/job/kafka-trunk-jdk7/ws/core/build/reports/tests/index.html>
* Try:
Run with --stacktrace option to get the stack trace. Run with --info or --debug option to get more log output.
BUILD FAILED
Total time: 44 mins 51.64 secs
Build step 'Execute shell' marked build as failure
Recording test results
Setting GRADLE_2_4_RC_2_HOME=/home/jenkins/jenkins-slave/tools/hudson.plugins.gradle.GradleInstallation/Gradle_2.4-rc-2
Setting JDK_1_7U51_HOME=/home/jenkins/jenkins-slave/tools/hudson.model.JDK/jdk-1.7u51
Setting GRADLE_2_4_RC_2_HOME=/home/jenkins/jenkins-slave/tools/hudson.plugins.gradle.GradleInstallation/Gradle_2.4-rc-2
Setting JDK_1_7U51_HOME=/home/jenkins/jenkins-slave/tools/hudson.model.JDK/jdk-1.7u51
Jenkins build is back to normal : kafka-trunk-jdk7 #901
Posted by Apache Jenkins Server <je...@builds.apache.org>.
See <https://builds.apache.org/job/kafka-trunk-jdk7/901/changes>
Build failed in Jenkins: kafka-trunk-jdk7 #900
Posted by Apache Jenkins Server <je...@builds.apache.org>.
See <https://builds.apache.org/job/kafka-trunk-jdk7/900/changes>
Changes:
[me] KAFKA-2070; Replace Offset{Request,Response} with o.a.k.c requests
------------------------------------------
[...truncated 1386 lines...]
kafka.api.PlaintextConsumerTest > testPartitionsForAutoCreate PASSED
kafka.api.PlaintextConsumerTest > testShrinkingTopicSubscriptions PASSED
kafka.api.PlaintextConsumerTest > testMultiConsumerSessionTimeoutOnStopPolling PASSED
kafka.api.PlaintextConsumerTest > testPartitionsForInvalidTopic PASSED
kafka.api.PlaintextConsumerTest > testSeek PASSED
kafka.api.PlaintextConsumerTest > testMultiConsumerSessionTimeoutOnClose PASSED
kafka.api.PlaintextConsumerTest > testFetchRecordTooLarge PASSED
kafka.api.PlaintextConsumerTest > testMultiConsumerDefaultAssignment PASSED
kafka.api.PlaintextConsumerTest > testAutoCommitOnClose PASSED
kafka.api.PlaintextConsumerTest > testExpandingTopicSubscriptions PASSED
kafka.api.PlaintextConsumerTest > testPatternUnsubscription PASSED
kafka.api.PlaintextConsumerTest > testGroupConsumption PASSED
kafka.api.PlaintextConsumerTest > testPartitionsFor PASSED
kafka.api.PlaintextConsumerTest > testMultiConsumerRoundRobinAssignment PASSED
kafka.api.PlaintextConsumerTest > testPartitionPauseAndResume PASSED
kafka.api.PlaintextConsumerTest > testAutoCommitOnCloseAfterWakeup PASSED
kafka.api.PlaintextConsumerTest > testAutoOffsetReset PASSED
kafka.api.PlaintextConsumerTest > testFetchInvalidOffset PASSED
kafka.api.PlaintextConsumerTest > testCommitMetadata PASSED
kafka.api.PlaintextConsumerTest > testRoundRobinAssignment PASSED
kafka.api.PlaintextConsumerTest > testPatternSubscription PASSED
kafka.api.PlaintextConsumerTest > testPauseStateNotPreservedByRebalance PASSED
kafka.api.PlaintextConsumerTest > testUnsubscribeTopic PASSED
kafka.api.PlaintextConsumerTest > testListTopics PASSED
kafka.api.PlaintextConsumerTest > testAutoCommitOnRebalance PASSED
kafka.api.PlaintextConsumerTest > testSimpleConsumption PASSED
kafka.api.PlaintextConsumerTest > testPartitionReassignmentCallback PASSED
kafka.api.PlaintextConsumerTest > testCommitSpecifiedOffsets PASSED
kafka.api.ProducerBounceTest > testBrokerFailure PASSED
kafka.api.ProducerFailureHandlingTest > testCannotSendToInternalTopic PASSED
kafka.api.ProducerFailureHandlingTest > testTooLargeRecordWithAckOne PASSED
kafka.api.ProducerFailureHandlingTest > testWrongBrokerList PASSED
kafka.api.ProducerFailureHandlingTest > testNotEnoughReplicas PASSED
kafka.api.ProducerFailureHandlingTest > testNonExistentTopic PASSED
kafka.api.ProducerFailureHandlingTest > testInvalidPartition PASSED
kafka.api.ProducerFailureHandlingTest > testSendAfterClosed PASSED
kafka.api.ProducerFailureHandlingTest > testTooLargeRecordWithAckZero PASSED
kafka.api.ProducerFailureHandlingTest > testNotEnoughReplicasAfterBrokerShutdown PASSED
kafka.api.SaslPlaintextConsumerTest > testPauseStateNotPreservedByRebalance PASSED
kafka.api.SaslPlaintextConsumerTest > testUnsubscribeTopic PASSED
kafka.api.SaslPlaintextConsumerTest > testListTopics PASSED
kafka.api.SaslPlaintextConsumerTest > testAutoCommitOnRebalance PASSED
kafka.api.SaslPlaintextConsumerTest > testSimpleConsumption PASSED
kafka.api.SaslPlaintextConsumerTest > testPartitionReassignmentCallback PASSED
kafka.api.SaslPlaintextConsumerTest > testCommitSpecifiedOffsets PASSED
kafka.api.SslConsumerTest > testPauseStateNotPreservedByRebalance PASSED
kafka.api.SslConsumerTest > testUnsubscribeTopic PASSED
kafka.api.SslConsumerTest > testListTopics PASSED
kafka.api.SslConsumerTest > testAutoCommitOnRebalance PASSED
kafka.api.SslConsumerTest > testSimpleConsumption PASSED
kafka.api.SslConsumerTest > testPartitionReassignmentCallback PASSED
kafka.api.SslConsumerTest > testCommitSpecifiedOffsets PASSED
kafka.api.ConsumerBounceTest > testSeekAndCommitWithBrokerFailures PASSED
kafka.api.ConsumerBounceTest > testConsumptionWithBrokerFailures PASSED
kafka.api.AuthorizerIntegrationTest > testCommitWithTopicWrite PASSED
kafka.api.AuthorizerIntegrationTest > testConsumeWithNoTopicAccess PASSED
kafka.api.AuthorizerIntegrationTest > testCreatePermissionNeededToReadFromNonExistentTopic PASSED
kafka.api.AuthorizerIntegrationTest > testOffsetFetchWithNoAccess PASSED
kafka.api.AuthorizerIntegrationTest > testListOfsetsWithTopicDescribe PASSED
kafka.api.AuthorizerIntegrationTest > testProduceWithTopicRead PASSED
kafka.api.AuthorizerIntegrationTest > testListOffsetsWithNoTopicAccess PASSED
kafka.api.AuthorizerIntegrationTest > testCreatePermissionNeededForWritingToNonExistentTopic PASSED
kafka.api.AuthorizerIntegrationTest > testConsumeWithNoGroupAccess PASSED
kafka.api.AuthorizerIntegrationTest > testConsumeWithTopicDescribe PASSED
kafka.api.AuthorizerIntegrationTest > testOffsetFetchWithNoTopicAccess PASSED
kafka.api.AuthorizerIntegrationTest > testCommitWithNoTopicAccess PASSED
kafka.api.AuthorizerIntegrationTest > testProduceWithNoTopicAccess PASSED
kafka.api.AuthorizerIntegrationTest > testProduceWithTopicWrite PASSED
kafka.api.AuthorizerIntegrationTest > testAuthorization PASSED
kafka.api.AuthorizerIntegrationTest > testConsumeWithTopicAndGroupRead PASSED
kafka.api.AuthorizerIntegrationTest > testConsumeWithTopicWrite PASSED
kafka.api.AuthorizerIntegrationTest > testOffsetFetchWithNoGroupAccess PASSED
kafka.api.AuthorizerIntegrationTest > testCommitWithNoAccess PASSED
kafka.api.AuthorizerIntegrationTest > testCommitWithNoGroupAccess PASSED
kafka.api.AuthorizerIntegrationTest > testConsumeWithNoAccess PASSED
kafka.api.AuthorizerIntegrationTest > testOffsetFetchWithTopicAndGroupRead PASSED
kafka.api.AuthorizerIntegrationTest > testCommitWithTopicDescribe PASSED
kafka.api.AuthorizerIntegrationTest > testProduceWithTopicDescribe PASSED
kafka.api.AuthorizerIntegrationTest > testOffsetFetchTopicDescribe PASSED
kafka.api.AuthorizerIntegrationTest > testCommitWithTopicAndGroupRead PASSED
kafka.api.RequestResponseSerializationTest > testSerializationAndDeserialization PASSED
kafka.api.RequestResponseSerializationTest > testFetchResponseVersion PASSED
kafka.api.RequestResponseSerializationTest > testProduceResponseVersion PASSED
kafka.api.SaslSslConsumerTest > testPauseStateNotPreservedByRebalance PASSED
kafka.api.SaslSslConsumerTest > testUnsubscribeTopic PASSED
kafka.api.SaslSslConsumerTest > testListTopics PASSED
kafka.api.SaslSslConsumerTest > testAutoCommitOnRebalance PASSED
kafka.api.SaslSslConsumerTest > testSimpleConsumption PASSED
kafka.api.SaslSslConsumerTest > testPartitionReassignmentCallback PASSED
kafka.api.SaslSslConsumerTest > testCommitSpecifiedOffsets PASSED
kafka.api.test.ProducerCompressionTest > testCompression[0] PASSED
kafka.api.test.ProducerCompressionTest > testCompression[1] PASSED
kafka.api.test.ProducerCompressionTest > testCompression[2] PASSED
kafka.api.test.ProducerCompressionTest > testCompression[3] PASSED
kafka.controller.ControllerFailoverTest > testMetadataUpdate PASSED
kafka.tools.ConsoleProducerTest > testParseKeyProp PASSED
kafka.tools.ConsoleProducerTest > testValidConfigsOldProducer PASSED
kafka.tools.ConsoleProducerTest > testInvalidConfigs PASSED
kafka.tools.ConsoleProducerTest > testValidConfigsNewProducer PASSED
unit.kafka.admin.AclCommandTest > testAclCli PASSED
unit.kafka.admin.AclCommandTest > testProducerConsumerCli PASSED
unit.kafka.security.auth.OperationTest > testFromString PASSED
unit.kafka.security.auth.AclTest > testAclJsonConversion PASSED
unit.kafka.security.auth.ResourceTypeTest > testFromString PASSED
unit.kafka.security.auth.PermissionTypeTest > testFromString PASSED
unit.kafka.tools.ConsoleConsumerTest > shouldLimitReadsToMaxMessageLimit PASSED
unit.kafka.tools.ConsoleConsumerTest > shouldParseValidNewConsumerValidConfig PASSED
unit.kafka.tools.ConsoleConsumerTest > shouldParseConfigsFromFile PASSED
unit.kafka.tools.ConsoleConsumerTest > shouldParseValidOldConsumerValidConfig PASSED
integration.kafka.api.AdminClientTest > testDescribeGroup PASSED
integration.kafka.api.AdminClientTest > testDescribeConsumerGroup PASSED
integration.kafka.api.AdminClientTest > testListGroups PASSED
integration.kafka.api.AdminClientTest > testDescribeConsumerGroupForNonExistentGroup PASSED
647 tests completed, 1 failed
:kafka-trunk-jdk7:core:test FAILED
:test_core_2_10 FAILED
FAILURE: Build failed with an exception.
* What went wrong:
Execution failed for task ':core:test'.
> There were failing tests. See the report at: file://<https://builds.apache.org/job/kafka-trunk-jdk7/ws/core/build/reports/tests/index.html>
* Try:
Run with --stacktrace option to get the stack trace. Run with --info or --debug option to get more log output.
BUILD FAILED
Total time: 46 mins 53.989 secs
Build step 'Execute shell' marked build as failure
Recording test results
Setting GRADLE_2_4_RC_2_HOME=/home/jenkins/jenkins-slave/tools/hudson.plugins.gradle.GradleInstallation/Gradle_2.4-rc-2
Setting JDK_1_7U51_HOME=/home/jenkins/jenkins-slave/tools/hudson.model.JDK/jdk-1.7u51
Setting GRADLE_2_4_RC_2_HOME=/home/jenkins/jenkins-slave/tools/hudson.plugins.gradle.GradleInstallation/Gradle_2.4-rc-2
Setting JDK_1_7U51_HOME=/home/jenkins/jenkins-slave/tools/hudson.model.JDK/jdk-1.7u51