You are viewing a plain text version of this content. The canonical link for it is here.
Posted to builds@beam.apache.org by Apache Jenkins Server <je...@builds.apache.org> on 2021/11/02 06:30:39 UTC
Build failed in Jenkins: beam_PostCommit_Java_PVR_Spark2_Streaming
#797
See <https://ci-beam.apache.org/job/beam_PostCommit_Java_PVR_Spark2_Streaming/797/display/redirect?page=changes>
Changes:
[aydar.zaynutdinov] [BEAM-13145][Playground]
[avilovpavel6] Added cleanup os env before and after tests
[noreply] Merge pull request #15840 from [Playground][BEAM-13146][Bugfix]
------------------------------------------
[...truncated 2.11 KB...]
SETUPTOOLS_USE_DISTUTILS=stdlib
[EnvInject] - Variables injected successfully.
[Gradle] - Launching build.
[src] $ <https://ci-beam.apache.org/job/beam_PostCommit_Java_PVR_Spark2_Streaming/ws/src/gradlew> --continue --max-workers=12 -Dorg.gradle.jvmargs=-Xms2g -Dorg.gradle.jvmargs=-Xmx4g -Dorg.gradle.vfs.watch=false -Pdocker-pull-licenses :runners:spark:2:job-server:validatesPortableRunnerStreaming
Starting a Gradle Daemon, 1 busy Daemon could not be reused, use --status for details
> Task :buildSrc:compileJava NO-SOURCE
> Task :buildSrc:compileGroovy FROM-CACHE
> Task :buildSrc:pluginDescriptors
> Task :buildSrc:processResources
> Task :buildSrc:classes
> Task :buildSrc:jar
> Task :buildSrc:assemble
> Task :buildSrc:spotlessGroovy FROM-CACHE
> Task :buildSrc:spotlessGroovyCheck UP-TO-DATE
> Task :buildSrc:spotlessGroovyGradle FROM-CACHE
> Task :buildSrc:spotlessGroovyGradleCheck UP-TO-DATE
> Task :buildSrc:spotlessCheck UP-TO-DATE
> Task :buildSrc:pluginUnderTestMetadata
> Task :buildSrc:compileTestJava NO-SOURCE
> Task :buildSrc:compileTestGroovy NO-SOURCE
> Task :buildSrc:processTestResources NO-SOURCE
> Task :buildSrc:testClasses UP-TO-DATE
> Task :buildSrc:test NO-SOURCE
> Task :buildSrc:validatePlugins FROM-CACHE
> Task :buildSrc:check UP-TO-DATE
> Task :buildSrc:build
Configuration on demand is an incubating feature.
> Task :model:job-management:createCheckerFrameworkManifest
> Task :model:fn-execution:createCheckerFrameworkManifest
> Task :sdks:java:fn-execution:createCheckerFrameworkManifest
> Task :sdks:java:core:createCheckerFrameworkManifest
> Task :sdks:java:harness:createCheckerFrameworkManifest
> Task :runners:java-fn-execution:createCheckerFrameworkManifest
> Task :runners:java-job-service:createCheckerFrameworkManifest
> Task :runners:core-java:createCheckerFrameworkManifest
> Task :sdks:java:extensions:google-cloud-platform-core:createCheckerFrameworkManifest
> Task :runners:core-construction-java:createCheckerFrameworkManifest
> Task :model:pipeline:createCheckerFrameworkManifest
> Task :sdks:java:expansion-service:createCheckerFrameworkManifest
> Task :runners:core-java:processResources NO-SOURCE
> Task :sdks:java:core:generateAvroProtocol NO-SOURCE
> Task :sdks:java:fn-execution:processResources NO-SOURCE
> Task :sdks:java:core:generateAvroJava NO-SOURCE
> Task :sdks:java:extensions:google-cloud-platform-core:processResources NO-SOURCE
> Task :sdks:java:expansion-service:processResources NO-SOURCE
> Task :sdks:java:harness:processResources NO-SOURCE
> Task :runners:core-java:processTestResources NO-SOURCE
> Task :runners:java-fn-execution:processResources NO-SOURCE
> Task :runners:java-job-service:processResources NO-SOURCE
> Task :runners:core-construction-java:processResources NO-SOURCE
> Task :runners:spark:2:copyResourcesOverrides NO-SOURCE
> Task :runners:portability:java:createCheckerFrameworkManifest
> Task :model:fn-execution:extractProto
> Task :runners:core-construction-java:processTestResources NO-SOURCE
> Task :runners:portability:java:processResources NO-SOURCE
> Task :model:job-management:extractProto
> Task :runners:portability:java:processTestResources NO-SOURCE
> Task :sdks:java:io:kafka:createCheckerFrameworkManifest
> Task :sdks:java:io:kafka:processResources NO-SOURCE
> Task :model:fn-execution:processResources
> Task :model:job-management:processResources
> Task :sdks:java:core:generateGrammarSource FROM-CACHE
> Task :runners:spark:2:copySourceOverrides
> Task :runners:spark:2:copyTestResourcesOverrides NO-SOURCE
> Task :runners:spark:2:createCheckerFrameworkManifest
> Task :runners:spark:2:processResources
> Task :runners:spark:2:copyTestSourceOverrides NO-SOURCE
> Task :runners:spark:2:processTestResources
> Task :sdks:java:core:processResources
> Task :sdks:java:core:generateTestAvroProtocol NO-SOURCE
> Task :sdks:java:core:generateTestAvroJava
> Task :sdks:java:core:generateTestGrammarSource NO-SOURCE
> Task :sdks:java:core:processTestResources
> Task :model:pipeline:extractIncludeProto
> Task :model:pipeline:extractProto
> Task :model:pipeline:generateProto FROM-CACHE
> Task :model:pipeline:compileJava FROM-CACHE
> Task :model:pipeline:processResources
> Task :model:pipeline:classes
> Task :model:pipeline:jar
> Task :model:pipeline:shadowJar FROM-CACHE
> Task :model:job-management:extractIncludeProto
> Task :model:fn-execution:extractIncludeProto
> Task :model:job-management:generateProto FROM-CACHE
> Task :model:fn-execution:generateProto FROM-CACHE
> Task :model:job-management:compileJava FROM-CACHE
> Task :model:job-management:classes
> Task :model:fn-execution:compileJava FROM-CACHE
> Task :model:fn-execution:classes
> Task :model:job-management:shadowJar FROM-CACHE
> Task :model:fn-execution:shadowJar FROM-CACHE
> Task :sdks:java:core:compileJava FROM-CACHE
> Task :sdks:java:core:classes
> Task :sdks:java:core:shadowJar FROM-CACHE
> Task :sdks:java:core:jar
> Task :sdks:java:fn-execution:compileJava FROM-CACHE
> Task :sdks:java:fn-execution:classes UP-TO-DATE
> Task :sdks:java:fn-execution:jar
> Task :runners:core-construction-java:compileJava FROM-CACHE
> Task :runners:core-construction-java:classes UP-TO-DATE
> Task :runners:core-construction-java:jar
> Task :runners:core-java:compileJava FROM-CACHE
> Task :runners:core-java:classes UP-TO-DATE
> Task :runners:core-java:jar
> Task :sdks:java:core:compileTestJava FROM-CACHE
> Task :sdks:java:core:testClasses
> Task :sdks:java:extensions:google-cloud-platform-core:compileJava FROM-CACHE
> Task :sdks:java:extensions:google-cloud-platform-core:classes UP-TO-DATE
> Task :sdks:java:extensions:google-cloud-platform-core:jar
> Task :sdks:java:core:shadowTestJar FROM-CACHE
> Task :sdks:java:harness:compileJava FROM-CACHE
> Task :sdks:java:harness:classes UP-TO-DATE
> Task :sdks:java:harness:jar
> Task :runners:core-java:compileTestJava FROM-CACHE
> Task :runners:core-java:testClasses UP-TO-DATE
> Task :runners:core-construction-java:compileTestJava FROM-CACHE
> Task :runners:core-construction-java:testClasses UP-TO-DATE
> Task :runners:core-java:testJar
> Task :runners:core-construction-java:testJar
> Task :sdks:java:harness:shadowJar FROM-CACHE
> Task :runners:java-fn-execution:compileJava FROM-CACHE
> Task :runners:java-fn-execution:classes UP-TO-DATE
> Task :runners:java-fn-execution:jar
> Task :sdks:java:expansion-service:compileJava FROM-CACHE
> Task :sdks:java:expansion-service:classes UP-TO-DATE
> Task :sdks:java:expansion-service:jar
> Task :runners:java-job-service:compileJava FROM-CACHE
> Task :runners:java-job-service:classes UP-TO-DATE
> Task :runners:java-job-service:jar
> Task :sdks:java:io:kafka:compileJava FROM-CACHE
> Task :sdks:java:io:kafka:classes UP-TO-DATE
> Task :runners:portability:java:compileJava FROM-CACHE
> Task :runners:portability:java:classes UP-TO-DATE
> Task :sdks:java:io:kafka:jar
> Task :runners:portability:java:jar
> Task :runners:portability:java:compileTestJava FROM-CACHE
> Task :runners:portability:java:testClasses UP-TO-DATE
> Task :runners:portability:java:testJar
> Task :runners:spark:2:compileJava FROM-CACHE
> Task :runners:spark:2:classes
> Task :runners:spark:2:jar
> Task :runners:spark:2:compileTestJava FROM-CACHE
> Task :runners:spark:2:testClasses
> Task :runners:spark:2:testJar
> Task :runners:spark:2:job-server:validatesPortableRunnerStreaming
org.apache.beam.sdk.schemas.AvroSchemaTest > testAvroPipelineGroupBy FAILED
java.lang.AssertionError at AvroSchemaTest.java:497
org.apache.beam.sdk.transforms.CombineFnsTest > testComposedCombineNullValues FAILED
java.lang.AssertionError at CombineFnsTest.java:251
org.apache.beam.sdk.PipelineTest > testTupleInjectionTransform FAILED
java.lang.AssertionError at PipelineTest.java:368
org.apache.beam.sdk.testing.PAssertTest > testIsEqualTo FAILED
java.lang.AssertionError at PAssertTest.java:315
org.apache.beam.sdk.transforms.CombineTest$BasicTests > testBinaryCombinePerKeyInstanceMethodReference FAILED
java.lang.AssertionError at CombineTest.java:948
org.apache.beam.sdk.transforms.KvSwapTest > testKvSwap FAILED
java.lang.AssertionError at KvSwapTest.java:80
org.apache.beam.sdk.testing.PAssertTest > testEmpty FAILED
java.lang.AssertionError at PAssertTest.java:471
org.apache.beam.sdk.PipelineTest > testIdentityTransform FAILED
java.lang.AssertionError at PipelineTest.java:318
org.apache.beam.sdk.testing.PAssertTest > testPAssertThatListSatisfiesOneMatcher FAILED
java.lang.AssertionError at PAssertTest.java:665
org.apache.beam.sdk.transforms.ReshuffleTest > testAssignShardFn FAILED
java.lang.AssertionError at ReshuffleTest.java:302
org.apache.beam.sdk.transforms.CombineTest$BasicTests > testCombinePerKeyInstanceMethodReference FAILED
java.lang.AssertionError at CombineTest.java:934
org.apache.beam.sdk.PipelineTest > testTupleProjectionTransform FAILED
java.lang.AssertionError at PipelineTest.java:340
org.apache.beam.sdk.transforms.ReshuffleTest > testReshuffleAfterFixedWindows FAILED
java.lang.AssertionError at ReshuffleTest.java:235
org.apache.beam.sdk.testing.PAssertTest > testPAssertThatFlattened FAILED
java.lang.RuntimeException at PAssertTest.java:626
org.apache.beam.sdk.values.PCollectionTupleTest > testComposePCollectionTuple FAILED
java.lang.AssertionError at PCollectionTupleTest.java:106
org.apache.beam.sdk.testing.PAssertTest > testPAssertThatListSatisfiesMultipleMatchers FAILED
java.lang.AssertionError at PAssertTest.java:720
org.apache.beam.sdk.transforms.join.CoGroupByKeyTest > testCoGroupByKeyHandleResults FAILED
java.lang.AssertionError at CoGroupByKeyTest.java:466
org.apache.beam.sdk.transforms.ReshuffleTest > testReshufflePreservesTimestamps FAILED
java.lang.AssertionError at ReshuffleTest.java:152
org.apache.beam.sdk.transforms.CombineTest$BasicTests > testHotKeyCombiningWithAccumulationMode FAILED
java.lang.AssertionError at CombineTest.java:760
org.apache.beam.sdk.transforms.KeysTest > testKeysEmpty FAILED
java.lang.AssertionError at KeysTest.java:79
org.apache.beam.sdk.transforms.ParDoTest$TimestampTests > testParDoTaggedOutputWithTimestamp FAILED
java.lang.AssertionError at ParDoTest.java:1846
org.apache.beam.sdk.testing.PAssertTest > testNotEqualTo FAILED
java.lang.AssertionError at PAssertTest.java:362
org.apache.beam.sdk.transforms.ParDoTest$BasicTests > testParDoInCustomTransform FAILED
java.lang.AssertionError at ParDoTest.java:445
org.apache.beam.sdk.metrics.MetricsTest$AttemptedMetricTests > testAttemptedCounterMetrics FAILED
java.lang.AssertionError at MetricsTest.java:371
org.apache.beam.sdk.transforms.FlattenTest > testFlattenIterablesEmpty FAILED
java.lang.AssertionError at FlattenTest.java:317
112 tests completed, 25 failed, 1 skipped
> Task :runners:spark:2:job-server:validatesPortableRunnerStreaming FAILED
FAILURE: Build failed with an exception.
* What went wrong:
Execution failed for task ':runners:spark:2:job-server:validatesPortableRunnerStreaming'.
> There were failing tests. See the report at: file://<https://ci-beam.apache.org/job/beam_PostCommit_Java_PVR_Spark2_Streaming/ws/src/runners/spark/2/job-server/build/reports/tests/validatesPortableRunnerStreaming/index.html>
* Try:
Run with --stacktrace option to get the stack trace. Run with --info or --debug option to get more log output. Run with --scan to get full insights.
* Get more help at https://help.gradle.org
Deprecated Gradle features were used in this build, making it incompatible with Gradle 7.0.
Use '--warning-mode all' to show the individual deprecation warnings.
See https://docs.gradle.org/6.9.1/userguide/command_line_interface.html#sec:command_line_warnings
BUILD FAILED in 30m 6s
78 actionable tasks: 48 executed, 30 from cache
Publishing build scan...
https://gradle.com/s/axr7zk3y244nm
Build step 'Invoke Gradle script' changed build result to FAILURE
Build step 'Invoke Gradle script' marked build as failure
---------------------------------------------------------------------
To unsubscribe, e-mail: builds-unsubscribe@beam.apache.org
For additional commands, e-mail: builds-help@beam.apache.org
Jenkins build is back to normal :
beam_PostCommit_Java_PVR_Spark2_Streaming #803
Posted by Apache Jenkins Server <je...@builds.apache.org>.
See <https://ci-beam.apache.org/job/beam_PostCommit_Java_PVR_Spark2_Streaming/803/display/redirect?page=changes>
---------------------------------------------------------------------
To unsubscribe, e-mail: builds-unsubscribe@beam.apache.org
For additional commands, e-mail: builds-help@beam.apache.org
Build failed in Jenkins: beam_PostCommit_Java_PVR_Spark2_Streaming
#802
Posted by Apache Jenkins Server <je...@builds.apache.org>.
See <https://ci-beam.apache.org/job/beam_PostCommit_Java_PVR_Spark2_Streaming/802/display/redirect>
Changes:
------------------------------------------
Started by timer
Running as SYSTEM
[EnvInject] - Loading node environment variables.
Building remotely on apache-beam-jenkins-9 (beam) in workspace <https://ci-beam.apache.org/job/beam_PostCommit_Java_PVR_Spark2_Streaming/ws/>
The recommended git tool is: NONE
No credentials specified
Wiping out workspace first.
Cloning the remote Git repository
Cloning repository https://github.com/apache/beam.git
> git init <https://ci-beam.apache.org/job/beam_PostCommit_Java_PVR_Spark2_Streaming/ws/src> # timeout=10
Fetching upstream changes from https://github.com/apache/beam.git
> git --version # timeout=10
> git --version # 'git version 2.7.4'
> git fetch --tags --progress https://github.com/apache/beam.git +refs/heads/*:refs/remotes/origin/* # timeout=10
> git config remote.origin.url https://github.com/apache/beam.git # timeout=10
> git config --add remote.origin.fetch +refs/heads/*:refs/remotes/origin/* # timeout=10
> git config remote.origin.url https://github.com/apache/beam.git # timeout=10
Fetching upstream changes from https://github.com/apache/beam.git
> git fetch --tags --progress https://github.com/apache/beam.git +refs/heads/*:refs/remotes/origin/* +refs/pull/${ghprbPullId}/*:refs/remotes/origin/pr/${ghprbPullId}/* # timeout=10
> git rev-parse origin/master^{commit} # timeout=10
Checking out Revision 92ba229336aa9cc4132f498d7049ecf67bc1c3b3 (origin/master)
> git config core.sparsecheckout # timeout=10
> git checkout -f 92ba229336aa9cc4132f498d7049ecf67bc1c3b3 # timeout=10
Commit message: "[BEAM-12730] Handle corner case for TextIO with custom delimiter #15864"
> git rev-list --no-walk 92ba229336aa9cc4132f498d7049ecf67bc1c3b3 # timeout=10
No emails were triggered.
[EnvInject] - Executing scripts and injecting environment variables after the SCM step.
[EnvInject] - Injecting as environment variables the properties content
SPARK_LOCAL_IP=127.0.0.1
SETUPTOOLS_USE_DISTUTILS=stdlib
[EnvInject] - Variables injected successfully.
[Gradle] - Launching build.
[src] $ <https://ci-beam.apache.org/job/beam_PostCommit_Java_PVR_Spark2_Streaming/ws/src/gradlew> --continue --max-workers=12 -Dorg.gradle.jvmargs=-Xms2g -Dorg.gradle.jvmargs=-Xmx4g -Dorg.gradle.vfs.watch=false -Pdocker-pull-licenses :runners:spark:2:job-server:validatesPortableRunnerStreaming
Starting a Gradle Daemon, 1 busy Daemon could not be reused, use --status for details
> Task :buildSrc:compileJava NO-SOURCE
> Task :buildSrc:compileGroovy FROM-CACHE
> Task :buildSrc:pluginDescriptors
> Task :buildSrc:processResources
> Task :buildSrc:classes
> Task :buildSrc:jar
> Task :buildSrc:assemble
> Task :buildSrc:spotlessGroovy FROM-CACHE
> Task :buildSrc:spotlessGroovyCheck UP-TO-DATE
> Task :buildSrc:spotlessGroovyGradle FROM-CACHE
> Task :buildSrc:spotlessGroovyGradleCheck UP-TO-DATE
> Task :buildSrc:spotlessCheck UP-TO-DATE
> Task :buildSrc:pluginUnderTestMetadata
> Task :buildSrc:compileTestJava NO-SOURCE
> Task :buildSrc:compileTestGroovy NO-SOURCE
> Task :buildSrc:processTestResources NO-SOURCE
> Task :buildSrc:testClasses UP-TO-DATE
> Task :buildSrc:test NO-SOURCE
> Task :buildSrc:validatePlugins FROM-CACHE
> Task :buildSrc:check UP-TO-DATE
> Task :buildSrc:build
Configuration on demand is an incubating feature.
> Task :runners:java-fn-execution:createCheckerFrameworkManifest
> Task :runners:core-java:createCheckerFrameworkManifest
> Task :sdks:java:expansion-service:createCheckerFrameworkManifest
> Task :runners:core-construction-java:createCheckerFrameworkManifest
> Task :sdks:java:core:createCheckerFrameworkManifest
> Task :model:pipeline:createCheckerFrameworkManifest
> Task :model:fn-execution:createCheckerFrameworkManifest
> Task :sdks:java:harness:createCheckerFrameworkManifest
> Task :sdks:java:extensions:google-cloud-platform-core:createCheckerFrameworkManifest
> Task :sdks:java:fn-execution:createCheckerFrameworkManifest
> Task :model:job-management:createCheckerFrameworkManifest
> Task :runners:java-job-service:createCheckerFrameworkManifest
> Task :sdks:java:core:generateAvroProtocol NO-SOURCE
> Task :runners:core-construction-java:processResources NO-SOURCE
> Task :sdks:java:fn-execution:processResources NO-SOURCE
> Task :sdks:java:harness:processResources NO-SOURCE
> Task :runners:java-job-service:processResources NO-SOURCE
> Task :sdks:java:expansion-service:processResources NO-SOURCE
> Task :sdks:java:core:generateAvroJava NO-SOURCE
> Task :sdks:java:extensions:google-cloud-platform-core:processResources NO-SOURCE
> Task :runners:core-construction-java:processTestResources NO-SOURCE
> Task :runners:java-fn-execution:processResources NO-SOURCE
> Task :runners:core-java:processResources NO-SOURCE
> Task :model:fn-execution:extractProto
> Task :runners:core-java:processTestResources NO-SOURCE
> Task :model:job-management:extractProto
> Task :runners:spark:2:copyResourcesOverrides NO-SOURCE
> Task :runners:portability:java:createCheckerFrameworkManifest
> Task :runners:portability:java:processResources NO-SOURCE
> Task :runners:portability:java:processTestResources NO-SOURCE
> Task :sdks:java:io:kafka:createCheckerFrameworkManifest
> Task :sdks:java:io:kafka:processResources NO-SOURCE
> Task :model:job-management:processResources
> Task :model:fn-execution:processResources
> Task :runners:spark:2:copySourceOverrides
> Task :runners:spark:2:copyTestResourcesOverrides NO-SOURCE
> Task :runners:spark:2:createCheckerFrameworkManifest
> Task :runners:spark:2:processResources
> Task :runners:spark:2:copyTestSourceOverrides NO-SOURCE
> Task :runners:spark:2:processTestResources
> Task :sdks:java:core:generateGrammarSource FROM-CACHE
> Task :sdks:java:core:processResources
> Task :sdks:java:core:generateTestAvroProtocol NO-SOURCE
> Task :sdks:java:core:generateTestAvroJava
> Task :sdks:java:core:generateTestGrammarSource NO-SOURCE
> Task :sdks:java:core:processTestResources
> Task :model:pipeline:extractIncludeProto
> Task :model:pipeline:extractProto
> Task :model:pipeline:generateProto FROM-CACHE
> Task :model:pipeline:compileJava FROM-CACHE
> Task :model:pipeline:processResources
> Task :model:pipeline:classes
> Task :model:pipeline:jar
> Task :model:pipeline:shadowJar FROM-CACHE
> Task :model:job-management:extractIncludeProto
> Task :model:fn-execution:extractIncludeProto
> Task :model:job-management:generateProto FROM-CACHE
> Task :model:fn-execution:generateProto FROM-CACHE
> Task :model:job-management:compileJava FROM-CACHE
> Task :model:job-management:classes
> Task :model:fn-execution:compileJava FROM-CACHE
> Task :model:fn-execution:classes
> Task :model:job-management:shadowJar FROM-CACHE
> Task :model:fn-execution:shadowJar FROM-CACHE
> Task :sdks:java:core:compileJava FROM-CACHE
> Task :sdks:java:core:classes
> Task :sdks:java:core:shadowJar FROM-CACHE
> Task :sdks:java:core:jar
> Task :sdks:java:fn-execution:compileJava FROM-CACHE
> Task :sdks:java:fn-execution:classes UP-TO-DATE
> Task :sdks:java:fn-execution:jar
> Task :runners:core-construction-java:compileJava FROM-CACHE
> Task :runners:core-construction-java:classes UP-TO-DATE
> Task :runners:core-construction-java:jar
> Task :runners:core-java:compileJava FROM-CACHE
> Task :runners:core-java:classes UP-TO-DATE
> Task :runners:core-java:jar
> Task :sdks:java:core:compileTestJava FROM-CACHE
> Task :sdks:java:core:testClasses
> Task :sdks:java:extensions:google-cloud-platform-core:compileJava FROM-CACHE
> Task :sdks:java:extensions:google-cloud-platform-core:classes UP-TO-DATE
> Task :sdks:java:extensions:google-cloud-platform-core:jar
> Task :sdks:java:core:shadowTestJar FROM-CACHE
> Task :sdks:java:harness:compileJava FROM-CACHE
> Task :sdks:java:harness:classes UP-TO-DATE
> Task :sdks:java:harness:jar
> Task :runners:core-java:compileTestJava FROM-CACHE
> Task :runners:core-java:testClasses UP-TO-DATE
> Task :runners:core-construction-java:compileTestJava FROM-CACHE
> Task :runners:core-construction-java:testClasses UP-TO-DATE
> Task :runners:core-java:testJar
> Task :runners:core-construction-java:testJar
> Task :sdks:java:harness:shadowJar FROM-CACHE
> Task :runners:java-fn-execution:compileJava FROM-CACHE
> Task :runners:java-fn-execution:classes UP-TO-DATE
> Task :runners:java-fn-execution:jar
> Task :sdks:java:expansion-service:compileJava FROM-CACHE
> Task :sdks:java:expansion-service:classes UP-TO-DATE
> Task :sdks:java:expansion-service:jar
> Task :runners:java-job-service:compileJava FROM-CACHE
> Task :runners:java-job-service:classes UP-TO-DATE
> Task :sdks:java:io:kafka:compileJava FROM-CACHE
> Task :sdks:java:io:kafka:classes UP-TO-DATE
> Task :runners:java-job-service:jar
> Task :sdks:java:io:kafka:jar
> Task :runners:portability:java:compileJava FROM-CACHE
> Task :runners:portability:java:classes UP-TO-DATE
> Task :runners:portability:java:jar
> Task :runners:portability:java:compileTestJava FROM-CACHE
> Task :runners:portability:java:testClasses UP-TO-DATE
> Task :runners:portability:java:testJar
> Task :runners:spark:2:compileJava FROM-CACHE
> Task :runners:spark:2:classes
> Task :runners:spark:2:jar
> Task :runners:spark:2:compileTestJava
Note: Some input files use or override a deprecated API.
Note: Recompile with -Xlint:deprecation for details.
Note: Some input files use unchecked or unsafe operations.
Note: Recompile with -Xlint:unchecked for details.
> Task :runners:spark:2:testClasses
> Task :runners:spark:2:testJar
> Task :runners:spark:2:job-server:validatesPortableRunnerStreaming
org.apache.beam.sdk.transforms.CombineFnsTest > testComposedCombineNullValues FAILED
java.lang.RuntimeException at CombineFnsTest.java:251
112 tests completed, 1 failed, 1 skipped
> Task :runners:spark:2:job-server:validatesPortableRunnerStreaming FAILED
FAILURE: Build failed with an exception.
* What went wrong:
Execution failed for task ':runners:spark:2:job-server:validatesPortableRunnerStreaming'.
> There were failing tests. See the report at: file://<https://ci-beam.apache.org/job/beam_PostCommit_Java_PVR_Spark2_Streaming/ws/src/runners/spark/2/job-server/build/reports/tests/validatesPortableRunnerStreaming/index.html>
* Try:
Run with --stacktrace option to get the stack trace. Run with --info or --debug option to get more log output. Run with --scan to get full insights.
* Get more help at https://help.gradle.org
Deprecated Gradle features were used in this build, making it incompatible with Gradle 7.0.
Use '--warning-mode all' to show the individual deprecation warnings.
See https://docs.gradle.org/6.9.1/userguide/command_line_interface.html#sec:command_line_warnings
BUILD FAILED in 29m 7s
78 actionable tasks: 49 executed, 29 from cache
Publishing build scan...
https://gradle.com/s/ivp44dwofmyjy
Build step 'Invoke Gradle script' changed build result to FAILURE
Build step 'Invoke Gradle script' marked build as failure
---------------------------------------------------------------------
To unsubscribe, e-mail: builds-unsubscribe@beam.apache.org
For additional commands, e-mail: builds-help@beam.apache.org
Build failed in Jenkins: beam_PostCommit_Java_PVR_Spark2_Streaming
#801
Posted by Apache Jenkins Server <je...@builds.apache.org>.
See <https://ci-beam.apache.org/job/beam_PostCommit_Java_PVR_Spark2_Streaming/801/display/redirect>
Changes:
------------------------------------------
Started by timer
Running as SYSTEM
[EnvInject] - Loading node environment variables.
Building remotely on apache-beam-jenkins-4 (beam) in workspace <https://ci-beam.apache.org/job/beam_PostCommit_Java_PVR_Spark2_Streaming/ws/>
The recommended git tool is: NONE
No credentials specified
Wiping out workspace first.
Cloning the remote Git repository
Cloning repository https://github.com/apache/beam.git
> git init <https://ci-beam.apache.org/job/beam_PostCommit_Java_PVR_Spark2_Streaming/ws/src> # timeout=10
Fetching upstream changes from https://github.com/apache/beam.git
> git --version # timeout=10
> git --version # 'git version 2.7.4'
> git fetch --tags --progress https://github.com/apache/beam.git +refs/heads/*:refs/remotes/origin/* # timeout=10
> git config remote.origin.url https://github.com/apache/beam.git # timeout=10
> git config --add remote.origin.fetch +refs/heads/*:refs/remotes/origin/* # timeout=10
> git config remote.origin.url https://github.com/apache/beam.git # timeout=10
Fetching upstream changes from https://github.com/apache/beam.git
> git fetch --tags --progress https://github.com/apache/beam.git +refs/heads/*:refs/remotes/origin/* +refs/pull/${ghprbPullId}/*:refs/remotes/origin/pr/${ghprbPullId}/* # timeout=10
> git rev-parse origin/master^{commit} # timeout=10
Checking out Revision 92ba229336aa9cc4132f498d7049ecf67bc1c3b3 (origin/master)
> git config core.sparsecheckout # timeout=10
> git checkout -f 92ba229336aa9cc4132f498d7049ecf67bc1c3b3 # timeout=10
Commit message: "[BEAM-12730] Handle corner case for TextIO with custom delimiter #15864"
> git rev-list --no-walk 92ba229336aa9cc4132f498d7049ecf67bc1c3b3 # timeout=10
No emails were triggered.
[EnvInject] - Executing scripts and injecting environment variables after the SCM step.
[EnvInject] - Injecting as environment variables the properties content
SPARK_LOCAL_IP=127.0.0.1
SETUPTOOLS_USE_DISTUTILS=stdlib
[EnvInject] - Variables injected successfully.
[Gradle] - Launching build.
[src] $ <https://ci-beam.apache.org/job/beam_PostCommit_Java_PVR_Spark2_Streaming/ws/src/gradlew> --continue --max-workers=12 -Dorg.gradle.jvmargs=-Xms2g -Dorg.gradle.jvmargs=-Xmx4g -Dorg.gradle.vfs.watch=false -Pdocker-pull-licenses :runners:spark:2:job-server:validatesPortableRunnerStreaming
Starting a Gradle Daemon, 1 busy Daemon could not be reused, use --status for details
> Task :buildSrc:compileJava NO-SOURCE
> Task :buildSrc:compileGroovy FROM-CACHE
> Task :buildSrc:pluginDescriptors
> Task :buildSrc:processResources
> Task :buildSrc:classes
> Task :buildSrc:jar
> Task :buildSrc:assemble
> Task :buildSrc:spotlessGroovy FROM-CACHE
> Task :buildSrc:spotlessGroovyCheck UP-TO-DATE
> Task :buildSrc:spotlessGroovyGradle FROM-CACHE
> Task :buildSrc:spotlessGroovyGradleCheck UP-TO-DATE
> Task :buildSrc:spotlessCheck UP-TO-DATE
> Task :buildSrc:pluginUnderTestMetadata
> Task :buildSrc:compileTestJava NO-SOURCE
> Task :buildSrc:compileTestGroovy NO-SOURCE
> Task :buildSrc:processTestResources NO-SOURCE
> Task :buildSrc:testClasses UP-TO-DATE
> Task :buildSrc:test NO-SOURCE
> Task :buildSrc:validatePlugins FROM-CACHE
> Task :buildSrc:check UP-TO-DATE
> Task :buildSrc:build
Configuration on demand is an incubating feature.
> Task :sdks:java:core:createCheckerFrameworkManifest
> Task :runners:core-java:createCheckerFrameworkManifest
> Task :model:pipeline:createCheckerFrameworkManifest
> Task :runners:java-fn-execution:createCheckerFrameworkManifest
> Task :model:fn-execution:createCheckerFrameworkManifest
> Task :sdks:java:expansion-service:createCheckerFrameworkManifest
> Task :runners:java-job-service:createCheckerFrameworkManifest
> Task :runners:core-java:processResources NO-SOURCE
> Task :sdks:java:harness:createCheckerFrameworkManifest
> Task :sdks:java:fn-execution:createCheckerFrameworkManifest
> Task :sdks:java:core:generateAvroProtocol NO-SOURCE
> Task :model:job-management:createCheckerFrameworkManifest
> Task :runners:core-construction-java:createCheckerFrameworkManifest
> Task :sdks:java:extensions:google-cloud-platform-core:createCheckerFrameworkManifest
> Task :runners:java-fn-execution:processResources NO-SOURCE
> Task :runners:core-java:processTestResources NO-SOURCE
> Task :sdks:java:extensions:google-cloud-platform-core:processResources NO-SOURCE
> Task :sdks:java:expansion-service:processResources NO-SOURCE
> Task :runners:java-job-service:processResources NO-SOURCE
> Task :runners:core-construction-java:processResources NO-SOURCE
> Task :sdks:java:fn-execution:processResources NO-SOURCE
> Task :sdks:java:core:generateAvroJava NO-SOURCE
> Task :sdks:java:harness:processResources NO-SOURCE
> Task :runners:spark:2:copyResourcesOverrides NO-SOURCE
> Task :runners:core-construction-java:processTestResources NO-SOURCE
> Task :runners:portability:java:createCheckerFrameworkManifest
> Task :model:job-management:extractProto
> Task :model:fn-execution:extractProto
> Task :runners:portability:java:processResources NO-SOURCE
> Task :runners:portability:java:processTestResources NO-SOURCE
> Task :sdks:java:io:kafka:createCheckerFrameworkManifest
> Task :sdks:java:io:kafka:processResources NO-SOURCE
> Task :runners:spark:2:copySourceOverrides
> Task :runners:spark:2:copyTestResourcesOverrides NO-SOURCE
> Task :model:job-management:processResources
> Task :model:fn-execution:processResources
> Task :runners:spark:2:createCheckerFrameworkManifest
> Task :runners:spark:2:processResources
> Task :runners:spark:2:copyTestSourceOverrides NO-SOURCE
> Task :runners:spark:2:processTestResources
> Task :sdks:java:core:generateGrammarSource FROM-CACHE
> Task :sdks:java:core:processResources
> Task :sdks:java:core:generateTestAvroProtocol NO-SOURCE
> Task :sdks:java:core:generateTestAvroJava
> Task :sdks:java:core:generateTestGrammarSource NO-SOURCE
> Task :sdks:java:core:processTestResources
> Task :model:pipeline:extractIncludeProto
> Task :model:pipeline:extractProto
> Task :model:pipeline:generateProto FROM-CACHE
> Task :model:pipeline:compileJava FROM-CACHE
> Task :model:pipeline:processResources
> Task :model:pipeline:classes
> Task :model:pipeline:jar
> Task :model:pipeline:shadowJar FROM-CACHE
> Task :model:job-management:extractIncludeProto
> Task :model:fn-execution:extractIncludeProto
> Task :model:job-management:generateProto FROM-CACHE
> Task :model:fn-execution:generateProto FROM-CACHE
> Task :model:job-management:compileJava FROM-CACHE
> Task :model:job-management:classes
> Task :model:fn-execution:compileJava FROM-CACHE
> Task :model:fn-execution:classes
> Task :model:fn-execution:shadowJar FROM-CACHE
> Task :model:job-management:shadowJar FROM-CACHE
> Task :sdks:java:core:compileJava FROM-CACHE
> Task :sdks:java:core:classes
> Task :sdks:java:core:shadowJar FROM-CACHE
> Task :sdks:java:core:jar
> Task :sdks:java:fn-execution:compileJava FROM-CACHE
> Task :sdks:java:fn-execution:classes UP-TO-DATE
> Task :sdks:java:fn-execution:jar
> Task :runners:core-construction-java:compileJava FROM-CACHE
> Task :runners:core-construction-java:classes UP-TO-DATE
> Task :runners:core-construction-java:jar
> Task :sdks:java:core:compileTestJava FROM-CACHE
> Task :sdks:java:core:testClasses
> Task :runners:core-java:compileJava FROM-CACHE
> Task :runners:core-java:classes UP-TO-DATE
> Task :sdks:java:core:shadowTestJar FROM-CACHE
> Task :runners:core-java:jar
> Task :sdks:java:extensions:google-cloud-platform-core:compileJava FROM-CACHE
> Task :sdks:java:extensions:google-cloud-platform-core:classes UP-TO-DATE
> Task :runners:core-java:compileTestJava FROM-CACHE
> Task :runners:core-java:testClasses UP-TO-DATE
> Task :runners:core-construction-java:compileTestJava FROM-CACHE
> Task :runners:core-construction-java:testClasses UP-TO-DATE
> Task :runners:core-java:testJar
> Task :runners:core-construction-java:testJar
> Task :sdks:java:extensions:google-cloud-platform-core:jar
> Task :sdks:java:harness:compileJava FROM-CACHE
> Task :sdks:java:harness:classes UP-TO-DATE
> Task :sdks:java:harness:jar
> Task :sdks:java:harness:shadowJar FROM-CACHE
> Task :runners:java-fn-execution:compileJava FROM-CACHE
> Task :runners:java-fn-execution:classes UP-TO-DATE
> Task :runners:java-fn-execution:jar
> Task :sdks:java:expansion-service:compileJava FROM-CACHE
> Task :sdks:java:expansion-service:classes UP-TO-DATE
> Task :sdks:java:expansion-service:jar
> Task :runners:java-job-service:compileJava FROM-CACHE
> Task :runners:java-job-service:classes UP-TO-DATE
> Task :sdks:java:io:kafka:compileJava FROM-CACHE
> Task :sdks:java:io:kafka:classes UP-TO-DATE
> Task :runners:java-job-service:jar
> Task :sdks:java:io:kafka:jar
> Task :runners:portability:java:compileJava FROM-CACHE
> Task :runners:portability:java:classes UP-TO-DATE
> Task :runners:portability:java:jar
> Task :runners:portability:java:compileTestJava FROM-CACHE
> Task :runners:portability:java:testClasses UP-TO-DATE
> Task :runners:portability:java:testJar
> Task :runners:spark:2:compileJava FROM-CACHE
> Task :runners:spark:2:classes
> Task :runners:spark:2:jar
> Task :runners:spark:2:compileTestJava FROM-CACHE
> Task :runners:spark:2:testClasses
> Task :runners:spark:2:testJar
> Task :runners:spark:2:job-server:validatesPortableRunnerStreaming
org.apache.beam.sdk.PipelineTest > testIdentityTransform FAILED
java.lang.AssertionError at PipelineTest.java:318
org.apache.beam.sdk.testing.PAssertTest > testEmpty FAILED
java.lang.AssertionError at PAssertTest.java:471
org.apache.beam.sdk.transforms.CombineTest$BasicTests > testBinaryCombinePerKeyInstanceMethodReference FAILED
java.lang.AssertionError at CombineTest.java:948
org.apache.beam.sdk.transforms.KvSwapTest > testKvSwap FAILED
java.lang.AssertionError at KvSwapTest.java:80
org.apache.beam.sdk.testing.PAssertTest > testPAssertThatListSatisfiesOneMatcher FAILED
java.lang.RuntimeException at PAssertTest.java:665
org.apache.beam.sdk.transforms.ReshuffleTest > testReshuffleAfterFixedWindows FAILED
java.lang.AssertionError at ReshuffleTest.java:235
org.apache.beam.sdk.transforms.CombineTest$BasicTests > testBinaryCombinePerKeyLambda FAILED
java.lang.AssertionError at CombineTest.java:920
112 tests completed, 7 failed, 1 skipped
> Task :runners:spark:2:job-server:validatesPortableRunnerStreaming FAILED
FAILURE: Build failed with an exception.
* What went wrong:
Execution failed for task ':runners:spark:2:job-server:validatesPortableRunnerStreaming'.
> There were failing tests. See the report at: file://<https://ci-beam.apache.org/job/beam_PostCommit_Java_PVR_Spark2_Streaming/ws/src/runners/spark/2/job-server/build/reports/tests/validatesPortableRunnerStreaming/index.html>
* Try:
Run with --stacktrace option to get the stack trace. Run with --info or --debug option to get more log output. Run with --scan to get full insights.
* Get more help at https://help.gradle.org
Deprecated Gradle features were used in this build, making it incompatible with Gradle 7.0.
Use '--warning-mode all' to show the individual deprecation warnings.
See https://docs.gradle.org/6.9.1/userguide/command_line_interface.html#sec:command_line_warnings
BUILD FAILED in 29m 53s
78 actionable tasks: 48 executed, 30 from cache
Publishing build scan...
https://gradle.com/s/uccnptabroq5q
Build step 'Invoke Gradle script' changed build result to FAILURE
Build step 'Invoke Gradle script' marked build as failure
---------------------------------------------------------------------
To unsubscribe, e-mail: builds-unsubscribe@beam.apache.org
For additional commands, e-mail: builds-help@beam.apache.org
Build failed in Jenkins: beam_PostCommit_Java_PVR_Spark2_Streaming
#800
Posted by Apache Jenkins Server <je...@builds.apache.org>.
See <https://ci-beam.apache.org/job/beam_PostCommit_Java_PVR_Spark2_Streaming/800/display/redirect?page=changes>
Changes:
[Andrew Pilloud] [BEAM-13118] Use branch for nightly "tag", tags are immutable
[dmitrii_kuzin] [BEAM-12730] Python. Custom delimiter add corner case
[noreply] Merge pull request #15832 from [BEAM-13149] Changing readWithPartitions
[noreply] Minor: add resource key to presentation materials link (#15867)
------------------------------------------
[...truncated 1.52 KB...]
Checking out Revision 92ba229336aa9cc4132f498d7049ecf67bc1c3b3 (origin/master)
> git config core.sparsecheckout # timeout=10
> git checkout -f 92ba229336aa9cc4132f498d7049ecf67bc1c3b3 # timeout=10
Commit message: "[BEAM-12730] Handle corner case for TextIO with custom delimiter #15864"
> git rev-list --no-walk 526359b27e61463c5b9b2fa86d9ba23ed5890f3e # timeout=10
No emails were triggered.
[EnvInject] - Executing scripts and injecting environment variables after the SCM step.
[EnvInject] - Injecting as environment variables the properties content
SPARK_LOCAL_IP=127.0.0.1
SETUPTOOLS_USE_DISTUTILS=stdlib
[EnvInject] - Variables injected successfully.
[Gradle] - Launching build.
[src] $ <https://ci-beam.apache.org/job/beam_PostCommit_Java_PVR_Spark2_Streaming/ws/src/gradlew> --continue --max-workers=12 -Dorg.gradle.jvmargs=-Xms2g -Dorg.gradle.jvmargs=-Xmx4g -Dorg.gradle.vfs.watch=false -Pdocker-pull-licenses :runners:spark:2:job-server:validatesPortableRunnerStreaming
Starting a Gradle Daemon, 1 busy and 1 stopped Daemons could not be reused, use --status for details
> Task :buildSrc:compileJava NO-SOURCE
> Task :buildSrc:compileGroovy FROM-CACHE
> Task :buildSrc:pluginDescriptors
> Task :buildSrc:processResources
> Task :buildSrc:classes
> Task :buildSrc:jar
> Task :buildSrc:assemble
> Task :buildSrc:spotlessGroovy FROM-CACHE
> Task :buildSrc:spotlessGroovyCheck UP-TO-DATE
> Task :buildSrc:spotlessGroovyGradle FROM-CACHE
> Task :buildSrc:spotlessGroovyGradleCheck UP-TO-DATE
> Task :buildSrc:spotlessCheck UP-TO-DATE
> Task :buildSrc:pluginUnderTestMetadata
> Task :buildSrc:compileTestJava NO-SOURCE
> Task :buildSrc:compileTestGroovy NO-SOURCE
> Task :buildSrc:processTestResources NO-SOURCE
> Task :buildSrc:testClasses UP-TO-DATE
> Task :buildSrc:test NO-SOURCE
> Task :buildSrc:validatePlugins FROM-CACHE
> Task :buildSrc:check UP-TO-DATE
> Task :buildSrc:build
Configuration on demand is an incubating feature.
> Task :model:fn-execution:createCheckerFrameworkManifest
> Task :runners:core-java:createCheckerFrameworkManifest
> Task :sdks:java:harness:createCheckerFrameworkManifest
> Task :runners:java-fn-execution:createCheckerFrameworkManifest
> Task :runners:java-job-service:createCheckerFrameworkManifest
> Task :runners:core-construction-java:createCheckerFrameworkManifest
> Task :model:job-management:createCheckerFrameworkManifest
> Task :model:pipeline:createCheckerFrameworkManifest
> Task :sdks:java:extensions:google-cloud-platform-core:createCheckerFrameworkManifest
> Task :sdks:java:expansion-service:createCheckerFrameworkManifest
> Task :sdks:java:fn-execution:createCheckerFrameworkManifest
> Task :sdks:java:core:createCheckerFrameworkManifest
> Task :sdks:java:expansion-service:processResources NO-SOURCE
> Task :sdks:java:core:generateAvroProtocol NO-SOURCE
> Task :sdks:java:fn-execution:processResources NO-SOURCE
> Task :runners:java-fn-execution:processResources NO-SOURCE
> Task :runners:java-job-service:processResources NO-SOURCE
> Task :sdks:java:harness:processResources NO-SOURCE
> Task :runners:core-java:processResources NO-SOURCE
> Task :runners:core-construction-java:processResources NO-SOURCE
> Task :sdks:java:extensions:google-cloud-platform-core:processResources NO-SOURCE
> Task :runners:core-java:processTestResources NO-SOURCE
> Task :runners:portability:java:createCheckerFrameworkManifest
> Task :sdks:java:core:generateAvroJava NO-SOURCE
> Task :runners:portability:java:processResources NO-SOURCE
> Task :runners:core-construction-java:processTestResources NO-SOURCE
> Task :runners:spark:2:copyResourcesOverrides NO-SOURCE
> Task :runners:portability:java:processTestResources NO-SOURCE
> Task :model:fn-execution:extractProto
> Task :model:job-management:extractProto
> Task :sdks:java:io:kafka:createCheckerFrameworkManifest
> Task :sdks:java:io:kafka:processResources NO-SOURCE
> Task :model:job-management:processResources
> Task :model:fn-execution:processResources
> Task :runners:spark:2:copySourceOverrides
> Task :runners:spark:2:copyTestResourcesOverrides NO-SOURCE
> Task :sdks:java:core:generateGrammarSource FROM-CACHE
> Task :runners:spark:2:createCheckerFrameworkManifest
> Task :runners:spark:2:processResources
> Task :runners:spark:2:copyTestSourceOverrides NO-SOURCE
> Task :runners:spark:2:processTestResources
> Task :sdks:java:core:processResources
> Task :sdks:java:core:generateTestAvroProtocol NO-SOURCE
> Task :model:pipeline:extractIncludeProto
> Task :model:pipeline:extractProto
> Task :model:pipeline:generateProto FROM-CACHE
> Task :sdks:java:core:generateTestAvroJava
> Task :sdks:java:core:generateTestGrammarSource NO-SOURCE
> Task :sdks:java:core:processTestResources
> Task :model:pipeline:compileJava FROM-CACHE
> Task :model:pipeline:processResources
> Task :model:pipeline:classes
> Task :model:pipeline:jar
> Task :model:pipeline:shadowJar FROM-CACHE
> Task :model:job-management:extractIncludeProto
> Task :model:fn-execution:extractIncludeProto
> Task :model:job-management:generateProto FROM-CACHE
> Task :model:fn-execution:generateProto FROM-CACHE
> Task :model:job-management:compileJava FROM-CACHE
> Task :model:job-management:classes
> Task :model:fn-execution:compileJava FROM-CACHE
> Task :model:fn-execution:classes
> Task :model:job-management:shadowJar FROM-CACHE
> Task :model:fn-execution:shadowJar FROM-CACHE
> Task :sdks:java:core:compileJava FROM-CACHE
> Task :sdks:java:core:classes
> Task :sdks:java:core:shadowJar FROM-CACHE
> Task :sdks:java:core:jar
> Task :sdks:java:fn-execution:compileJava FROM-CACHE
> Task :sdks:java:fn-execution:classes UP-TO-DATE
> Task :sdks:java:fn-execution:jar
> Task :runners:core-construction-java:compileJava FROM-CACHE
> Task :runners:core-construction-java:classes UP-TO-DATE
> Task :runners:core-construction-java:jar
> Task :runners:core-java:compileJava FROM-CACHE
> Task :runners:core-java:classes UP-TO-DATE
> Task :runners:core-java:jar
> Task :sdks:java:extensions:google-cloud-platform-core:compileJava FROM-CACHE
> Task :sdks:java:extensions:google-cloud-platform-core:classes UP-TO-DATE
> Task :sdks:java:extensions:google-cloud-platform-core:jar
> Task :sdks:java:core:compileTestJava FROM-CACHE
> Task :sdks:java:core:testClasses
> Task :sdks:java:harness:compileJava FROM-CACHE
> Task :sdks:java:harness:classes UP-TO-DATE
> Task :sdks:java:core:shadowTestJar FROM-CACHE
> Task :sdks:java:harness:jar
> Task :runners:core-java:compileTestJava FROM-CACHE
> Task :runners:core-java:testClasses UP-TO-DATE
> Task :runners:core-java:testJar
> Task :runners:core-construction-java:compileTestJava FROM-CACHE
> Task :runners:core-construction-java:testClasses UP-TO-DATE
> Task :runners:core-construction-java:testJar
> Task :sdks:java:harness:shadowJar FROM-CACHE
> Task :runners:java-fn-execution:compileJava FROM-CACHE
> Task :runners:java-fn-execution:classes UP-TO-DATE
> Task :runners:java-fn-execution:jar
> Task :sdks:java:expansion-service:compileJava FROM-CACHE
> Task :sdks:java:expansion-service:classes UP-TO-DATE
> Task :sdks:java:expansion-service:jar
> Task :runners:java-job-service:compileJava FROM-CACHE
> Task :runners:java-job-service:classes UP-TO-DATE
> Task :sdks:java:io:kafka:compileJava FROM-CACHE
> Task :sdks:java:io:kafka:classes UP-TO-DATE
> Task :runners:java-job-service:jar
> Task :sdks:java:io:kafka:jar
> Task :runners:portability:java:compileJava FROM-CACHE
> Task :runners:portability:java:classes UP-TO-DATE
> Task :runners:portability:java:jar
> Task :runners:portability:java:compileTestJava FROM-CACHE
> Task :runners:portability:java:testClasses UP-TO-DATE
> Task :runners:portability:java:testJar
> Task :runners:spark:2:compileJava FROM-CACHE
> Task :runners:spark:2:classes
> Task :runners:spark:2:jar
> Task :runners:spark:2:compileTestJava FROM-CACHE
> Task :runners:spark:2:testClasses
> Task :runners:spark:2:testJar
> Task :runners:spark:2:job-server:validatesPortableRunnerStreaming
org.apache.beam.sdk.schemas.AvroSchemaTest > testAvroPipelineGroupBy FAILED
java.lang.AssertionError at AvroSchemaTest.java:497
org.apache.beam.sdk.transforms.CombineFnsTest > testComposedCombineNullValues FAILED
java.lang.AssertionError at CombineFnsTest.java:251
org.apache.beam.sdk.testing.PAssertTest > testIsEqualTo FAILED
java.lang.AssertionError at PAssertTest.java:315
org.apache.beam.sdk.transforms.CombineTest$BasicTests > testBinaryCombinePerKeyInstanceMethodReference FAILED
java.lang.RuntimeException at CombineTest.java:948
org.apache.beam.sdk.transforms.ReshuffleTest > testAssignShardFn FAILED
java.lang.AssertionError at ReshuffleTest.java:302
org.apache.beam.sdk.PipelineTest > testTupleProjectionTransform FAILED
java.lang.AssertionError at PipelineTest.java:340
org.apache.beam.sdk.testing.PAssertTest > testPAssertThatListSatisfiesOneMatcher FAILED
java.lang.AssertionError at PAssertTest.java:665
org.apache.beam.sdk.transforms.CombineTest$BasicTests > testCombinePerKeyLambda FAILED
java.lang.AssertionError at CombineTest.java:906
org.apache.beam.sdk.transforms.ReshuffleTest > testReshuffleAfterFixedWindows FAILED
java.lang.AssertionError at ReshuffleTest.java:235
org.apache.beam.sdk.PipelineTest > testMultipleApply FAILED
java.lang.AssertionError at PipelineTest.java:252
org.apache.beam.sdk.testing.PAssertTest > testPAssertThatFlattened FAILED
java.lang.AssertionError at PAssertTest.java:626
org.apache.beam.sdk.transforms.ReshuffleTest > testReshuffleAfterSlidingWindows FAILED
java.lang.AssertionError at ReshuffleTest.java:255
org.apache.beam.sdk.values.PCollectionTupleTest > testComposePCollectionTuple FAILED
java.lang.AssertionError at PCollectionTupleTest.java:106
org.apache.beam.sdk.testing.PAssertTest > testPAssertThatListSatisfiesMultipleMatchers FAILED
java.lang.AssertionError at PAssertTest.java:720
org.apache.beam.sdk.transforms.join.CoGroupByKeyTest > testCoGroupByKeyHandleResults FAILED
java.lang.RuntimeException at CoGroupByKeyTest.java:466
org.apache.beam.sdk.transforms.ParDoTest$TimestampTests > testParDoTaggedOutputWithTimestamp FAILED
java.lang.AssertionError at ParDoTest.java:1846
org.apache.beam.sdk.transforms.ParDoSchemaTest > testSchemaFieldSelectionUnboxing FAILED
java.lang.AssertionError at ParDoSchemaTest.java:561
org.apache.beam.sdk.metrics.MetricsTest$AttemptedMetricTests > testAttemptedCounterMetrics FAILED
java.lang.AssertionError at MetricsTest.java:371
org.apache.beam.sdk.transforms.FlattenTest > testFlattenIterablesEmpty FAILED
java.lang.AssertionError at FlattenTest.java:317
org.apache.beam.sdk.transforms.ParDoTest$BasicTests > testParDoInCustomTransform FAILED
java.lang.AssertionError at ParDoTest.java:445
org.apache.beam.sdk.transforms.ParDoSchemaTest > testInferredSchemaPipeline FAILED
java.lang.AssertionError at ParDoSchemaTest.java:424
org.apache.beam.sdk.transforms.FlattenTest > testFlattenInputMultipleCopies FAILED
java.lang.AssertionError at FlattenTest.java:167
112 tests completed, 22 failed, 1 skipped
> Task :runners:spark:2:job-server:validatesPortableRunnerStreaming FAILED
FAILURE: Build failed with an exception.
* What went wrong:
Execution failed for task ':runners:spark:2:job-server:validatesPortableRunnerStreaming'.
> There were failing tests. See the report at: file://<https://ci-beam.apache.org/job/beam_PostCommit_Java_PVR_Spark2_Streaming/ws/src/runners/spark/2/job-server/build/reports/tests/validatesPortableRunnerStreaming/index.html>
* Try:
Run with --stacktrace option to get the stack trace. Run with --info or --debug option to get more log output. Run with --scan to get full insights.
* Get more help at https://help.gradle.org
Deprecated Gradle features were used in this build, making it incompatible with Gradle 7.0.
Use '--warning-mode all' to show the individual deprecation warnings.
See https://docs.gradle.org/6.9.1/userguide/command_line_interface.html#sec:command_line_warnings
BUILD FAILED in 28m 32s
78 actionable tasks: 48 executed, 30 from cache
Publishing build scan...
https://gradle.com/s/hz4mq4jmbfltq
Build step 'Invoke Gradle script' changed build result to FAILURE
Build step 'Invoke Gradle script' marked build as failure
---------------------------------------------------------------------
To unsubscribe, e-mail: builds-unsubscribe@beam.apache.org
For additional commands, e-mail: builds-help@beam.apache.org
Build failed in Jenkins: beam_PostCommit_Java_PVR_Spark2_Streaming
#799
Posted by Apache Jenkins Server <je...@builds.apache.org>.
See <https://ci-beam.apache.org/job/beam_PostCommit_Java_PVR_Spark2_Streaming/799/display/redirect?page=changes>
Changes:
[Alexey Romanenko] [BEAM-12070] ParquetIO: use splittable reading by default
[noreply] [BEAM-13001] fixes nil reference error in Extractor.ExtractFrom (#15865)
[noreply] Merge pull request #15842 from [BEAM-13125][Playground] Update
[noreply] Merge pull request #15838 from [BEAM-13127] [Playground] Implement TCP
------------------------------------------
Started by timer
Running as SYSTEM
[EnvInject] - Loading node environment variables.
Building remotely on apache-beam-jenkins-8 (beam) in workspace <https://ci-beam.apache.org/job/beam_PostCommit_Java_PVR_Spark2_Streaming/ws/>
The recommended git tool is: NONE
No credentials specified
Wiping out workspace first.
Cloning the remote Git repository
Cloning repository https://github.com/apache/beam.git
> git init <https://ci-beam.apache.org/job/beam_PostCommit_Java_PVR_Spark2_Streaming/ws/src> # timeout=10
Fetching upstream changes from https://github.com/apache/beam.git
> git --version # timeout=10
> git --version # 'git version 2.7.4'
> git fetch --tags --progress https://github.com/apache/beam.git +refs/heads/*:refs/remotes/origin/* # timeout=10
> git config remote.origin.url https://github.com/apache/beam.git # timeout=10
> git config --add remote.origin.fetch +refs/heads/*:refs/remotes/origin/* # timeout=10
> git config remote.origin.url https://github.com/apache/beam.git # timeout=10
Fetching upstream changes from https://github.com/apache/beam.git
> git fetch --tags --progress https://github.com/apache/beam.git +refs/heads/*:refs/remotes/origin/* +refs/pull/${ghprbPullId}/*:refs/remotes/origin/pr/${ghprbPullId}/* # timeout=10
> git rev-parse origin/master^{commit} # timeout=10
Checking out Revision 526359b27e61463c5b9b2fa86d9ba23ed5890f3e (origin/master)
> git config core.sparsecheckout # timeout=10
> git checkout -f 526359b27e61463c5b9b2fa86d9ba23ed5890f3e # timeout=10
Commit message: "Merge pull request #15838 from [BEAM-13127] [Playground] Implement TCP listener"
> git rev-list --no-walk 59bd9a0fc92fd4b9b8bd611a6a3845dc44fec321 # timeout=10
No emails were triggered.
[EnvInject] - Executing scripts and injecting environment variables after the SCM step.
[EnvInject] - Injecting as environment variables the properties content
SPARK_LOCAL_IP=127.0.0.1
SETUPTOOLS_USE_DISTUTILS=stdlib
[EnvInject] - Variables injected successfully.
[Gradle] - Launching build.
[src] $ <https://ci-beam.apache.org/job/beam_PostCommit_Java_PVR_Spark2_Streaming/ws/src/gradlew> --continue --max-workers=12 -Dorg.gradle.jvmargs=-Xms2g -Dorg.gradle.jvmargs=-Xmx4g -Dorg.gradle.vfs.watch=false -Pdocker-pull-licenses :runners:spark:2:job-server:validatesPortableRunnerStreaming
Starting a Gradle Daemon, 1 busy and 1 stopped Daemons could not be reused, use --status for details
> Task :buildSrc:compileJava NO-SOURCE
> Task :buildSrc:compileGroovy FROM-CACHE
> Task :buildSrc:pluginDescriptors
> Task :buildSrc:processResources
> Task :buildSrc:classes
> Task :buildSrc:jar
> Task :buildSrc:assemble
> Task :buildSrc:spotlessGroovy FROM-CACHE
> Task :buildSrc:spotlessGroovyCheck UP-TO-DATE
> Task :buildSrc:spotlessGroovyGradle FROM-CACHE
> Task :buildSrc:spotlessGroovyGradleCheck UP-TO-DATE
> Task :buildSrc:spotlessCheck UP-TO-DATE
> Task :buildSrc:pluginUnderTestMetadata
> Task :buildSrc:compileTestJava NO-SOURCE
> Task :buildSrc:compileTestGroovy NO-SOURCE
> Task :buildSrc:processTestResources NO-SOURCE
> Task :buildSrc:testClasses UP-TO-DATE
> Task :buildSrc:test NO-SOURCE
> Task :buildSrc:validatePlugins FROM-CACHE
> Task :buildSrc:check UP-TO-DATE
> Task :buildSrc:build
Configuration on demand is an incubating feature.
> Task :model:job-management:createCheckerFrameworkManifest
> Task :sdks:java:expansion-service:createCheckerFrameworkManifest
> Task :sdks:java:extensions:google-cloud-platform-core:createCheckerFrameworkManifest
> Task :runners:core-construction-java:createCheckerFrameworkManifest
> Task :sdks:java:fn-execution:createCheckerFrameworkManifest
> Task :runners:java-fn-execution:createCheckerFrameworkManifest
> Task :model:pipeline:createCheckerFrameworkManifest
> Task :sdks:java:core:createCheckerFrameworkManifest
> Task :sdks:java:harness:createCheckerFrameworkManifest
> Task :runners:core-java:createCheckerFrameworkManifest
> Task :runners:java-job-service:createCheckerFrameworkManifest
> Task :model:fn-execution:createCheckerFrameworkManifest
> Task :sdks:java:harness:processResources NO-SOURCE
> Task :sdks:java:core:generateAvroProtocol NO-SOURCE
> Task :sdks:java:extensions:google-cloud-platform-core:processResources NO-SOURCE
> Task :sdks:java:expansion-service:processResources NO-SOURCE
> Task :runners:portability:java:createCheckerFrameworkManifest
> Task :sdks:java:fn-execution:processResources NO-SOURCE
> Task :runners:java-fn-execution:processResources NO-SOURCE
> Task :model:fn-execution:extractProto
> Task :runners:core-construction-java:processResources NO-SOURCE
> Task :runners:core-java:processResources NO-SOURCE
> Task :runners:java-job-service:processResources NO-SOURCE
> Task :sdks:java:core:generateAvroJava NO-SOURCE
> Task :runners:core-java:processTestResources NO-SOURCE
> Task :runners:spark:2:copyResourcesOverrides NO-SOURCE
> Task :model:job-management:extractProto
> Task :runners:portability:java:processResources NO-SOURCE
> Task :runners:core-construction-java:processTestResources NO-SOURCE
> Task :runners:portability:java:processTestResources NO-SOURCE
> Task :model:job-management:processResources
> Task :sdks:java:io:kafka:createCheckerFrameworkManifest
> Task :sdks:java:io:kafka:processResources NO-SOURCE
> Task :model:fn-execution:processResources
> Task :runners:spark:2:copySourceOverrides
> Task :runners:spark:2:copyTestResourcesOverrides NO-SOURCE
> Task :runners:spark:2:createCheckerFrameworkManifest
> Task :sdks:java:core:generateGrammarSource FROM-CACHE
> Task :runners:spark:2:processResources
> Task :runners:spark:2:copyTestSourceOverrides NO-SOURCE
> Task :runners:spark:2:processTestResources
> Task :sdks:java:core:processResources
> Task :sdks:java:core:generateTestAvroProtocol NO-SOURCE
> Task :sdks:java:core:generateTestAvroJava
> Task :sdks:java:core:generateTestGrammarSource NO-SOURCE
> Task :sdks:java:core:processTestResources
> Task :model:pipeline:extractIncludeProto
> Task :model:pipeline:extractProto
> Task :model:pipeline:generateProto FROM-CACHE
> Task :model:pipeline:compileJava FROM-CACHE
> Task :model:pipeline:processResources
> Task :model:pipeline:classes
> Task :model:pipeline:jar
> Task :model:pipeline:shadowJar FROM-CACHE
> Task :model:job-management:extractIncludeProto
> Task :model:job-management:generateProto FROM-CACHE
> Task :model:fn-execution:extractIncludeProto
> Task :model:fn-execution:generateProto FROM-CACHE
> Task :model:job-management:compileJava FROM-CACHE
> Task :model:job-management:classes
> Task :model:fn-execution:compileJava FROM-CACHE
> Task :model:fn-execution:classes
> Task :model:job-management:shadowJar FROM-CACHE
> Task :model:fn-execution:shadowJar FROM-CACHE
> Task :sdks:java:core:compileJava FROM-CACHE
> Task :sdks:java:core:classes
> Task :sdks:java:core:shadowJar FROM-CACHE
> Task :sdks:java:core:jar
> Task :sdks:java:fn-execution:compileJava FROM-CACHE
> Task :sdks:java:fn-execution:classes UP-TO-DATE
> Task :sdks:java:fn-execution:jar
> Task :runners:core-construction-java:compileJava FROM-CACHE
> Task :runners:core-construction-java:classes UP-TO-DATE
> Task :runners:core-construction-java:jar
> Task :runners:core-java:compileJava FROM-CACHE
> Task :runners:core-java:classes UP-TO-DATE
> Task :runners:core-java:jar
> Task :sdks:java:core:compileTestJava FROM-CACHE
> Task :sdks:java:core:testClasses
> Task :sdks:java:extensions:google-cloud-platform-core:compileJava FROM-CACHE
> Task :sdks:java:extensions:google-cloud-platform-core:classes UP-TO-DATE
> Task :sdks:java:core:shadowTestJar FROM-CACHE
> Task :sdks:java:extensions:google-cloud-platform-core:jar
> Task :runners:core-java:compileTestJava FROM-CACHE
> Task :runners:core-java:testClasses UP-TO-DATE
> Task :sdks:java:harness:compileJava FROM-CACHE
> Task :sdks:java:harness:classes UP-TO-DATE
> Task :runners:core-java:testJar
> Task :sdks:java:harness:jar
> Task :runners:core-construction-java:compileTestJava FROM-CACHE
> Task :runners:core-construction-java:testClasses UP-TO-DATE
> Task :runners:core-construction-java:testJar
> Task :sdks:java:harness:shadowJar FROM-CACHE
> Task :runners:java-fn-execution:compileJava FROM-CACHE
> Task :runners:java-fn-execution:classes UP-TO-DATE
> Task :runners:java-fn-execution:jar
> Task :sdks:java:expansion-service:compileJava FROM-CACHE
> Task :sdks:java:expansion-service:classes UP-TO-DATE
> Task :sdks:java:expansion-service:jar
> Task :runners:java-job-service:compileJava FROM-CACHE
> Task :runners:java-job-service:classes UP-TO-DATE
> Task :runners:java-job-service:jar
> Task :sdks:java:io:kafka:compileJava FROM-CACHE
> Task :sdks:java:io:kafka:classes UP-TO-DATE
> Task :runners:portability:java:compileJava FROM-CACHE
> Task :runners:portability:java:classes UP-TO-DATE
> Task :sdks:java:io:kafka:jar
> Task :runners:portability:java:jar
> Task :runners:portability:java:compileTestJava FROM-CACHE
> Task :runners:portability:java:testClasses UP-TO-DATE
> Task :runners:portability:java:testJar
> Task :runners:spark:2:compileJava FROM-CACHE
> Task :runners:spark:2:classes
> Task :runners:spark:2:jar
> Task :runners:spark:2:compileTestJava FROM-CACHE
> Task :runners:spark:2:testClasses
> Task :runners:spark:2:testJar
> Task :runners:spark:2:job-server:validatesPortableRunnerStreaming
org.apache.beam.sdk.transforms.ReshuffleTest > testReshuffleAfterFixedWindows FAILED
java.lang.AssertionError at ReshuffleTest.java:235
org.apache.beam.sdk.transforms.KeysTest > testKeys FAILED
java.lang.RuntimeException at KeysTest.java:66
org.apache.beam.sdk.transforms.ReifyTimestampsTest > extractFromValuesWhenValueTimestampedLaterSucceeds FAILED
java.lang.AssertionError at ReifyTimestampsTest.java:128
org.apache.beam.sdk.transforms.ParDoTest$TimestampTests > testParDoOutputWithTimestamp FAILED
java.lang.AssertionError at ParDoTest.java:1811
org.apache.beam.sdk.transforms.ParDoTest$BasicTests > testSetupParameter FAILED
java.lang.AssertionError at ParDoTest.java:653
org.apache.beam.sdk.testing.PAssertTest > testContainsInAnyOrderNotSerializable FAILED
java.lang.RuntimeException at PAssertTest.java:189
org.apache.beam.sdk.transforms.CreateTest > testCreateWithVoidType FAILED
java.lang.AssertionError at CreateTest.java:329
org.apache.beam.sdk.transforms.CreateTest > testCreate FAILED
java.lang.AssertionError at CreateTest.java:94
112 tests completed, 8 failed, 1 skipped
> Task :runners:spark:2:job-server:validatesPortableRunnerStreaming FAILED
FAILURE: Build failed with an exception.
* What went wrong:
Execution failed for task ':runners:spark:2:job-server:validatesPortableRunnerStreaming'.
> There were failing tests. See the report at: file://<https://ci-beam.apache.org/job/beam_PostCommit_Java_PVR_Spark2_Streaming/ws/src/runners/spark/2/job-server/build/reports/tests/validatesPortableRunnerStreaming/index.html>
* Try:
Run with --stacktrace option to get the stack trace. Run with --info or --debug option to get more log output. Run with --scan to get full insights.
* Get more help at https://help.gradle.org
Deprecated Gradle features were used in this build, making it incompatible with Gradle 7.0.
Use '--warning-mode all' to show the individual deprecation warnings.
See https://docs.gradle.org/6.9.1/userguide/command_line_interface.html#sec:command_line_warnings
BUILD FAILED in 1h 20m 26s
78 actionable tasks: 48 executed, 30 from cache
Publishing build scan...
https://gradle.com/s/p5hopeoapb3ag
Build step 'Invoke Gradle script' changed build result to FAILURE
Build step 'Invoke Gradle script' marked build as failure
---------------------------------------------------------------------
To unsubscribe, e-mail: builds-unsubscribe@beam.apache.org
For additional commands, e-mail: builds-help@beam.apache.org
beam_PostCommit_Java_PVR_Spark2_Streaming - Build # 798 - Aborted!
Posted by Apache Jenkins Server <je...@builds.apache.org>.
beam_PostCommit_Java_PVR_Spark2_Streaming - Build # 798 - Aborted:
Check console output at https://ci-beam.apache.org/job/beam_PostCommit_Java_PVR_Spark2_Streaming/798/ to view the results.