You are viewing a plain text version of this content. The canonical link for it is here.
Posted to commits@beam.apache.org by Apache Jenkins Server <je...@builds.apache.org> on 2018/06/14 23:36:02 UTC

Build failed in Jenkins: beam_PostCommit_Java_GradleBuild #780

See <https://builds.apache.org/job/beam_PostCommit_Java_GradleBuild/780/display/redirect?page=changes>

Changes:

[robertwb] Suppress warning.

------------------------------------------
[...truncated 17.78 MB...]
org.apache.beam.sdk.io.gcp.spanner.SpannerWriteIT > testReportFailures STANDARD_ERROR
    Jun 14, 2018 11:31:12 PM org.apache.beam.runners.dataflow.DataflowRunner run
    INFO: To cancel the job using the 'gcloud' tool, run:
    > gcloud dataflow jobs --project=apache-beam-testing cancel --region=us-central1 2018-06-14_16_31_11-16531118174004650241
    Jun 14, 2018 11:31:12 PM org.apache.beam.runners.dataflow.TestDataflowRunner run
    INFO: Running Dataflow job 2018-06-14_16_31_11-16531118174004650241 with 0 expected assertions.
    Jun 14, 2018 11:31:24 PM org.apache.beam.runners.dataflow.util.MonitoringUtil$LoggingHandler process
    INFO: 2018-06-14T23:31:11.725Z: Autoscaling is enabled for job 2018-06-14_16_31_11-16531118174004650241. The number of workers will be between 1 and 1000.
    Jun 14, 2018 11:31:24 PM org.apache.beam.runners.dataflow.util.MonitoringUtil$LoggingHandler process
    INFO: 2018-06-14T23:31:11.753Z: Autoscaling was automatically enabled for job 2018-06-14_16_31_11-16531118174004650241.
    Jun 14, 2018 11:31:24 PM org.apache.beam.runners.dataflow.util.MonitoringUtil$LoggingHandler process
    INFO: 2018-06-14T23:31:14.386Z: Checking required Cloud APIs are enabled.
    Jun 14, 2018 11:31:24 PM org.apache.beam.runners.dataflow.util.MonitoringUtil$LoggingHandler process
    INFO: 2018-06-14T23:31:14.545Z: Checking permissions granted to controller Service Account.
    Jun 14, 2018 11:31:24 PM org.apache.beam.runners.dataflow.util.MonitoringUtil$LoggingHandler process
    INFO: 2018-06-14T23:31:18.377Z: Worker configuration: n1-standard-1 in us-central1-b.
    Jun 14, 2018 11:31:24 PM org.apache.beam.runners.dataflow.util.MonitoringUtil$LoggingHandler process
    INFO: 2018-06-14T23:31:18.711Z: Expanding CoGroupByKey operations into optimizable parts.
    Jun 14, 2018 11:31:24 PM org.apache.beam.runners.dataflow.util.MonitoringUtil$LoggingHandler process
    INFO: 2018-06-14T23:31:18.852Z: Expanding GroupByKey operations into optimizable parts.
    Jun 14, 2018 11:31:24 PM org.apache.beam.runners.dataflow.util.MonitoringUtil$LoggingHandler process
    INFO: 2018-06-14T23:31:18.878Z: Lifting ValueCombiningMappingFns into MergeBucketsMappingFns
    Jun 14, 2018 11:31:24 PM org.apache.beam.runners.dataflow.util.MonitoringUtil$LoggingHandler process
    INFO: 2018-06-14T23:31:19.043Z: Fusing adjacent ParDo, Read, Write, and Flatten operations
    Jun 14, 2018 11:31:24 PM org.apache.beam.runners.dataflow.util.MonitoringUtil$LoggingHandler process
    INFO: 2018-06-14T23:31:19.069Z: Elided trivial flatten 
    Jun 14, 2018 11:31:24 PM org.apache.beam.runners.dataflow.util.MonitoringUtil$LoggingHandler process
    INFO: 2018-06-14T23:31:19.094Z: Fusing consumer SpannerIO.Write/Write mutations to Cloud Spanner/Wait.OnSignal/Wait/Map into SpannerIO.Write/Write mutations to Cloud Spanner/Create seed/Read(CreateSource)
    Jun 14, 2018 11:31:24 PM org.apache.beam.runners.dataflow.util.MonitoringUtil$LoggingHandler process
    INFO: 2018-06-14T23:31:19.116Z: Fusing consumer SpannerIO.Write/Write mutations to Cloud Spanner/Read information schema into SpannerIO.Write/Write mutations to Cloud Spanner/Wait.OnSignal/Wait/Map
    Jun 14, 2018 11:31:24 PM org.apache.beam.runners.dataflow.util.MonitoringUtil$LoggingHandler process
    INFO: 2018-06-14T23:31:19.142Z: Fusing consumer SpannerIO.Write/Write mutations to Cloud Spanner/Schema View/Combine.GloballyAsSingletonView/BatchViewOverrides.GroupByWindowHashAsKeyAndWindowAsSortKey/BatchViewOverrides.GroupByKeyAndSortValuesOnly/Write into SpannerIO.Write/Write mutations to Cloud Spanner/Schema View/Combine.GloballyAsSingletonView/BatchViewOverrides.GroupByWindowHashAsKeyAndWindowAsSortKey/ParDo(UseWindowHashAsKeyAndWindowAsSortKey)
    Jun 14, 2018 11:31:24 PM org.apache.beam.runners.dataflow.util.MonitoringUtil$LoggingHandler process
    INFO: 2018-06-14T23:31:19.161Z: Fusing consumer SpannerIO.Write/Write mutations to Cloud Spanner/Schema View/Combine.GloballyAsSingletonView/ParDo(IsmRecordForSingularValuePerWindow) into SpannerIO.Write/Write mutations to Cloud Spanner/Schema View/Combine.GloballyAsSingletonView/BatchViewOverrides.GroupByWindowHashAsKeyAndWindowAsSortKey/BatchViewOverrides.GroupByKeyAndSortValuesOnly/Read
    Jun 14, 2018 11:31:24 PM org.apache.beam.runners.dataflow.util.MonitoringUtil$LoggingHandler process
    INFO: 2018-06-14T23:31:19.181Z: Fusing consumer SpannerIO.Write/Write mutations to Cloud Spanner/Schema View/Combine.GloballyAsSingletonView/Combine.globally(Singleton)/WithKeys/AddKeys/Map into SpannerIO.Write/Write mutations to Cloud Spanner/Read information schema
    Jun 14, 2018 11:31:24 PM org.apache.beam.runners.dataflow.util.MonitoringUtil$LoggingHandler process
    INFO: 2018-06-14T23:31:19.201Z: Fusing consumer SpannerIO.Write/Write mutations to Cloud Spanner/Schema View/Combine.GloballyAsSingletonView/Combine.globally(Singleton)/Combine.perKey(Singleton)/Combine.GroupedValues into SpannerIO.Write/Write mutations to Cloud Spanner/Schema View/Combine.GloballyAsSingletonView/Combine.globally(Singleton)/Combine.perKey(Singleton)/GroupByKey/Read
    Jun 14, 2018 11:31:24 PM org.apache.beam.runners.dataflow.util.MonitoringUtil$LoggingHandler process
    INFO: 2018-06-14T23:31:19.228Z: Fusing consumer SpannerIO.Write/Write mutations to Cloud Spanner/Schema View/Combine.GloballyAsSingletonView/Combine.globally(Singleton)/Values/Values/Map into SpannerIO.Write/Write mutations to Cloud Spanner/Schema View/Combine.GloballyAsSingletonView/Combine.globally(Singleton)/Combine.perKey(Singleton)/Combine.GroupedValues/Extract
    Jun 14, 2018 11:31:24 PM org.apache.beam.runners.dataflow.util.MonitoringUtil$LoggingHandler process
    INFO: 2018-06-14T23:31:19.249Z: Fusing consumer SpannerIO.Write/Write mutations to Cloud Spanner/Schema View/Combine.GloballyAsSingletonView/BatchViewOverrides.GroupByWindowHashAsKeyAndWindowAsSortKey/ParDo(UseWindowHashAsKeyAndWindowAsSortKey) into SpannerIO.Write/Write mutations to Cloud Spanner/Schema View/Combine.GloballyAsSingletonView/Combine.globally(Singleton)/Values/Values/Map
    Jun 14, 2018 11:31:24 PM org.apache.beam.runners.dataflow.util.MonitoringUtil$LoggingHandler process
    INFO: 2018-06-14T23:31:19.273Z: Fusing consumer SpannerIO.Write/Write mutations to Cloud Spanner/Schema View/Combine.GloballyAsSingletonView/Combine.globally(Singleton)/Combine.perKey(Singleton)/Combine.GroupedValues/Extract into SpannerIO.Write/Write mutations to Cloud Spanner/Schema View/Combine.GloballyAsSingletonView/Combine.globally(Singleton)/Combine.perKey(Singleton)/Combine.GroupedValues
    Jun 14, 2018 11:31:24 PM org.apache.beam.runners.dataflow.util.MonitoringUtil$LoggingHandler process
    INFO: 2018-06-14T23:31:19.296Z: Fusing consumer SpannerIO.Write/Write mutations to Cloud Spanner/Schema View/Combine.GloballyAsSingletonView/Combine.globally(Singleton)/Combine.perKey(Singleton)/GroupByKey+SpannerIO.Write/Write mutations to Cloud Spanner/Schema View/Combine.GloballyAsSingletonView/Combine.globally(Singleton)/Combine.perKey(Singleton)/Combine.GroupedValues/Partial into SpannerIO.Write/Write mutations to Cloud Spanner/Schema View/Combine.GloballyAsSingletonView/Combine.globally(Singleton)/WithKeys/AddKeys/Map
    Jun 14, 2018 11:31:24 PM org.apache.beam.runners.dataflow.util.MonitoringUtil$LoggingHandler process
    INFO: 2018-06-14T23:31:19.318Z: Fusing consumer SpannerIO.Write/Write mutations to Cloud Spanner/Schema View/Combine.GloballyAsSingletonView/Combine.globally(Singleton)/Combine.perKey(Singleton)/GroupByKey/Reify into SpannerIO.Write/Write mutations to Cloud Spanner/Schema View/Combine.GloballyAsSingletonView/Combine.globally(Singleton)/Combine.perKey(Singleton)/GroupByKey+SpannerIO.Write/Write mutations to Cloud Spanner/Schema View/Combine.GloballyAsSingletonView/Combine.globally(Singleton)/Combine.perKey(Singleton)/Combine.GroupedValues/Partial
    Jun 14, 2018 11:31:24 PM org.apache.beam.runners.dataflow.util.MonitoringUtil$LoggingHandler process
    INFO: 2018-06-14T23:31:19.337Z: Fusing consumer SpannerIO.Write/Write mutations to Cloud Spanner/Schema View/Combine.GloballyAsSingletonView/Combine.globally(Singleton)/Combine.perKey(Singleton)/GroupByKey/Write into SpannerIO.Write/Write mutations to Cloud Spanner/Schema View/Combine.GloballyAsSingletonView/Combine.globally(Singleton)/Combine.perKey(Singleton)/GroupByKey/Reify
    Jun 14, 2018 11:31:24 PM org.apache.beam.runners.dataflow.util.MonitoringUtil$LoggingHandler process
    INFO: 2018-06-14T23:31:19.358Z: Fusing consumer SpannerIO.Write/Write mutations to Cloud Spanner/Wait.OnSignal/To wait view 0/ParDo(CollectWindows) into SpannerIO.Write/To mutation group
    Jun 14, 2018 11:31:24 PM org.apache.beam.runners.dataflow.util.MonitoringUtil$LoggingHandler process
    INFO: 2018-06-14T23:31:19.381Z: Fusing consumer SpannerIO.Write/Write mutations to Cloud Spanner/Extract keys into SpannerIO.Write/Write mutations to Cloud Spanner/Serialize mutations
    Jun 14, 2018 11:31:24 PM org.apache.beam.runners.dataflow.util.MonitoringUtil$LoggingHandler process
    INFO: 2018-06-14T23:31:19.406Z: Fusing consumer ParDo(GenerateMutations) into GenerateSequence/Read(BoundedCountingSource)
    Jun 14, 2018 11:31:24 PM org.apache.beam.runners.dataflow.util.MonitoringUtil$LoggingHandler process
    INFO: 2018-06-14T23:31:19.463Z: Fusing consumer SpannerIO.Write/Write mutations to Cloud Spanner/Sample keys/Combine.GroupedValues into SpannerIO.Write/Write mutations to Cloud Spanner/Sample keys/GroupByKey/Read
    Jun 14, 2018 11:31:24 PM org.apache.beam.runners.dataflow.util.MonitoringUtil$LoggingHandler process
    INFO: 2018-06-14T23:31:19.491Z: Fusing consumer SpannerIO.Write/Write mutations to Cloud Spanner/Batch mutations together into SpannerIO.Write/Write mutations to Cloud Spanner/Group by partition/GroupByWindow
    Jun 14, 2018 11:31:24 PM org.apache.beam.runners.dataflow.util.MonitoringUtil$LoggingHandler process
    INFO: 2018-06-14T23:31:19.512Z: Fusing consumer SpannerIO.Write/Write mutations to Cloud Spanner/Keys sample as view/ParMultiDo(ToIsmRecordForMapLike) into SpannerIO.Write/Write mutations to Cloud Spanner/Keys sample as view/GBKaSVForData/BatchViewOverrides.GroupByKeyAndSortValuesOnly/Read
    Jun 14, 2018 11:31:24 PM org.apache.beam.runners.dataflow.util.MonitoringUtil$LoggingHandler process
    INFO: 2018-06-14T23:31:19.534Z: Fusing consumer SpannerIO.Write/Write mutations to Cloud Spanner/Keys sample as view/GBKaSVForData/BatchViewOverrides.GroupByKeyAndSortValuesOnly/Write into SpannerIO.Write/Write mutations to Cloud Spanner/Keys sample as view/GBKaSVForData/ParDo(GroupByKeyHashAndSortByKeyAndWindow)
    Jun 14, 2018 11:31:24 PM org.apache.beam.runners.dataflow.util.MonitoringUtil$LoggingHandler process
    INFO: 2018-06-14T23:31:19.551Z: Fusing consumer SpannerIO.Write/Write mutations to Cloud Spanner/Keys sample as view/GBKaSVForData/ParDo(GroupByKeyHashAndSortByKeyAndWindow) into SpannerIO.Write/Write mutations to Cloud Spanner/Sample keys/Combine.GroupedValues/Extract
    Jun 14, 2018 11:31:24 PM org.apache.beam.runners.dataflow.util.MonitoringUtil$LoggingHandler process
    INFO: 2018-06-14T23:31:19.567Z: Fusing consumer SpannerIO.Write/Write mutations to Cloud Spanner/Sample keys/GroupByKey/Write into SpannerIO.Write/Write mutations to Cloud Spanner/Sample keys/GroupByKey/Reify
    Jun 14, 2018 11:31:24 PM org.apache.beam.runners.dataflow.util.MonitoringUtil$LoggingHandler process
    INFO: 2018-06-14T23:31:19.593Z: Fusing consumer SpannerIO.Write/Write mutations to Cloud Spanner/Sample keys/Combine.GroupedValues/Extract into SpannerIO.Write/Write mutations to Cloud Spanner/Sample keys/Combine.GroupedValues
    Jun 14, 2018 11:31:24 PM org.apache.beam.runners.dataflow.util.MonitoringUtil$LoggingHandler process
    INFO: 2018-06-14T23:31:19.617Z: Fusing consumer SpannerIO.Write/Write mutations to Cloud Spanner/Sample keys/GroupByKey/Reify into SpannerIO.Write/Write mutations to Cloud Spanner/Sample keys/GroupByKey+SpannerIO.Write/Write mutations to Cloud Spanner/Sample keys/Combine.GroupedValues/Partial
    Jun 14, 2018 11:31:24 PM org.apache.beam.runners.dataflow.util.MonitoringUtil$LoggingHandler process
    INFO: 2018-06-14T23:31:19.640Z: Fusing consumer SpannerIO.Write/Write mutations to Cloud Spanner/Sample keys/GroupByKey+SpannerIO.Write/Write mutations to Cloud Spanner/Sample keys/Combine.GroupedValues/Partial into SpannerIO.Write/Write mutations to Cloud Spanner/Extract keys
    Jun 14, 2018 11:31:24 PM org.apache.beam.runners.dataflow.util.MonitoringUtil$LoggingHandler process
    INFO: 2018-06-14T23:31:19.662Z: Fusing consumer SpannerIO.Write/Write mutations to Cloud Spanner/Wait.OnSignal/To wait view 0/Sample.Any/Combine.globally(SampleAny)/Combine.perKey(SampleAny)/GroupByKey/Write into SpannerIO.Write/Write mutations to Cloud Spanner/Wait.OnSignal/To wait view 0/Sample.Any/Combine.globally(SampleAny)/Combine.perKey(SampleAny)/GroupByKey/Reify
    Jun 14, 2018 11:31:24 PM org.apache.beam.runners.dataflow.util.MonitoringUtil$LoggingHandler process
    INFO: 2018-06-14T23:31:19.699Z: Fusing consumer SpannerIO.Write/Write mutations to Cloud Spanner/Keys sample as view/GBKaSVForSize/Write into SpannerIO.Write/Write mutations to Cloud Spanner/Keys sample as view/ParMultiDo(ToIsmRecordForMapLike)
    Jun 14, 2018 11:31:24 PM org.apache.beam.runners.dataflow.util.MonitoringUtil$LoggingHandler process
    INFO: 2018-06-14T23:31:19.719Z: Fusing consumer SpannerIO.Write/Write mutations to Cloud Spanner/Wait.OnSignal/To wait view 0/View.AsList/ParDo(ToIsmRecordForGlobalWindow) into SpannerIO.Write/Write mutations to Cloud Spanner/Wait.OnSignal/To wait view 0/Sample.Any/Flatten.Iterables/FlattenIterables/FlatMap
    Jun 14, 2018 11:31:24 PM org.apache.beam.runners.dataflow.util.MonitoringUtil$LoggingHandler process
    INFO: 2018-06-14T23:31:19.742Z: Fusing consumer SpannerIO.Write/Write mutations to Cloud Spanner/Keys sample as view/GBKaSVForKeys/Write into SpannerIO.Write/Write mutations to Cloud Spanner/Keys sample as view/ParMultiDo(ToIsmRecordForMapLike)
    Jun 14, 2018 11:31:24 PM org.apache.beam.runners.dataflow.util.MonitoringUtil$LoggingHandler process
    INFO: 2018-06-14T23:31:19.764Z: Fusing consumer SpannerIO.Write/Write mutations to Cloud Spanner/Wait.OnSignal/To wait view 0/Sample.Any/Flatten.Iterables/FlattenIterables/FlatMap into SpannerIO.Write/Write mutations to Cloud Spanner/Wait.OnSignal/To wait view 0/Sample.Any/Combine.globally(SampleAny)/Values/Values/Map
    Jun 14, 2018 11:31:24 PM org.apache.beam.runners.dataflow.util.MonitoringUtil$LoggingHandler process
    INFO: 2018-06-14T23:31:19.791Z: Fusing consumer SpannerIO.Write/Write mutations to Cloud Spanner/Wait.OnSignal/To wait view 0/Sample.Any/Combine.globally(SampleAny)/Values/Values/Map into SpannerIO.Write/Write mutations to Cloud Spanner/Wait.OnSignal/To wait view 0/Sample.Any/Combine.globally(SampleAny)/Combine.perKey(SampleAny)/Combine.GroupedValues/Extract
    Jun 14, 2018 11:31:24 PM org.apache.beam.runners.dataflow.util.MonitoringUtil$LoggingHandler process
    INFO: 2018-06-14T23:31:19.818Z: Fusing consumer SpannerIO.Write/Write mutations to Cloud Spanner/Keys sample as view/ParDo(ToIsmMetadataRecordForKey) into SpannerIO.Write/Write mutations to Cloud Spanner/Keys sample as view/GBKaSVForKeys/Read
    Jun 14, 2018 11:31:24 PM org.apache.beam.runners.dataflow.util.MonitoringUtil$LoggingHandler process
    INFO: 2018-06-14T23:31:19.843Z: Fusing consumer SpannerIO.Write/Write mutations to Cloud Spanner/Wait.OnSignal/To wait view 0/Sample.Any/Combine.globally(SampleAny)/Combine.perKey(SampleAny)/Combine.GroupedValues/Extract into SpannerIO.Write/Write mutations to Cloud Spanner/Wait.OnSignal/To wait view 0/Sample.Any/Combine.globally(SampleAny)/Combine.perKey(SampleAny)/Combine.GroupedValues
    Jun 14, 2018 11:31:24 PM org.apache.beam.runners.dataflow.util.MonitoringUtil$LoggingHandler process
    INFO: 2018-06-14T23:31:19.864Z: Fusing consumer SpannerIO.Write/Write mutations to Cloud Spanner/Wait.OnSignal/To wait view 0/Sample.Any/Combine.globally(SampleAny)/WithKeys/AddKeys/Map into SpannerIO.Write/Write mutations to Cloud Spanner/Wait.OnSignal/To wait view 0/ParDo(CollectWindows)
    Jun 14, 2018 11:31:24 PM org.apache.beam.runners.dataflow.util.MonitoringUtil$LoggingHandler process
    INFO: 2018-06-14T23:31:19.885Z: Fusing consumer SpannerIO.Write/Write mutations to Cloud Spanner/Wait.OnSignal/To wait view 0/Sample.Any/Combine.globally(SampleAny)/Combine.perKey(SampleAny)/Combine.GroupedValues into SpannerIO.Write/Write mutations to Cloud Spanner/Wait.OnSignal/To wait view 0/Sample.Any/Combine.globally(SampleAny)/Combine.perKey(SampleAny)/GroupByKey/Read
    Jun 14, 2018 11:31:24 PM org.apache.beam.runners.dataflow.util.MonitoringUtil$LoggingHandler process
    INFO: 2018-06-14T23:31:19.911Z: Fusing consumer SpannerIO.Write/Write mutations to Cloud Spanner/Write mutations to Spanner into SpannerIO.Write/Write mutations to Cloud Spanner/Batch mutations together
    Jun 14, 2018 11:31:24 PM org.apache.beam.runners.dataflow.util.MonitoringUtil$LoggingHandler process
    INFO: 2018-06-14T23:31:19.942Z: Fusing consumer SpannerIO.Write/Write mutations to Cloud Spanner/Wait.OnSignal/To wait view 0/Sample.Any/Combine.globally(SampleAny)/Combine.perKey(SampleAny)/GroupByKey/Reify into SpannerIO.Write/Write mutations to Cloud Spanner/Wait.OnSignal/To wait view 0/Sample.Any/Combine.globally(SampleAny)/Combine.perKey(SampleAny)/GroupByKey+SpannerIO.Write/Write mutations to Cloud Spanner/Wait.OnSignal/To wait view 0/Sample.Any/Combine.globally(SampleAny)/Combine.perKey(SampleAny)/Combine.GroupedValues/Partial
    Jun 14, 2018 11:31:24 PM org.apache.beam.runners.dataflow.util.MonitoringUtil$LoggingHandler process
    INFO: 2018-06-14T23:31:19.972Z: Fusing consumer SpannerIO.Write/Write mutations to Cloud Spanner/Wait.OnSignal/To wait view 0/Sample.Any/Combine.globally(SampleAny)/Combine.perKey(SampleAny)/GroupByKey+SpannerIO.Write/Write mutations to Cloud Spanner/Wait.OnSignal/To wait view 0/Sample.Any/Combine.globally(SampleAny)/Combine.perKey(SampleAny)/Combine.GroupedValues/Partial into SpannerIO.Write/Write mutations to Cloud Spanner/Wait.OnSignal/To wait view 0/Sample.Any/Combine.globally(SampleAny)/WithKeys/AddKeys/Map
    Jun 14, 2018 11:31:24 PM org.apache.beam.runners.dataflow.util.MonitoringUtil$LoggingHandler process
    INFO: 2018-06-14T23:31:20.009Z: Fusing consumer SpannerIO.Write/Write mutations to Cloud Spanner/Group by partition/Reify into SpannerIO.Write/Write mutations to Cloud Spanner/Partition input
    Jun 14, 2018 11:31:24 PM org.apache.beam.runners.dataflow.util.MonitoringUtil$LoggingHandler process
    INFO: 2018-06-14T23:31:20.043Z: Fusing consumer SpannerIO.Write/To mutation group into ParDo(GenerateMutations)
    Jun 14, 2018 11:31:24 PM org.apache.beam.runners.dataflow.util.MonitoringUtil$LoggingHandler process
    INFO: 2018-06-14T23:31:20.083Z: Fusing consumer SpannerIO.Write/Write mutations to Cloud Spanner/Group by partition/GroupByWindow into SpannerIO.Write/Write mutations to Cloud Spanner/Group by partition/Read
    Jun 14, 2018 11:31:24 PM org.apache.beam.runners.dataflow.util.MonitoringUtil$LoggingHandler process
    INFO: 2018-06-14T23:31:20.109Z: Fusing consumer SpannerIO.Write/Write mutations to Cloud Spanner/Group by partition/Write into SpannerIO.Write/Write mutations to Cloud Spanner/Group by partition/Reify
    Jun 14, 2018 11:31:24 PM org.apache.beam.runners.dataflow.util.MonitoringUtil$LoggingHandler process
    INFO: 2018-06-14T23:31:20.142Z: Fusing consumer SpannerIO.Write/Write mutations to Cloud Spanner/Keys sample as view/ParDo(ToIsmMetadataRecordForSize) into SpannerIO.Write/Write mutations to Cloud Spanner/Keys sample as view/GBKaSVForSize/Read
    Jun 14, 2018 11:31:24 PM org.apache.beam.runners.dataflow.util.MonitoringUtil$LoggingHandler process
    INFO: 2018-06-14T23:31:20.539Z: Executing operation SpannerIO.Write/Write mutations to Cloud Spanner/Schema View/Combine.GloballyAsSingletonView/Combine.globally(Singleton)/Combine.perKey(Singleton)/GroupByKey/Create
    Jun 14, 2018 11:31:24 PM org.apache.beam.runners.dataflow.util.MonitoringUtil$LoggingHandler process
    INFO: 2018-06-14T23:31:20.560Z: Executing operation SpannerIO.Write/Write mutations to Cloud Spanner/Schema View/Combine.GloballyAsSingletonView/BatchViewOverrides.GroupByWindowHashAsKeyAndWindowAsSortKey/BatchViewOverrides.GroupByKeyAndSortValuesOnly/Create
    Jun 14, 2018 11:31:24 PM org.apache.beam.runners.dataflow.util.MonitoringUtil$LoggingHandler process
    INFO: 2018-06-14T23:31:20.585Z: Executing operation SpannerIO.Write/Write mutations to Cloud Spanner/Sample keys/GroupByKey/Create
    Jun 14, 2018 11:31:24 PM org.apache.beam.runners.dataflow.util.MonitoringUtil$LoggingHandler process
    INFO: 2018-06-14T23:31:20.596Z: Starting 1 workers in us-central1-b...
    Jun 14, 2018 11:31:24 PM org.apache.beam.runners.dataflow.util.MonitoringUtil$LoggingHandler process
    INFO: 2018-06-14T23:31:20.604Z: Executing operation SpannerIO.Write/Write mutations to Cloud Spanner/Keys sample as view/GBKaSVForData/BatchViewOverrides.GroupByKeyAndSortValuesOnly/Create
    Jun 14, 2018 11:31:24 PM org.apache.beam.runners.dataflow.util.MonitoringUtil$LoggingHandler process
    INFO: 2018-06-14T23:31:20.623Z: Executing operation SpannerIO.Write/Write mutations to Cloud Spanner/Keys sample as view/GBKaSVForSize/Create
    Jun 14, 2018 11:31:24 PM org.apache.beam.runners.dataflow.util.MonitoringUtil$LoggingHandler process
    INFO: 2018-06-14T23:31:20.646Z: Executing operation SpannerIO.Write/Write mutations to Cloud Spanner/Keys sample as view/GBKaSVForKeys/Create
    Jun 14, 2018 11:31:24 PM org.apache.beam.runners.dataflow.util.MonitoringUtil$LoggingHandler process
    INFO: 2018-06-14T23:31:20.669Z: Executing operation SpannerIO.Write/Write mutations to Cloud Spanner/Group by partition/Create
    Jun 14, 2018 11:31:24 PM org.apache.beam.runners.dataflow.util.MonitoringUtil$LoggingHandler process
    INFO: 2018-06-14T23:31:20.694Z: Executing operation SpannerIO.Write/Write mutations to Cloud Spanner/Wait.OnSignal/To wait view 0/Sample.Any/Combine.globally(SampleAny)/Combine.perKey(SampleAny)/GroupByKey/Create
    Jun 14, 2018 11:31:24 PM org.apache.beam.runners.dataflow.util.MonitoringUtil$LoggingHandler process
    INFO: 2018-06-14T23:31:20.929Z: Executing operation GenerateSequence/Read(BoundedCountingSource)+ParDo(GenerateMutations)+SpannerIO.Write/To mutation group+SpannerIO.Write/Write mutations to Cloud Spanner/Wait.OnSignal/To wait view 0/ParDo(CollectWindows)+SpannerIO.Write/Write mutations to Cloud Spanner/Wait.OnSignal/To wait view 0/Sample.Any/Combine.globally(SampleAny)/WithKeys/AddKeys/Map+SpannerIO.Write/Write mutations to Cloud Spanner/Wait.OnSignal/To wait view 0/Sample.Any/Combine.globally(SampleAny)/Combine.perKey(SampleAny)/GroupByKey+SpannerIO.Write/Write mutations to Cloud Spanner/Wait.OnSignal/To wait view 0/Sample.Any/Combine.globally(SampleAny)/Combine.perKey(SampleAny)/Combine.GroupedValues/Partial+SpannerIO.Write/Write mutations to Cloud Spanner/Wait.OnSignal/To wait view 0/Sample.Any/Combine.globally(SampleAny)/Combine.perKey(SampleAny)/GroupByKey/Reify+SpannerIO.Write/Write mutations to Cloud Spanner/Wait.OnSignal/To wait view 0/Sample.Any/Combine.globally(SampleAny)/Combine.perKey(SampleAny)/GroupByKey/Write
    Jun 14, 2018 11:31:29 PM org.apache.beam.runners.dataflow.util.MonitoringUtil$LoggingHandler process
    INFO: 2018-06-14T23:31:27.990Z: Autoscaling: Raised the number of workers to 0 based on the rate of progress in the currently running step(s).
    Jun 14, 2018 11:31:39 PM org.apache.beam.runners.dataflow.util.MonitoringUtil$LoggingHandler process
    INFO: 2018-06-14T23:31:38.440Z: Autoscaling: Raised the number of workers to 1 based on the rate of progress in the currently running step(s).
    Jun 14, 2018 11:31:39 PM org.apache.beam.runners.dataflow.util.MonitoringUtil$LoggingHandler process
    INFO: 2018-06-14T23:31:38.456Z: Autoscaling: Would further reduce the number of workers but reached the minimum number allowed for the job.
    Jun 14, 2018 11:32:02 PM org.apache.beam.runners.dataflow.util.MonitoringUtil$LoggingHandler process
    INFO: 2018-06-14T23:32:02.483Z: Workers have started successfully.
    Jun 14, 2018 11:32:32 PM org.apache.beam.runners.dataflow.util.MonitoringUtil$LoggingHandler process
    INFO: 2018-06-14T23:32:31.843Z: Executing operation SpannerIO.Write/Write mutations to Cloud Spanner/Wait.OnSignal/To wait view 0/Sample.Any/Combine.globally(SampleAny)/Combine.perKey(SampleAny)/GroupByKey/Close
    Jun 14, 2018 11:32:32 PM org.apache.beam.runners.dataflow.util.MonitoringUtil$LoggingHandler process
    INFO: 2018-06-14T23:32:31.970Z: Executing operation SpannerIO.Write/Write mutations to Cloud Spanner/Wait.OnSignal/To wait view 0/Sample.Any/Combine.globally(SampleAny)/Combine.perKey(SampleAny)/GroupByKey/Read+SpannerIO.Write/Write mutations to Cloud Spanner/Wait.OnSignal/To wait view 0/Sample.Any/Combine.globally(SampleAny)/Combine.perKey(SampleAny)/Combine.GroupedValues+SpannerIO.Write/Write mutations to Cloud Spanner/Wait.OnSignal/To wait view 0/Sample.Any/Combine.globally(SampleAny)/Combine.perKey(SampleAny)/Combine.GroupedValues/Extract+SpannerIO.Write/Write mutations to Cloud Spanner/Wait.OnSignal/To wait view 0/Sample.Any/Combine.globally(SampleAny)/Values/Values/Map+SpannerIO.Write/Write mutations to Cloud Spanner/Wait.OnSignal/To wait view 0/Sample.Any/Flatten.Iterables/FlattenIterables/FlatMap+SpannerIO.Write/Write mutations to Cloud Spanner/Wait.OnSignal/To wait view 0/View.AsList/ParDo(ToIsmRecordForGlobalWindow)
    Jun 14, 2018 11:32:43 PM org.apache.beam.runners.dataflow.util.MonitoringUtil$LoggingHandler process
    INFO: 2018-06-14T23:32:42.049Z: Executing operation SpannerIO.Write/Write mutations to Cloud Spanner/Wait.OnSignal/To wait view 0/View.AsList/CreateDataflowView
    Jun 14, 2018 11:32:43 PM org.apache.beam.runners.dataflow.util.MonitoringUtil$LoggingHandler process
    INFO: 2018-06-14T23:32:42.277Z: Executing operation SpannerIO.Write/Write mutations to Cloud Spanner/Create seed/Read(CreateSource)+SpannerIO.Write/Write mutations to Cloud Spanner/Wait.OnSignal/Wait/Map+SpannerIO.Write/Write mutations to Cloud Spanner/Read information schema+SpannerIO.Write/Write mutations to Cloud Spanner/Schema View/Combine.GloballyAsSingletonView/Combine.globally(Singleton)/WithKeys/AddKeys/Map+SpannerIO.Write/Write mutations to Cloud Spanner/Schema View/Combine.GloballyAsSingletonView/Combine.globally(Singleton)/Combine.perKey(Singleton)/GroupByKey+SpannerIO.Write/Write mutations to Cloud Spanner/Schema View/Combine.GloballyAsSingletonView/Combine.globally(Singleton)/Combine.perKey(Singleton)/Combine.GroupedValues/Partial+SpannerIO.Write/Write mutations to Cloud Spanner/Schema View/Combine.GloballyAsSingletonView/Combine.globally(Singleton)/Combine.perKey(Singleton)/GroupByKey/Reify+SpannerIO.Write/Write mutations to Cloud Spanner/Schema View/Combine.GloballyAsSingletonView/Combine.globally(Singleton)/Combine.perKey(Singleton)/GroupByKey/Write
    Jun 14, 2018 11:32:51 PM org.apache.beam.runners.dataflow.util.MonitoringUtil$LoggingHandler process
    INFO: 2018-06-14T23:32:51.518Z: Executing operation SpannerIO.Write/Write mutations to Cloud Spanner/Schema View/Combine.GloballyAsSingletonView/Combine.globally(Singleton)/Combine.perKey(Singleton)/GroupByKey/Close
    Jun 14, 2018 11:32:53 PM org.apache.beam.runners.dataflow.util.MonitoringUtil$LoggingHandler process
    INFO: 2018-06-14T23:32:51.585Z: Executing operation SpannerIO.Write/Write mutations to Cloud Spanner/Schema View/Combine.GloballyAsSingletonView/Combine.globally(Singleton)/Combine.perKey(Singleton)/GroupByKey/Read+SpannerIO.Write/Write mutations to Cloud Spanner/Schema View/Combine.GloballyAsSingletonView/Combine.globally(Singleton)/Combine.perKey(Singleton)/Combine.GroupedValues+SpannerIO.Write/Write mutations to Cloud Spanner/Schema View/Combine.GloballyAsSingletonView/Combine.globally(Singleton)/Combine.perKey(Singleton)/Combine.GroupedValues/Extract+SpannerIO.Write/Write mutations to Cloud Spanner/Schema View/Combine.GloballyAsSingletonView/Combine.globally(Singleton)/Values/Values/Map+SpannerIO.Write/Write mutations to Cloud Spanner/Schema View/Combine.GloballyAsSingletonView/BatchViewOverrides.GroupByWindowHashAsKeyAndWindowAsSortKey/ParDo(UseWindowHashAsKeyAndWindowAsSortKey)+SpannerIO.Write/Write mutations to Cloud Spanner/Schema View/Combine.GloballyAsSingletonView/BatchViewOverrides.GroupByWindowHashAsKeyAndWindowAsSortKey/BatchViewOverrides.GroupByKeyAndSortValuesOnly/Write
    Jun 14, 2018 11:32:57 PM org.apache.beam.runners.dataflow.util.MonitoringUtil$LoggingHandler process
    INFO: 2018-06-14T23:32:56.329Z: Executing operation SpannerIO.Write/Write mutations to Cloud Spanner/Schema View/Combine.GloballyAsSingletonView/BatchViewOverrides.GroupByWindowHashAsKeyAndWindowAsSortKey/BatchViewOverrides.GroupByKeyAndSortValuesOnly/Close
    Jun 14, 2018 11:32:57 PM org.apache.beam.runners.dataflow.util.MonitoringUtil$LoggingHandler process
    INFO: 2018-06-14T23:32:56.467Z: Executing operation SpannerIO.Write/Write mutations to Cloud Spanner/Schema View/Combine.GloballyAsSingletonView/BatchViewOverrides.GroupByWindowHashAsKeyAndWindowAsSortKey/BatchViewOverrides.GroupByKeyAndSortValuesOnly/Read+SpannerIO.Write/Write mutations to Cloud Spanner/Schema View/Combine.GloballyAsSingletonView/ParDo(IsmRecordForSingularValuePerWindow)
    Jun 14, 2018 11:33:02 PM org.apache.beam.runners.dataflow.util.MonitoringUtil$LoggingHandler process
    INFO: 2018-06-14T23:33:01.757Z: Executing operation SpannerIO.Write/Write mutations to Cloud Spanner/Schema View/Combine.GloballyAsSingletonView/CreateDataflowView
    Jun 14, 2018 11:33:02 PM org.apache.beam.runners.dataflow.util.MonitoringUtil$LoggingHandler process
    INFO: 2018-06-14T23:33:01.926Z: Executing operation SpannerIO.Write/Write mutations to Cloud Spanner/Serialize mutations+SpannerIO.Write/Write mutations to Cloud Spanner/Extract keys+SpannerIO.Write/Write mutations to Cloud Spanner/Sample keys/GroupByKey+SpannerIO.Write/Write mutations to Cloud Spanner/Sample keys/Combine.GroupedValues/Partial+SpannerIO.Write/Write mutations to Cloud Spanner/Sample keys/GroupByKey/Reify+SpannerIO.Write/Write mutations to Cloud Spanner/Sample keys/GroupByKey/Write
    Jun 14, 2018 11:33:17 PM org.apache.beam.runners.dataflow.util.MonitoringUtil$LoggingHandler process
    INFO: 2018-06-14T23:33:15.374Z: Executing operation SpannerIO.Write/Write mutations to Cloud Spanner/Sample keys/GroupByKey/Close
    Jun 14, 2018 11:33:17 PM org.apache.beam.runners.dataflow.util.MonitoringUtil$LoggingHandler process
    INFO: 2018-06-14T23:33:15.437Z: Executing operation SpannerIO.Write/Write mutations to Cloud Spanner/Sample keys/GroupByKey/Read+SpannerIO.Write/Write mutations to Cloud Spanner/Sample keys/Combine.GroupedValues+SpannerIO.Write/Write mutations to Cloud Spanner/Sample keys/Combine.GroupedValues/Extract+SpannerIO.Write/Write mutations to Cloud Spanner/Keys sample as view/GBKaSVForData/ParDo(GroupByKeyHashAndSortByKeyAndWindow)+SpannerIO.Write/Write mutations to Cloud Spanner/Keys sample as view/GBKaSVForData/BatchViewOverrides.GroupByKeyAndSortValuesOnly/Write
    Jun 14, 2018 11:33:17 PM org.apache.beam.runners.dataflow.util.MonitoringUtil$LoggingHandler process
    INFO: 2018-06-14T23:33:17.182Z: Executing operation SpannerIO.Write/Write mutations to Cloud Spanner/Keys sample as view/GBKaSVForData/BatchViewOverrides.GroupByKeyAndSortValuesOnly/Close
    Jun 14, 2018 11:33:17 PM org.apache.beam.runners.dataflow.util.MonitoringUtil$LoggingHandler process
    INFO: 2018-06-14T23:33:17.271Z: Executing operation SpannerIO.Write/Write mutations to Cloud Spanner/Keys sample as view/GBKaSVForData/BatchViewOverrides.GroupByKeyAndSortValuesOnly/Read+SpannerIO.Write/Write mutations to Cloud Spanner/Keys sample as view/ParMultiDo(ToIsmRecordForMapLike)+SpannerIO.Write/Write mutations to Cloud Spanner/Keys sample as view/GBKaSVForSize/Write+SpannerIO.Write/Write mutations to Cloud Spanner/Keys sample as view/GBKaSVForKeys/Write
    Jun 14, 2018 11:33:23 PM org.apache.beam.runners.dataflow.util.MonitoringUtil$LoggingHandler process
    INFO: 2018-06-14T23:33:22.338Z: Executing operation SpannerIO.Write/Write mutations to Cloud Spanner/Keys sample as view/GBKaSVForSize/Close
    Jun 14, 2018 11:33:23 PM org.apache.beam.runners.dataflow.util.MonitoringUtil$LoggingHandler process
    INFO: 2018-06-14T23:33:22.369Z: Executing operation SpannerIO.Write/Write mutations to Cloud Spanner/Keys sample as view/GBKaSVForKeys/Close
    Jun 14, 2018 11:33:23 PM org.apache.beam.runners.dataflow.util.MonitoringUtil$LoggingHandler process
    INFO: 2018-06-14T23:33:22.395Z: Executing operation SpannerIO.Write/Write mutations to Cloud Spanner/Keys sample as view/GBKaSVForSize/Read+SpannerIO.Write/Write mutations to Cloud Spanner/Keys sample as view/ParDo(ToIsmMetadataRecordForSize)
    Jun 14, 2018 11:33:23 PM org.apache.beam.runners.dataflow.util.MonitoringUtil$LoggingHandler process
    INFO: 2018-06-14T23:33:22.430Z: Executing operation SpannerIO.Write/Write mutations to Cloud Spanner/Keys sample as view/GBKaSVForKeys/Read+SpannerIO.Write/Write mutations to Cloud Spanner/Keys sample as view/ParDo(ToIsmMetadataRecordForKey)
    Jun 14, 2018 11:33:30 PM org.apache.beam.runners.dataflow.util.MonitoringUtil$LoggingHandler process
    INFO: 2018-06-14T23:33:28.985Z: Executing operation SpannerIO.Write/Write mutations to Cloud Spanner/Keys sample as view/Flatten.PCollections
    Jun 14, 2018 11:33:30 PM org.apache.beam.runners.dataflow.util.MonitoringUtil$LoggingHandler process
    INFO: 2018-06-14T23:33:29.174Z: Executing operation SpannerIO.Write/Write mutations to Cloud Spanner/Keys sample as view/CreateDataflowView
    Jun 14, 2018 11:33:30 PM org.apache.beam.runners.dataflow.util.MonitoringUtil$LoggingHandler process
    INFO: 2018-06-14T23:33:29.313Z: Executing operation SpannerIO.Write/Write mutations to Cloud Spanner/Partition input+SpannerIO.Write/Write mutations to Cloud Spanner/Group by partition/Reify+SpannerIO.Write/Write mutations to Cloud Spanner/Group by partition/Write
    Jun 14, 2018 11:33:34 PM org.apache.beam.runners.dataflow.util.MonitoringUtil$LoggingHandler process
    INFO: 2018-06-14T23:33:34.086Z: Executing operation SpannerIO.Write/Write mutations to Cloud Spanner/Group by partition/Close
    Jun 14, 2018 11:33:34 PM org.apache.beam.runners.dataflow.util.MonitoringUtil$LoggingHandler process
    INFO: 2018-06-14T23:33:34.144Z: Executing operation SpannerIO.Write/Write mutations to Cloud Spanner/Group by partition/Read+SpannerIO.Write/Write mutations to Cloud Spanner/Group by partition/GroupByWindow+SpannerIO.Write/Write mutations to Cloud Spanner/Batch mutations together+SpannerIO.Write/Write mutations to Cloud Spanner/Write mutations to Spanner
    Jun 14, 2018 11:33:41 PM org.apache.beam.runners.dataflow.util.MonitoringUtil$LoggingHandler process
    INFO: 2018-06-14T23:33:40.134Z: Cleaning up.
    Jun 14, 2018 11:33:41 PM org.apache.beam.runners.dataflow.util.MonitoringUtil$LoggingHandler process
    INFO: 2018-06-14T23:33:40.331Z: Stopping worker pool...
    Jun 14, 2018 11:35:47 PM org.apache.beam.runners.dataflow.util.MonitoringUtil$LoggingHandler process
    INFO: 2018-06-14T23:35:47.138Z: Autoscaling: Resized worker pool from 1 to 0.
    Jun 14, 2018 11:35:47 PM org.apache.beam.runners.dataflow.util.MonitoringUtil$LoggingHandler process
    INFO: 2018-06-14T23:35:47.162Z: Autoscaling: Would further reduce the number of workers but reached the minimum number allowed for the job.
    Jun 14, 2018 11:35:55 PM org.apache.beam.runners.dataflow.DataflowPipelineJob waitUntilFinish
    INFO: Job 2018-06-14_16_31_11-16531118174004650241 finished with status DONE.
    Jun 14, 2018 11:35:55 PM org.apache.beam.runners.dataflow.TestDataflowRunner checkForPAssertSuccess
    INFO: Success result for Dataflow job 2018-06-14_16_31_11-16531118174004650241. Found 0 success, 0 failures out of 0 expected assertions.
    Jun 14, 2018 11:35:55 PM org.apache.beam.runners.dataflow.DataflowPipelineJob waitUntilFinish
    INFO: Job 2018-06-14_16_31_11-16531118174004650241 finished with status DONE.

Gradle Test Executor 127 finished executing tests.

> Task :beam-runners-google-cloud-dataflow-java:googleCloudPlatformIntegrationTest
Finished generating test XML results (0.018 secs) into: <https://builds.apache.org/job/beam_PostCommit_Java_GradleBuild/ws/src/runners/google-cloud-dataflow-java/build/test-results/googleCloudPlatformIntegrationTest>
Generating HTML test report...
Finished generating test html results (0.023 secs) into: <https://builds.apache.org/job/beam_PostCommit_Java_GradleBuild/ws/src/runners/google-cloud-dataflow-java/build/reports/tests/googleCloudPlatformIntegrationTest>
Packing task ':beam-runners-google-cloud-dataflow-java:googleCloudPlatformIntegrationTest'
:beam-runners-google-cloud-dataflow-java:googleCloudPlatformIntegrationTest (Thread[Task worker for ':' Thread 9,5,main]) completed. Took 34 mins 48.001 secs.
:beam-runners-google-cloud-dataflow-java:postCommit (Thread[Task worker for ':' Thread 9,5,main]) started.

> Task :beam-runners-google-cloud-dataflow-java:postCommit
Skipping task ':beam-runners-google-cloud-dataflow-java:postCommit' as it has no actions.
:beam-runners-google-cloud-dataflow-java:postCommit (Thread[Task worker for ':' Thread 9,5,main]) completed. Took 0.0 secs.

FAILURE: Build completed with 2 failures.

1: Task failed with an exception.
-----------
* What went wrong:
Execution failed for task ':beam-sdks-java-io-mqtt:test'.
> There were failing tests. See the report at: file://<https://builds.apache.org/job/beam_PostCommit_Java_GradleBuild/ws/src/sdks/java/io/mqtt/build/reports/tests/test/index.html>

* Try:
Run with --stacktrace option to get the stack trace. Run with --debug option to get more log output. Run with --scan to get full insights.
==============================================================================

2: Task failed with an exception.
-----------
* What went wrong:
Execution failed for task ':beam-runners-direct-java:test'.
> There were failing tests. See the report at: file://<https://builds.apache.org/job/beam_PostCommit_Java_GradleBuild/ws/src/runners/direct-java/build/reports/tests/test/index.html>

* Try:
Run with --stacktrace option to get the stack trace. Run with --debug option to get more log output. Run with --scan to get full insights.
==============================================================================

* Get more help at https://help.gradle.org

Deprecated Gradle features were used in this build, making it incompatible with Gradle 5.0.
See https://docs.gradle.org/4.8/userguide/command_line_interface.html#sec:command_line_warnings

BUILD FAILED in 48m 29s
541 actionable tasks: 537 executed, 4 from cache

Publishing build scan...
https://gradle.com/s/46wlsgygeulie

Build step 'Invoke Gradle script' changed build result to FAILURE
Build step 'Invoke Gradle script' marked build as failure
Recording test results


Jenkins build is back to normal : beam_PostCommit_Java_GradleBuild #782

Posted by Apache Jenkins Server <je...@builds.apache.org>.
See <https://builds.apache.org/job/beam_PostCommit_Java_GradleBuild/782/display/redirect?page=changes>


Build failed in Jenkins: beam_PostCommit_Java_GradleBuild #781

Posted by Apache Jenkins Server <je...@builds.apache.org>.
See <https://builds.apache.org/job/beam_PostCommit_Java_GradleBuild/781/display/redirect?page=changes>

Changes:

[robertwb] Remove trailing whitespace.

------------------------------------------
[...truncated 17.64 MB...]
    Jun 15, 2018 12:15:57 AM org.apache.beam.sdk.transforms.DoFnTester of
    WARNING: Your tests use DoFnTester, which may not exercise DoFns correctly. Please use TestPipeline instead.

org.apache.beam.examples.cookbook.FilterExamplesTest > testProjectionFn STANDARD_ERROR
    Jun 15, 2018 12:15:57 AM org.apache.beam.sdk.transforms.DoFnTester of
    WARNING: Your tests use DoFnTester, which may not exercise DoFns correctly. Please use TestPipeline instead.

org.apache.beam.examples.cookbook.JoinExamplesTest > testExtractCountryInfoFn STANDARD_ERROR
    Jun 15, 2018 12:15:57 AM org.apache.beam.sdk.transforms.DoFnTester of
    WARNING: Your tests use DoFnTester, which may not exercise DoFns correctly. Please use TestPipeline instead.

org.apache.beam.examples.cookbook.JoinExamplesTest > testExtractEventDataFn STANDARD_ERROR
    Jun 15, 2018 12:15:57 AM org.apache.beam.sdk.transforms.DoFnTester of
    WARNING: Your tests use DoFnTester, which may not exercise DoFns correctly. Please use TestPipeline instead.

org.apache.beam.examples.DebuggingWordCountTest > testDebuggingWordCount STANDARD_ERROR
    Jun 15, 2018 12:15:57 AM org.apache.beam.sdk.io.FileBasedSource getEstimatedSizeBytes
    INFO: Filepattern /tmp/junit7428152493186973600/junit7390856163142110138.tmp matched 1 files with total size 54
    Jun 15, 2018 12:15:57 AM org.apache.beam.sdk.io.FileBasedSource split
    INFO: Splitting filepattern /tmp/junit7428152493186973600/junit7390856163142110138.tmp into bundles of size 3 took 1 ms and produced 1 files and 18 bundles

org.apache.beam.examples.WordCountTest > testExtractWordsFn STANDARD_ERROR
    Jun 15, 2018 12:15:58 AM org.apache.beam.sdk.transforms.DoFnTester of
    WARNING: Your tests use DoFnTester, which may not exercise DoFns correctly. Please use TestPipeline instead.

org.apache.beam.examples.subprocess.ExampleEchoPipelineTest > testExampleEchoPipeline STANDARD_ERROR
    Jun 15, 2018 12:16:00 AM org.apache.beam.examples.subprocess.utils.CallingSubProcessUtils initSemaphore
    INFO: Initialized Semaphore for binary test-Echo111568731588879683.sh 
    Jun 15, 2018 12:16:00 AM org.apache.beam.examples.subprocess.utils.CallingSubProcessUtils setUp
    INFO: Calling filesetup to move Executables to worker.
    Jun 15, 2018 12:16:00 AM org.apache.beam.examples.subprocess.utils.FileUtils copyFileFromGCSToWorker
    INFO: Moving File /tmp/test-Echo111568731588879683.sh to /tmp/test-Echoo7799706318751555374/test-Echo111568731588879683.sh 
    Jun 15, 2018 12:16:00 AM org.apache.beam.examples.subprocess.utils.CallingSubProcessUtils initSemaphore
    INFO: Initialized Semaphore for binary test-EchoAgain8703737153931875853.sh 
    Jun 15, 2018 12:16:00 AM org.apache.beam.examples.subprocess.utils.CallingSubProcessUtils setUp
    INFO: Calling filesetup to move Executables to worker.
    Jun 15, 2018 12:16:00 AM org.apache.beam.examples.subprocess.utils.FileUtils copyFileFromGCSToWorker
    INFO: Moving File /tmp/test-EchoAgain8703737153931875853.sh to /tmp/test-Echoo7799706318751555374/test-EchoAgain8703737153931875853.sh 

org.apache.beam.examples.complete.game.HourlyTeamScoreTest > testUserScoresFilter STANDARD_OUT
    GOT user2_AmberCockatoo,AmberCockatoo,13,1447965690000,2015-11-19 12:41:31.053
    GOT user0_MagentaKangaroo,MagentaKangaroo,4,1447965690000,2015-11-19 12:41:31.053
    GOT user18_BananaEmu,BananaEmu,7,1447965690000,2015-11-19 12:41:31.053
    GOT user18_BananaEmu,BananaEmu,1,1447965690000,2015-11-19 12:41:31.053
    GOT user18_ApricotCaneToad,ApricotCaneToad,14,1447965690000,2015-11-19 12:41:31.053
    GOT user0_MagentaKangaroo,MagentaKangaroo,3,1447955630000,2015-11-19 09:53:53.444
    GOT user7_AndroidGreenKookaburra,AndroidGreenKookaburra,12,1447955630000,2015-11-19 09:53:53.444
    GOT user19_BisqueBilby,BisqueBilby,8,1447955630000,2015-11-19 09:53:53.444
    GOT user19_BisqueBilby,BisqueBilby,6,1447955630000,2015-11-19 09:53:53.444
    GOT user3_BananaEmu,BananaEmu,17,1447965690000,2015-11-19 12:41:31.053
    GOT user7_AlmondWallaby,AlmondWallaby,15,1447955630000,2015-11-19 09:53:53.444
    GOT user13_ApricotQuokka,ApricotQuokka,15,1447955630000,2015-11-19 09:53:53.444
    GOT user7_AndroidGreenKookaburra,AndroidGreenKookaburra,11,1447955630000,2015-11-19 09:53:53.444
    GOT user0_AndroidGreenEchidna,AndroidGreenEchidna,0,1447965690000,2015-11-19 12:41:31.053
    GOT user6_AmberNumbat,AmberNumbat,11,1447955630000,2015-11-19 09:53:53.444

org.apache.beam.examples.complete.game.UserScoreTest > testTeamScoreSums STANDARD_OUT
    GOT THIS IS A PARSE ERROR,2015-11-19 09:53:53.444
    GOT user19_BisqueBilby,BisqueBilby,6,1447955630000,2015-11-19 09:53:53.444
    GOT user7_AlmondWallaby,AlmondWallaby,15,1447955630000,2015-11-19 09:53:53.444
    GOT user7_AndroidGreenKookaburra,AndroidGreenKookaburra,12,1447955630000,2015-11-19 09:53:53.444
    GOT user13_ApricotQuokka,ApricotQuokka,15,1447955630000,2015-11-19 09:53:53.444
    GOT user7_AndroidGreenKookaburra,AndroidGreenKookaburra,11,1447955630000,2015-11-19 09:53:53.444
    GOT user6_AmberNumbat,AmberNumbat,11,1447955630000,2015-11-19 09:53:53.444

org.apache.beam.examples.complete.game.UserScoreTest > testTeamScoreSums STANDARD_ERROR
    Jun 15, 2018 12:16:01 AM org.apache.beam.examples.complete.game.UserScore$ParseEventFn processElement
    INFO: Parse error on THIS IS A PARSE ERROR,2015-11-19 09:53:53.444, 2

org.apache.beam.examples.complete.game.UserScoreTest > testTeamScoreSums STANDARD_OUT
    GOT user0_MagentaKangaroo,MagentaKangaroo,3,1447955630000,2015-11-19 09:53:53.444
    GOT user6_AliceBlueDingo,AliceBlueDingo,4,xxxxxxx,2015-11-19 09:53:53.444

org.apache.beam.examples.complete.game.UserScoreTest > testTeamScoreSums STANDARD_ERROR
    Jun 15, 2018 12:16:01 AM org.apache.beam.examples.complete.game.UserScore$ParseEventFn processElement
    INFO: Parse error on user6_AliceBlueDingo,AliceBlueDingo,4,xxxxxxx,2015-11-19 09:53:53.444, For input string: "xxxxxxx"

org.apache.beam.examples.complete.game.UserScoreTest > testTeamScoreSums STANDARD_OUT
    GOT user19_BisqueBilby,BisqueBilby,8,1447955630000,2015-11-19 09:53:53.444

org.apache.beam.examples.complete.game.UserScoreTest > testUserScoresBadInput STANDARD_OUT
    GOT user6_AliceBlueDingo,AliceBlueDingo,4,xxxxxxx,2015-11-19 09:53:53.444
    GOT user13_BisqueBilby,BisqueBilby,xxx,1447955630000,2015-11-19 09:53:53.444

org.apache.beam.examples.complete.game.UserScoreTest > testUserScoresBadInput STANDARD_ERROR
    Jun 15, 2018 12:16:01 AM org.apache.beam.examples.complete.game.UserScore$ParseEventFn processElement
    INFO: Parse error on user6_AliceBlueDingo,AliceBlueDingo,4,xxxxxxx,2015-11-19 09:53:53.444, For input string: "xxxxxxx"

org.apache.beam.examples.complete.game.UserScoreTest > testUserScoresBadInput STANDARD_OUT
    GOT THIS IS A PARSE ERROR,2015-11-19 09:53:53.444

org.apache.beam.examples.complete.game.UserScoreTest > testUserScoresBadInput STANDARD_ERROR
    Jun 15, 2018 12:16:01 AM org.apache.beam.examples.complete.game.UserScore$ParseEventFn processElement
    INFO: Parse error on user13_BisqueBilby,BisqueBilby,xxx,1447955630000,2015-11-19 09:53:53.444, For input string: "xxx"
    Jun 15, 2018 12:16:01 AM org.apache.beam.examples.complete.game.UserScore$ParseEventFn processElement
    INFO: Parse error on THIS IS A PARSE ERROR,2015-11-19 09:53:53.444, 2

org.apache.beam.examples.complete.game.UserScoreTest > testUserScoreSums STANDARD_OUT
    GOT user7_AlmondWallaby,AlmondWallaby,15,1447955630000,2015-11-19 09:53:53.444
    GOT user6_AmberNumbat,AmberNumbat,11,1447955630000,2015-11-19 09:53:53.444
    GOT user6_AliceBlueDingo,AliceBlueDingo,4,xxxxxxx,2015-11-19 09:53:53.444
    GOT user7_AndroidGreenKookaburra,AndroidGreenKookaburra,11,1447955630000,2015-11-19 09:53:53.444
    GOT user7_AndroidGreenKookaburra,AndroidGreenKookaburra,12,1447955630000,2015-11-19 09:53:53.444
    GOT user13_ApricotQuokka,ApricotQuokka,15,1447955630000,2015-11-19 09:53:53.444
    GOT user0_MagentaKangaroo,MagentaKangaroo,3,1447955630000,2015-11-19 09:53:53.444
    GOT user19_BisqueBilby,BisqueBilby,6,1447955630000,2015-11-19 09:53:53.444

org.apache.beam.examples.complete.game.UserScoreTest > testUserScoreSums STANDARD_ERROR
    Jun 15, 2018 12:16:01 AM org.apache.beam.examples.complete.game.UserScore$ParseEventFn processElement

org.apache.beam.examples.complete.game.UserScoreTest > testUserScoreSums STANDARD_OUT
    GOT user19_BisqueBilby,BisqueBilby,8,1447955630000,2015-11-19 09:53:53.444
    GOT THIS IS A PARSE ERROR,2015-11-19 09:53:53.444

org.apache.beam.examples.complete.game.UserScoreTest > testUserScoreSums STANDARD_ERROR
    INFO: Parse error on user6_AliceBlueDingo,AliceBlueDingo,4,xxxxxxx,2015-11-19 09:53:53.444, For input string: "xxxxxxx"
    Jun 15, 2018 12:16:01 AM org.apache.beam.examples.complete.game.UserScore$ParseEventFn processElement
    INFO: Parse error on THIS IS A PARSE ERROR,2015-11-19 09:53:53.444, 2

org.apache.beam.examples.complete.game.UserScoreTest > testParseEventFn STANDARD_ERROR
    Jun 15, 2018 12:16:01 AM org.apache.beam.sdk.transforms.DoFnTester of
    WARNING: Your tests use DoFnTester, which may not exercise DoFns correctly. Please use TestPipeline instead.

org.apache.beam.examples.complete.game.UserScoreTest > testParseEventFn STANDARD_OUT
    GOT user0_MagentaKangaroo,MagentaKangaroo,3,1447955630000,2015-11-19 09:53:53.444
    GOT user13_ApricotQuokka,ApricotQuokka,15,1447955630000,2015-11-19 09:53:53.444
    GOT user6_AmberNumbat,AmberNumbat,11,1447955630000,2015-11-19 09:53:53.444
    GOT user7_AlmondWallaby,AlmondWallaby,15,1447955630000,2015-11-19 09:53:53.444
    GOT user7_AndroidGreenKookaburra,AndroidGreenKookaburra,12,1447955630000,2015-11-19 09:53:53.444
    GOT user6_AliceBlueDingo,AliceBlueDingo,4,xxxxxxx,2015-11-19 09:53:53.444

org.apache.beam.examples.complete.game.UserScoreTest > testParseEventFn STANDARD_ERROR
    Jun 15, 2018 12:16:01 AM org.apache.beam.examples.complete.game.UserScore$ParseEventFn processElement
    INFO: Parse error on user6_AliceBlueDingo,AliceBlueDingo,4,xxxxxxx,2015-11-19 09:53:53.444, For input string: "xxxxxxx"

org.apache.beam.examples.complete.game.UserScoreTest > testParseEventFn STANDARD_OUT
    GOT user7_AndroidGreenKookaburra,AndroidGreenKookaburra,11,1447955630000,2015-11-19 09:53:53.444
    GOT THIS IS A PARSE ERROR,2015-11-19 09:53:53.444

org.apache.beam.examples.complete.game.UserScoreTest > testParseEventFn STANDARD_ERROR
    Jun 15, 2018 12:16:01 AM org.apache.beam.examples.complete.game.UserScore$ParseEventFn processElement
    INFO: Parse error on THIS IS A PARSE ERROR,2015-11-19 09:53:53.444, 2

org.apache.beam.examples.complete.game.UserScoreTest > testParseEventFn STANDARD_OUT
    GOT user19_BisqueBilby,BisqueBilby,6,1447955630000,2015-11-19 09:53:53.444
    GOT user19_BisqueBilby,BisqueBilby,8,1447955630000,2015-11-19 09:53:53.444

org.apache.beam.examples.complete.game.GameStatsTest > testCalculateSpammyUsers STANDARD_ERROR
    Jun 15, 2018 12:16:01 AM org.apache.beam.examples.complete.game.GameStats$CalculateSpammyUsers$1 processElement
    INFO: user Robot-1 spammer score 116 with mean 24.923076923076923
    Jun 15, 2018 12:16:01 AM org.apache.beam.examples.complete.game.GameStats$CalculateSpammyUsers$1 processElement
    INFO: user Robot-2 spammer score 66 with mean 24.923076923076923

Gradle Test Executor 135 finished executing tests.

> Task :beam-examples-java:test
Finished generating test XML results (0.001 secs) into: <https://builds.apache.org/job/beam_PostCommit_Java_GradleBuild/ws/src/examples/java/build/test-results/test>
Generating HTML test report...
Finished generating test html results (0.002 secs) into: <https://builds.apache.org/job/beam_PostCommit_Java_GradleBuild/ws/src/examples/java/build/reports/tests/test>
Packing task ':beam-examples-java:test'
:beam-examples-java:test (Thread[Task worker for ':' Thread 13,5,main]) completed. Took 11.746 secs.
:beam-examples-java:check (Thread[Task worker for ':' Thread 13,5,main]) started.

> Task :beam-examples-java:check
Skipping task ':beam-examples-java:check' as it has no actions.
:beam-examples-java:check (Thread[Task worker for ':' Thread 13,5,main]) completed. Took 0.0 secs.
:beam-examples-java:build (Thread[Task worker for ':' Thread 13,5,main]) started.

> Task :beam-examples-java:build
Skipping task ':beam-examples-java:build' as it has no actions.
:beam-examples-java:build (Thread[Task worker for ':' Thread 13,5,main]) completed. Took 0.0 secs.
:beam-examples-java:buildDependents (Thread[Task worker for ':' Thread 8,5,main]) started.

> Task :beam-examples-java:buildDependents
Caching disabled for task ':beam-examples-java:buildDependents': Caching has not been enabled for the task
Task ':beam-examples-java:buildDependents' is not up-to-date because:
  Task has not declared any outputs despite executing actions.
:beam-examples-java:buildDependents (Thread[Task worker for ':' Thread 8,5,main]) completed. Took 0.0 secs.
:beam-sdks-java-io-google-cloud-platform:buildDependents (Thread[Task worker for ':' Thread 8,5,main]) started.

> Task :beam-sdks-java-io-google-cloud-platform:buildDependents
Caching disabled for task ':beam-sdks-java-io-google-cloud-platform:buildDependents': Caching has not been enabled for the task
Task ':beam-sdks-java-io-google-cloud-platform:buildDependents' is not up-to-date because:
  Task has not declared any outputs despite executing actions.
:beam-sdks-java-io-google-cloud-platform:buildDependents (Thread[Task worker for ':' Thread 8,5,main]) completed. Took 0.0 secs.
:beam-sdks-java-extensions-protobuf:buildDependents (Thread[Task worker for ':' Thread 8,5,main]) started.

> Task :beam-sdks-java-extensions-protobuf:buildDependents
Caching disabled for task ':beam-sdks-java-extensions-protobuf:buildDependents': Caching has not been enabled for the task
Task ':beam-sdks-java-extensions-protobuf:buildDependents' is not up-to-date because:
  Task has not declared any outputs despite executing actions.
:beam-sdks-java-extensions-protobuf:buildDependents (Thread[Task worker for ':' Thread 8,5,main]) completed. Took 0.0 secs.

FAILURE: Build completed with 4 failures.

1: Task failed with an exception.
-----------
* What went wrong:
Execution failed for task ':beam-runners-direct-java:test'.
> There were failing tests. See the report at: file://<https://builds.apache.org/job/beam_PostCommit_Java_GradleBuild/ws/src/runners/direct-java/build/reports/tests/test/index.html>

* Try:
Run with --stacktrace option to get the stack trace. Run with --debug option to get more log output. Run with --scan to get full insights.
==============================================================================

2: Task failed with an exception.
-----------
* What went wrong:
Execution failed for task ':beam-examples-java:dataflowRunnerPreCommit'.
> There were failing tests. See the report at: file://<https://builds.apache.org/job/beam_PostCommit_Java_GradleBuild/ws/src/examples/java/build/reports/tests/dataflowRunnerPreCommit/index.html>

* Try:
Run with --stacktrace option to get the stack trace. Run with --debug option to get more log output. Run with --scan to get full insights.
==============================================================================

3: Task failed with an exception.
-----------
* What went wrong:
Execution failed for task ':beam-runners-google-cloud-dataflow-java:googleCloudPlatformIntegrationTest'.
> There were failing tests. See the report at: file://<https://builds.apache.org/job/beam_PostCommit_Java_GradleBuild/ws/src/runners/google-cloud-dataflow-java/build/reports/tests/googleCloudPlatformIntegrationTest/index.html>

* Try:
Run with --stacktrace option to get the stack trace. Run with --debug option to get more log output. Run with --scan to get full insights.
==============================================================================

4: Task failed with an exception.
-----------
* What went wrong:
Execution failed for task ':beam-examples-java:dataflowStreamingRunnerPreCommit'.
> There were failing tests. See the report at: file://<https://builds.apache.org/job/beam_PostCommit_Java_GradleBuild/ws/src/examples/java/build/reports/tests/dataflowStreamingRunnerPreCommit/index.html>

* Try:
Run with --stacktrace option to get the stack trace. Run with --debug option to get more log output. Run with --scan to get full insights.
==============================================================================

* Get more help at https://help.gradle.org

Deprecated Gradle features were used in this build, making it incompatible with Gradle 5.0.
See https://docs.gradle.org/4.8/userguide/command_line_interface.html#sec:command_line_warnings

BUILD FAILED in 35m 7s
542 actionable tasks: 537 executed, 5 from cache

Publishing build scan...
https://gradle.com/s/y3fhjrsgn4g4i

Build step 'Invoke Gradle script' changed build result to FAILURE
Build step 'Invoke Gradle script' marked build as failure
Recording test results