You are viewing a plain text version of this content. The canonical link for it is here.
Posted to builds@cassandra.apache.org by Apache Jenkins Server <je...@builds.apache.org> on 2026/06/13 07:35:17 UTC

Build complete: Cassandra-4.1 #653 [UNSTABLE] 1a463d753f0619723c40b07e705b8d2cdefb6c37

-------------------------------------------------------------------------------
Build Cassandra-4.1 #653 Still Unstable
URL: https://ci-cassandra.apache.org/job/Cassandra-4.1/653/
-------------------------------------------------------------------------------
Changes:
[Patrick McFadin] CASSANDRA-21342: Long-tail xref follow-up (cassandra-4.0 subset)


-------------------------------------------------------------------------------
Failed Tests:
10 tests failed.
FAILED:  dtest-novnode.materialized_views_test.TestMaterializedViews.test_drop_table
FAILED:  dtest-offheap.secondary_indexes_test.TestSecondaryIndexes.test_6924_dropping_cf
FAILED:  dtest-upgrade.upgrade_tests.cql_tests.cls.test_whole_map_conditional
FAILED:  dtest-upgrade.upgrade_tests.cql_tests.TestCQLNodes3RF3_Upgrade_indev_4_0_x_To_indev_4_1_x.test_clustering_indexing
FAILED:  dtest.cql_tracing_test.TestCqlTracing.test_tracing_default_impl
FAILED:  org.apache.cassandra.auth.CassandraRoleManagerTest.testPasswordUpdateRateLimitingPerRole-compression
FAILED:  org.apache.cassandra.auth.CassandraRoleManagerTest.testPasswordUpdateRateLimitingPerRole-compression
FAILED:  org.apache.cassandra.cql3.ViewFilteringClustering1Test.testClusteringKeySliceRestrictions[3]
FAILED:  org.apache.cassandra.db.commitlog.CommitLogCQLTest.testSwitchMemtable
FAILED:  org.apache.cassandra.distributed.upgrade.MixedModeReadTest.mixedModeReadColumnSubsetDigestCheck

-------------------------------------------------------------------------------
For complete test report and logs see https://nightlies.apache.org/cassandra/Cassandra-4.1/653/