You are viewing a plain text version of this content. The canonical link for it is here.
Posted to dev@cassandra.apache.org by Apache Jenkins Server <je...@builds.apache.org> on 2012/08/17 15:03:16 UTC

Build failed in Jenkins: Cassandra #1930

See <https://builds.apache.org/job/Cassandra/1930/>

------------------------------------------
Started by an SCM change
Building remotely on ubuntu1 in workspace <https://builds.apache.org/job/Cassandra/ws/>
Checkout:Cassandra / <https://builds.apache.org/job/Cassandra/ws/> - hudson.remoting.Channel@485de4b:ubuntu1
Using strategy: Default
Last Built Revision: Revision 1124615a65329a4991a5a610fa78af56b0502627 (origin/trunk)
Fetching changes from 1 remote Git repository
Fetching upstream changes from https://git-wip-us.apache.org/repos/asf/cassandra.git
Commencing build of Revision 1124615a65329a4991a5a610fa78af56b0502627 (origin/trunk)
Checking out Revision 1124615a65329a4991a5a610fa78af56b0502627 (origin/trunk)
[Cassandra] $ /home/hudson/tools/ant/latest/bin/ant -Dversion=2012-08-17_13-02-04 -Dtest.timeout=90000 -Dcobertura.dir=/usr/share/java clean release test
Buildfile: <https://builds.apache.org/job/Cassandra/ws/build.xml>

clean:
   [delete] Deleting directory <https://builds.apache.org/job/Cassandra/ws/build/test>
   [delete] Deleting directory <https://builds.apache.org/job/Cassandra/ws/build/classes>
   [delete] Deleting directory <https://builds.apache.org/job/Cassandra/ws/src/gen-java>
   [delete] Deleting: <https://builds.apache.org/job/Cassandra/ws/build/internode.avpr>

maven-ant-tasks-localrepo:

maven-ant-tasks-download:

maven-ant-tasks-init:

maven-declare-dependencies:

maven-ant-tasks-retrieve-build:

init-dependencies:
     [echo] Loading dependency paths from file: <https://builds.apache.org/job/Cassandra/ws/build/build-dependencies.xml>

init:
    [mkdir] Created dir: <https://builds.apache.org/job/Cassandra/ws/build/classes/main>
    [mkdir] Created dir: <https://builds.apache.org/job/Cassandra/ws/build/classes/thrift>
    [mkdir] Created dir: <https://builds.apache.org/job/Cassandra/ws/build/test/lib>
    [mkdir] Created dir: <https://builds.apache.org/job/Cassandra/ws/build/test/classes>
    [mkdir] Created dir: <https://builds.apache.org/job/Cassandra/ws/src/gen-java>

check-avro-generate:

avro-interface-generate-internode:
     [echo] Generating Avro internode code...

avro-generate:

build-subprojects:

check-gen-cli-grammar:

gen-cli-grammar:
     [echo] Building Grammar <https://builds.apache.org/job/Cassandra/ws/src/java/org/apache/cassandra/cli/Cli.g>  ....

check-gen-cql2-grammar:

gen-cql2-grammar:
     [echo] Building Grammar <https://builds.apache.org/job/Cassandra/ws/src/java/org/apache/cassandra/cql/Cql.g>  ...

check-gen-cql3-grammar:

gen-cql3-grammar:
     [echo] Building Grammar <https://builds.apache.org/job/Cassandra/ws/src/java/org/apache/cassandra/cql3/Cql.g>  ...

build-project:
     [echo] apache-cassandra: <https://builds.apache.org/job/Cassandra/ws/build.xml>
    [javac] Compiling 40 source files to <https://builds.apache.org/job/Cassandra/ws/build/classes/thrift>
    [javac] Note: Some input files use unchecked or unsafe operations.
    [javac] Note: Recompile with -Xlint:unchecked for details.
    [javac] Compiling 628 source files to <https://builds.apache.org/job/Cassandra/ws/build/classes/main>
    [javac] <https://builds.apache.org/job/Cassandra/ws/src/java/org/apache/cassandra/utils/StreamingHistogram.java>:130: warning: unmappable character for encoding ASCII
    [javac]      * Calculates estimated number of points in interval [-???,b].
    [javac]                                                            ^
    [javac] <https://builds.apache.org/job/Cassandra/ws/src/java/org/apache/cassandra/utils/StreamingHistogram.java>:130: warning: unmappable character for encoding ASCII
    [javac]      * Calculates estimated number of points in interval [-???,b].
    [javac]                                                             ^
    [javac] <https://builds.apache.org/job/Cassandra/ws/src/java/org/apache/cassandra/utils/StreamingHistogram.java>:130: warning: unmappable character for encoding ASCII
    [javac]      * Calculates estimated number of points in interval [-???,b].
    [javac]                                                              ^
    [javac] <https://builds.apache.org/job/Cassandra/ws/src/java/org/apache/cassandra/utils/StreamingHistogram.java>:133: warning: unmappable character for encoding ASCII
    [javac]      * @return estimated number of points in a interval [-???,b].
    [javac]                                                           ^
    [javac] <https://builds.apache.org/job/Cassandra/ws/src/java/org/apache/cassandra/utils/StreamingHistogram.java>:133: warning: unmappable character for encoding ASCII
    [javac]      * @return estimated number of points in a interval [-???,b].
    [javac]                                                            ^
    [javac] <https://builds.apache.org/job/Cassandra/ws/src/java/org/apache/cassandra/utils/StreamingHistogram.java>:133: warning: unmappable character for encoding ASCII
    [javac]      * @return estimated number of points in a interval [-???,b].
    [javac]                                                             ^
    [javac] <https://builds.apache.org/job/Cassandra/ws/src/java/org/apache/cassandra/io/util/Memory.java>:20: warning: sun.misc.Unsafe is Sun proprietary API and may be removed in a future release
    [javac] import sun.misc.Unsafe;
    [javac]                ^
    [javac] <https://builds.apache.org/job/Cassandra/ws/src/java/org/apache/cassandra/io/util/Memory.java>:26: warning: sun.misc.Unsafe is Sun proprietary API and may be removed in a future release
    [javac]     private static final Unsafe unsafe;
    [javac]                          ^
    [javac] <https://builds.apache.org/job/Cassandra/ws/src/java/org/apache/cassandra/utils/FastByteComparisons.java>:25: warning: sun.misc.Unsafe is Sun proprietary API and may be removed in a future release
    [javac] import sun.misc.Unsafe;
    [javac]                ^
    [javac] <https://builds.apache.org/job/Cassandra/ws/src/java/org/apache/cassandra/utils/FastByteComparisons.java>:114: warning: sun.misc.Unsafe is Sun proprietary API and may be removed in a future release
    [javac]       static final Unsafe theUnsafe;
    [javac]                    ^
    [javac] <https://builds.apache.org/job/Cassandra/ws/src/java/org/apache/cassandra/io/util/Memory.java>:32: warning: sun.misc.Unsafe is Sun proprietary API and may be removed in a future release
    [javac]             Field field = sun.misc.Unsafe.class.getDeclaredField("theUnsafe");
    [javac]                                   ^
    [javac] <https://builds.apache.org/job/Cassandra/ws/src/java/org/apache/cassandra/io/util/Memory.java>:34: warning: sun.misc.Unsafe is Sun proprietary API and may be removed in a future release
    [javac]             unsafe = (sun.misc.Unsafe) field.get(null);
    [javac]                               ^
    [javac] <https://builds.apache.org/job/Cassandra/ws/src/java/org/apache/cassandra/service/DatacenterReadCallback.java>:69: method does not override or implement a method from a supertype
    [javac]     @Override
    [javac]     ^
    [javac] <https://builds.apache.org/job/Cassandra/ws/src/java/org/apache/cassandra/utils/FastByteComparisons.java>:120: warning: sun.misc.Unsafe is Sun proprietary API and may be removed in a future release
    [javac]         theUnsafe = (Unsafe) AccessController.doPrivileged(
    [javac]                      ^
    [javac] <https://builds.apache.org/job/Cassandra/ws/src/java/org/apache/cassandra/utils/FastByteComparisons.java>:125: warning: sun.misc.Unsafe is Sun proprietary API and may be removed in a future release
    [javac]                   Field f = Unsafe.class.getDeclaredField("theUnsafe");
    [javac]                             ^
    [javac] Note: Some input files use or override a deprecated API.
    [javac] Note: Recompile with -Xlint:deprecation for details.
    [javac] Note: Some input files use unchecked or unsafe operations.
    [javac] Note: Recompile with -Xlint:unchecked for details.
    [javac] 1 error
    [javac] 14 warnings

BUILD FAILED
<https://builds.apache.org/job/Cassandra/ws/build.xml>:680: Compile failed; see the compiler error output for details.

Total time: 23 seconds
Build step 'Invoke Ant' marked build as failure
[TASKS] Skipping publisher since build result is FAILURE
Archiving artifacts
Recording test results
Publishing Javadoc

Build failed in Jenkins: Cassandra #1932

Posted by Apache Jenkins Server <je...@builds.apache.org>.
See <https://builds.apache.org/job/Cassandra/1932/>

------------------------------------------
Started by an SCM change
Building remotely on ubuntu4 in workspace <https://builds.apache.org/job/Cassandra/ws/>
Checkout:Cassandra / <https://builds.apache.org/job/Cassandra/ws/> - hudson.remoting.Channel@240f40fd:ubuntu4
Using strategy: Default
Last Built Revision: Revision 1124615a65329a4991a5a610fa78af56b0502627 (origin/trunk)
Fetching changes from 1 remote Git repository
Fetching upstream changes from https://git-wip-us.apache.org/repos/asf/cassandra.git
Commencing build of Revision f70945eaa6675ab9382b30eaa24406099a682a7a (origin/trunk)
Checking out Revision f70945eaa6675ab9382b30eaa24406099a682a7a (origin/trunk)
FATAL: Could not apply tag jenkins-Cassandra-1932
hudson.plugins.git.GitException: Could not apply tag jenkins-Cassandra-1932
	at hudson.plugins.git.GitAPI.tag(GitAPI.java:751)
	at hudson.plugins.git.GitSCM$4.invoke(GitSCM.java:1321)
	at hudson.plugins.git.GitSCM$4.invoke(GitSCM.java:1269)
	at hudson.FilePath$FileCallableWrapper.call(FilePath.java:2196)
	at hudson.remoting.UserRequest.perform(UserRequest.java:118)
	at hudson.remoting.UserRequest.perform(UserRequest.java:48)
	at hudson.remoting.Request$2.run(Request.java:326)
	at hudson.remoting.InterceptingExecutorService$1.call(InterceptingExecutorService.java:72)
	at java.util.concurrent.FutureTask$Sync.innerRun(FutureTask.java:334)
	at java.util.concurrent.FutureTask.run(FutureTask.java:166)
	at java.util.concurrent.ThreadPoolExecutor.runWorker(ThreadPoolExecutor.java:1110)
	at java.util.concurrent.ThreadPoolExecutor$Worker.run(ThreadPoolExecutor.java:603)
	at java.lang.Thread.run(Thread.java:679)
Caused by: hudson.plugins.git.GitException: Command "git tag -a -f -m Jenkins Build #1932 jenkins-Cassandra-1932" returned status code 128:
stdout: 
stderr: 
*** Please tell me who you are.

Run

  git config --global user.email "you@example.com"
  git config --global user.name "Your Name"

to set your account's default identity.
Omit --global to set the identity only in this repository.

fatal: empty ident  <jenkins@janus.apache.org
> not allowed

	at hudson.plugins.git.GitAPI.launchCommandIn(GitAPI.java:818)
	at hudson.plugins.git.GitAPI.launchCommand(GitAPI.java:780)
	at hudson.plugins.git.GitAPI.launchCommand(GitAPI.java:790)
	at hudson.plugins.git.GitAPI.tag(GitAPI.java:749)
	... 12 more

Build failed in Jenkins: Cassandra #1931

Posted by Apache Jenkins Server <je...@builds.apache.org>.
See <https://builds.apache.org/job/Cassandra/1931/>

------------------------------------------
Started by an SCM change
Building remotely on ubuntu3 in workspace <https://builds.apache.org/job/Cassandra/ws/>
Checkout:Cassandra / <https://builds.apache.org/job/Cassandra/ws/> - hudson.remoting.Channel@6f4d8192:ubuntu3
Using strategy: Default
Last Built Revision: Revision 1124615a65329a4991a5a610fa78af56b0502627 (origin/trunk)
Fetching changes from 1 remote Git repository
Fetching upstream changes from https://git-wip-us.apache.org/repos/asf/cassandra.git
Commencing build of Revision 1124615a65329a4991a5a610fa78af56b0502627 (origin/trunk)
Checking out Revision 1124615a65329a4991a5a610fa78af56b0502627 (origin/trunk)
[Cassandra] $ /home/hudson/tools/ant/latest/bin/ant -Dversion=2012-08-17_15-01-16 -Dtest.timeout=90000 -Dcobertura.dir=/usr/share/java clean release test
Buildfile: /x1/jenkins/jenkins-slave/workspace/Cassandra/build.xml

clean:
   [delete] Deleting directory /x1/jenkins/jenkins-slave/workspace/Cassandra/build/test
   [delete] Deleting directory /x1/jenkins/jenkins-slave/workspace/Cassandra/build/classes
   [delete] Deleting directory /x1/jenkins/jenkins-slave/workspace/Cassandra/src/gen-java
   [delete] Deleting: /x1/jenkins/jenkins-slave/workspace/Cassandra/build/internode.avpr

maven-ant-tasks-localrepo:

maven-ant-tasks-download:

maven-ant-tasks-init:

maven-declare-dependencies:

maven-ant-tasks-retrieve-build:

init-dependencies:
     [echo] Loading dependency paths from file: /x1/jenkins/jenkins-slave/workspace/Cassandra/build/build-dependencies.xml

init:
    [mkdir] Created dir: /x1/jenkins/jenkins-slave/workspace/Cassandra/build/classes/main
    [mkdir] Created dir: /x1/jenkins/jenkins-slave/workspace/Cassandra/build/classes/thrift
    [mkdir] Created dir: /x1/jenkins/jenkins-slave/workspace/Cassandra/build/test/lib
    [mkdir] Created dir: /x1/jenkins/jenkins-slave/workspace/Cassandra/build/test/classes
    [mkdir] Created dir: /x1/jenkins/jenkins-slave/workspace/Cassandra/src/gen-java

check-avro-generate:

avro-interface-generate-internode:
     [echo] Generating Avro internode code...

avro-generate:

build-subprojects:

check-gen-cli-grammar:

gen-cli-grammar:
     [echo] Building Grammar /x1/jenkins/jenkins-slave/workspace/Cassandra/src/java/org/apache/cassandra/cli/Cli.g  ....

check-gen-cql2-grammar:

gen-cql2-grammar:
     [echo] Building Grammar /x1/jenkins/jenkins-slave/workspace/Cassandra/src/java/org/apache/cassandra/cql/Cql.g  ...

check-gen-cql3-grammar:

gen-cql3-grammar:
     [echo] Building Grammar /x1/jenkins/jenkins-slave/workspace/Cassandra/src/java/org/apache/cassandra/cql3/Cql.g  ...

build-project:
     [echo] apache-cassandra: /x1/jenkins/jenkins-slave/workspace/Cassandra/build.xml
    [javac] Compiling 40 source files to /x1/jenkins/jenkins-slave/workspace/Cassandra/build/classes/thrift
    [javac] Note: Some input files use unchecked or unsafe operations.
    [javac] Note: Recompile with -Xlint:unchecked for details.
    [javac] Compiling 628 source files to /x1/jenkins/jenkins-slave/workspace/Cassandra/build/classes/main
    [javac] /x1/jenkins/jenkins-slave/workspace/Cassandra/src/java/org/apache/cassandra/utils/StreamingHistogram.java:130: warning: unmappable character for encoding ASCII
    [javac]      * Calculates estimated number of points in interval [-???,b].
    [javac]                                                            ^
    [javac] /x1/jenkins/jenkins-slave/workspace/Cassandra/src/java/org/apache/cassandra/utils/StreamingHistogram.java:130: warning: unmappable character for encoding ASCII
    [javac]      * Calculates estimated number of points in interval [-???,b].
    [javac]                                                             ^
    [javac] /x1/jenkins/jenkins-slave/workspace/Cassandra/src/java/org/apache/cassandra/utils/StreamingHistogram.java:130: warning: unmappable character for encoding ASCII
    [javac]      * Calculates estimated number of points in interval [-???,b].
    [javac]                                                              ^
    [javac] /x1/jenkins/jenkins-slave/workspace/Cassandra/src/java/org/apache/cassandra/utils/StreamingHistogram.java:133: warning: unmappable character for encoding ASCII
    [javac]      * @return estimated number of points in a interval [-???,b].
    [javac]                                                           ^
    [javac] /x1/jenkins/jenkins-slave/workspace/Cassandra/src/java/org/apache/cassandra/utils/StreamingHistogram.java:133: warning: unmappable character for encoding ASCII
    [javac]      * @return estimated number of points in a interval [-???,b].
    [javac]                                                            ^
    [javac] /x1/jenkins/jenkins-slave/workspace/Cassandra/src/java/org/apache/cassandra/utils/StreamingHistogram.java:133: warning: unmappable character for encoding ASCII
    [javac]      * @return estimated number of points in a interval [-???,b].
    [javac]                                                             ^
    [javac] /x1/jenkins/jenkins-slave/workspace/Cassandra/src/java/org/apache/cassandra/io/util/Memory.java:20: warning: sun.misc.Unsafe is Sun proprietary API and may be removed in a future release
    [javac] import sun.misc.Unsafe;
    [javac]                ^
    [javac] /x1/jenkins/jenkins-slave/workspace/Cassandra/src/java/org/apache/cassandra/io/util/Memory.java:26: warning: sun.misc.Unsafe is Sun proprietary API and may be removed in a future release
    [javac]     private static final Unsafe unsafe;
    [javac]                          ^
    [javac] /x1/jenkins/jenkins-slave/workspace/Cassandra/src/java/org/apache/cassandra/utils/FastByteComparisons.java:25: warning: sun.misc.Unsafe is Sun proprietary API and may be removed in a future release
    [javac] import sun.misc.Unsafe;
    [javac]                ^
    [javac] /x1/jenkins/jenkins-slave/workspace/Cassandra/src/java/org/apache/cassandra/utils/FastByteComparisons.java:114: warning: sun.misc.Unsafe is Sun proprietary API and may be removed in a future release
    [javac]       static final Unsafe theUnsafe;
    [javac]                    ^
    [javac] /x1/jenkins/jenkins-slave/workspace/Cassandra/src/java/org/apache/cassandra/io/util/Memory.java:32: warning: sun.misc.Unsafe is Sun proprietary API and may be removed in a future release
    [javac]             Field field = sun.misc.Unsafe.class.getDeclaredField("theUnsafe");
    [javac]                                   ^
    [javac] /x1/jenkins/jenkins-slave/workspace/Cassandra/src/java/org/apache/cassandra/io/util/Memory.java:34: warning: sun.misc.Unsafe is Sun proprietary API and may be removed in a future release
    [javac]             unsafe = (sun.misc.Unsafe) field.get(null);
    [javac]                               ^
    [javac] /x1/jenkins/jenkins-slave/workspace/Cassandra/src/java/org/apache/cassandra/service/DatacenterReadCallback.java:69: method does not override or implement a method from a supertype
    [javac]     @Override
    [javac]     ^
    [javac] /x1/jenkins/jenkins-slave/workspace/Cassandra/src/java/org/apache/cassandra/utils/FastByteComparisons.java:120: warning: sun.misc.Unsafe is Sun proprietary API and may be removed in a future release
    [javac]         theUnsafe = (Unsafe) AccessController.doPrivileged(
    [javac]                      ^
    [javac] /x1/jenkins/jenkins-slave/workspace/Cassandra/src/java/org/apache/cassandra/utils/FastByteComparisons.java:125: warning: sun.misc.Unsafe is Sun proprietary API and may be removed in a future release
    [javac]                   Field f = Unsafe.class.getDeclaredField("theUnsafe");
    [javac]                             ^
    [javac] Note: Some input files use or override a deprecated API.
    [javac] Note: Recompile with -Xlint:deprecation for details.
    [javac] Note: Some input files use unchecked or unsafe operations.
    [javac] Note: Recompile with -Xlint:unchecked for details.
    [javac] 1 error
    [javac] 14 warnings

BUILD FAILED
/x1/jenkins/jenkins-slave/workspace/Cassandra/build.xml:680: Compile failed; see the compiler error output for details.

Total time: 20 seconds
Build step 'Invoke Ant' marked build as failure
[TASKS] Skipping publisher since build result is FAILURE
Archiving artifacts
Recording test results
Publishing Javadoc