You are viewing a plain text version of this content. The canonical link for it is here.
Posted to builds@solr.apache.org by Apache Jenkins Server <je...@builds.apache.org> on 2024/09/28 23:43:57 UTC
[JENKINS] Solr » Solr-Check-9.x - Build # 6190 - Failure!
Build: https://ci-builds.apache.org/job/Solr/job/Solr-Check-9.x/6190/
4 tests failed.
FAILED: org.apache.solr.client.solrj.impl.ClusterStateProviderTest.testGetClusterState
Error Message:
java.lang.NullPointerException
Stack Trace:
java.lang.NullPointerException
at __randomizedtesting.SeedInfo.seed([48F1A4A0031C885A:9B5FD0474FC0ADDA]:0)
at org.apache.solr.client.solrj.impl.BaseHttpClusterStateProvider.fetchClusterState(BaseHttpClusterStateProvider.java:143)
at org.apache.solr.client.solrj.impl.BaseHttpClusterStateProvider.getClusterState(BaseHttpClusterStateProvider.java:349)
at org.apache.solr.client.solrj.impl.ClusterStateProviderTest.testGetClusterState(ClusterStateProviderTest.java:71)
at java.base/jdk.internal.reflect.NativeMethodAccessorImpl.invoke0(Native Method)
at java.base/jdk.internal.reflect.NativeMethodAccessorImpl.invoke(NativeMethodAccessorImpl.java:62)
at java.base/jdk.internal.reflect.DelegatingMethodAccessorImpl.invoke(DelegatingMethodAccessorImpl.java:43)
at java.base/java.lang.reflect.Method.invoke(Method.java:566)
at com.carrotsearch.randomizedtesting.RandomizedRunner.invoke(RandomizedRunner.java:1758)
at com.carrotsearch.randomizedtesting.RandomizedRunner$8.evaluate(RandomizedRunner.java:946)
at com.carrotsearch.randomizedtesting.RandomizedRunner$9.evaluate(RandomizedRunner.java:982)
at com.carrotsearch.randomizedtesting.RandomizedRunner$10.evaluate(RandomizedRunner.java:996)
at com.carrotsearch.randomizedtesting.rules.SystemPropertiesRestoreRule$1.evaluate(SystemPropertiesRestoreRule.java:80)
at org.junit.rules.RunRules.evaluate(RunRules.java:20)
at org.apache.lucene.tests.util.TestRuleSetupTeardownChained$1.evaluate(TestRuleSetupTeardownChained.java:48)
at org.apache.lucene.tests.util.AbstractBeforeAfterRule$1.evaluate(AbstractBeforeAfterRule.java:43)
at org.apache.lucene.tests.util.TestRuleThreadAndTestName$1.evaluate(TestRuleThreadAndTestName.java:45)
at org.apache.lucene.tests.util.TestRuleIgnoreAfterMaxFailures$1.evaluate(TestRuleIgnoreAfterMaxFailures.java:60)
at org.apache.lucene.tests.util.TestRuleMarkFailure$1.evaluate(TestRuleMarkFailure.java:44)
at org.junit.rules.RunRules.evaluate(RunRules.java:20)
at com.carrotsearch.randomizedtesting.rules.StatementAdapter.evaluate(StatementAdapter.java:36)
at com.carrotsearch.randomizedtesting.ThreadLeakControl$StatementRunner.run(ThreadLeakControl.java:390)
at com.carrotsearch.randomizedtesting.ThreadLeakControl.forkTimeoutingTask(ThreadLeakControl.java:843)
at com.carrotsearch.randomizedtesting.ThreadLeakControl$3.evaluate(ThreadLeakControl.java:490)
at com.carrotsearch.randomizedtesting.RandomizedRunner.runSingleTest(RandomizedRunner.java:955)
at com.carrotsearch.randomizedtesting.RandomizedRunner$5.evaluate(RandomizedRunner.java:840)
at com.carrotsearch.randomizedtesting.RandomizedRunner$6.evaluate(RandomizedRunner.java:891)
at com.carrotsearch.randomizedtesting.RandomizedRunner$7.evaluate(RandomizedRunner.java:902)
at com.carrotsearch.randomizedtesting.rules.StatementAdapter.evaluate(StatementAdapter.java:36)
at com.carrotsearch.randomizedtesting.rules.StatementAdapter.evaluate(StatementAdapter.java:36)
at org.apache.lucene.tests.util.AbstractBeforeAfterRule$1.evaluate(AbstractBeforeAfterRule.java:43)
at org.apache.lucene.tests.util.AbstractBeforeAfterRule$1.evaluate(AbstractBeforeAfterRule.java:43)
at com.carrotsearch.randomizedtesting.rules.SystemPropertiesRestoreRule$1.evaluate(SystemPropertiesRestoreRule.java:80)
at org.junit.rules.RunRules.evaluate(RunRules.java:20)
at org.apache.lucene.tests.util.AbstractBeforeAfterRule$1.evaluate(AbstractBeforeAfterRule.java:43)
at com.carrotsearch.randomizedtesting.rules.StatementAdapter.evaluate(StatementAdapter.java:36)
at org.apache.lucene.tests.util.TestRuleStoreClassName$1.evaluate(TestRuleStoreClassName.java:38)
at com.carrotsearch.randomizedtesting.rules.NoShadowingOrOverridesOnMethodsRule$1.evaluate(NoShadowingOrOverridesOnMethodsRule.java:40)
at com.carrotsearch.randomizedtesting.rules.NoShadowingOrOverridesOnMethodsRule$1.evaluate(NoShadowingOrOverridesOnMethodsRule.java:40)
at com.carrotsearch.randomizedtesting.rules.StatementAdapter.evaluate(StatementAdapter.java:36)
at com.carrotsearch.randomizedtesting.rules.StatementAdapter.evaluate(StatementAdapter.java:36)
at org.apache.lucene.tests.util.TestRuleAssertionsRequired$1.evaluate(TestRuleAssertionsRequired.java:53)
at org.apache.lucene.tests.util.AbstractBeforeAfterRule$1.evaluate(AbstractBeforeAfterRule.java:43)
at org.apache.lucene.tests.util.TestRuleMarkFailure$1.evaluate(TestRuleMarkFailure.java:44)
at org.apache.lucene.tests.util.TestRuleIgnoreAfterMaxFailures$1.evaluate(TestRuleIgnoreAfterMaxFailures.java:60)
at org.apache.lucene.tests.util.TestRuleIgnoreTestSuites$1.evaluate(TestRuleIgnoreTestSuites.java:47)
at org.junit.rules.RunRules.evaluate(RunRules.java:20)
at com.carrotsearch.randomizedtesting.rules.StatementAdapter.evaluate(StatementAdapter.java:36)
at com.carrotsearch.randomizedtesting.ThreadLeakControl$StatementRunner.run(ThreadLeakControl.java:390)
at com.carrotsearch.randomizedtesting.ThreadLeakControl.lambda$forkTimeoutingTask$0(ThreadLeakControl.java:850)
at java.base/java.lang.Thread.run(Thread.java:829)
FAILED: org.apache.solr.client.solrj.impl.ClusterStateProviderTest.testGetClusterState
Error Message:
java.lang.NullPointerException
Stack Trace:
java.lang.NullPointerException
at __randomizedtesting.SeedInfo.seed([48F1A4A0031C885A:9B5FD0474FC0ADDA]:0)
at org.apache.solr.client.solrj.impl.BaseHttpClusterStateProvider.fetchClusterState(BaseHttpClusterStateProvider.java:143)
at org.apache.solr.client.solrj.impl.BaseHttpClusterStateProvider.getClusterState(BaseHttpClusterStateProvider.java:349)
at org.apache.solr.client.solrj.impl.ClusterStateProviderTest.testGetClusterState(ClusterStateProviderTest.java:71)
at java.base/jdk.internal.reflect.NativeMethodAccessorImpl.invoke0(Native Method)
at java.base/jdk.internal.reflect.NativeMethodAccessorImpl.invoke(NativeMethodAccessorImpl.java:62)
at java.base/jdk.internal.reflect.DelegatingMethodAccessorImpl.invoke(DelegatingMethodAccessorImpl.java:43)
at java.base/java.lang.reflect.Method.invoke(Method.java:566)
at com.carrotsearch.randomizedtesting.RandomizedRunner.invoke(RandomizedRunner.java:1758)
at com.carrotsearch.randomizedtesting.RandomizedRunner$8.evaluate(RandomizedRunner.java:946)
at com.carrotsearch.randomizedtesting.RandomizedRunner$9.evaluate(RandomizedRunner.java:982)
at com.carrotsearch.randomizedtesting.RandomizedRunner$10.evaluate(RandomizedRunner.java:996)
at com.carrotsearch.randomizedtesting.rules.SystemPropertiesRestoreRule$1.evaluate(SystemPropertiesRestoreRule.java:80)
at org.junit.rules.RunRules.evaluate(RunRules.java:20)
at org.apache.lucene.tests.util.TestRuleSetupTeardownChained$1.evaluate(TestRuleSetupTeardownChained.java:48)
at org.apache.lucene.tests.util.AbstractBeforeAfterRule$1.evaluate(AbstractBeforeAfterRule.java:43)
at org.apache.lucene.tests.util.TestRuleThreadAndTestName$1.evaluate(TestRuleThreadAndTestName.java:45)
at org.apache.lucene.tests.util.TestRuleIgnoreAfterMaxFailures$1.evaluate(TestRuleIgnoreAfterMaxFailures.java:60)
at org.apache.lucene.tests.util.TestRuleMarkFailure$1.evaluate(TestRuleMarkFailure.java:44)
at org.junit.rules.RunRules.evaluate(RunRules.java:20)
at com.carrotsearch.randomizedtesting.rules.StatementAdapter.evaluate(StatementAdapter.java:36)
at com.carrotsearch.randomizedtesting.ThreadLeakControl$StatementRunner.run(ThreadLeakControl.java:390)
at com.carrotsearch.randomizedtesting.ThreadLeakControl.forkTimeoutingTask(ThreadLeakControl.java:843)
at com.carrotsearch.randomizedtesting.ThreadLeakControl$3.evaluate(ThreadLeakControl.java:490)
at com.carrotsearch.randomizedtesting.RandomizedRunner.runSingleTest(RandomizedRunner.java:955)
at com.carrotsearch.randomizedtesting.RandomizedRunner$5.evaluate(RandomizedRunner.java:840)
at com.carrotsearch.randomizedtesting.RandomizedRunner$6.evaluate(RandomizedRunner.java:891)
at com.carrotsearch.randomizedtesting.RandomizedRunner$7.evaluate(RandomizedRunner.java:902)
at com.carrotsearch.randomizedtesting.rules.StatementAdapter.evaluate(StatementAdapter.java:36)
at com.carrotsearch.randomizedtesting.rules.StatementAdapter.evaluate(StatementAdapter.java:36)
at org.apache.lucene.tests.util.AbstractBeforeAfterRule$1.evaluate(AbstractBeforeAfterRule.java:43)
at org.apache.lucene.tests.util.AbstractBeforeAfterRule$1.evaluate(AbstractBeforeAfterRule.java:43)
at com.carrotsearch.randomizedtesting.rules.SystemPropertiesRestoreRule$1.evaluate(SystemPropertiesRestoreRule.java:80)
at org.junit.rules.RunRules.evaluate(RunRules.java:20)
at org.apache.lucene.tests.util.AbstractBeforeAfterRule$1.evaluate(AbstractBeforeAfterRule.java:43)
at com.carrotsearch.randomizedtesting.rules.StatementAdapter.evaluate(StatementAdapter.java:36)
at org.apache.lucene.tests.util.TestRuleStoreClassName$1.evaluate(TestRuleStoreClassName.java:38)
at com.carrotsearch.randomizedtesting.rules.NoShadowingOrOverridesOnMethodsRule$1.evaluate(NoShadowingOrOverridesOnMethodsRule.java:40)
at com.carrotsearch.randomizedtesting.rules.NoShadowingOrOverridesOnMethodsRule$1.evaluate(NoShadowingOrOverridesOnMethodsRule.java:40)
at com.carrotsearch.randomizedtesting.rules.StatementAdapter.evaluate(StatementAdapter.java:36)
at com.carrotsearch.randomizedtesting.rules.StatementAdapter.evaluate(StatementAdapter.java:36)
at org.apache.lucene.tests.util.TestRuleAssertionsRequired$1.evaluate(TestRuleAssertionsRequired.java:53)
at org.apache.lucene.tests.util.AbstractBeforeAfterRule$1.evaluate(AbstractBeforeAfterRule.java:43)
at org.apache.lucene.tests.util.TestRuleMarkFailure$1.evaluate(TestRuleMarkFailure.java:44)
at org.apache.lucene.tests.util.TestRuleIgnoreAfterMaxFailures$1.evaluate(TestRuleIgnoreAfterMaxFailures.java:60)
at org.apache.lucene.tests.util.TestRuleIgnoreTestSuites$1.evaluate(TestRuleIgnoreTestSuites.java:47)
at org.junit.rules.RunRules.evaluate(RunRules.java:20)
at com.carrotsearch.randomizedtesting.rules.StatementAdapter.evaluate(StatementAdapter.java:36)
at com.carrotsearch.randomizedtesting.ThreadLeakControl$StatementRunner.run(ThreadLeakControl.java:390)
at com.carrotsearch.randomizedtesting.ThreadLeakControl.lambda$forkTimeoutingTask$0(ThreadLeakControl.java:850)
at java.base/java.lang.Thread.run(Thread.java:829)
FAILED: org.apache.solr.client.solrj.impl.ClusterStateProviderTest.testGetClusterState
Error Message:
java.lang.NullPointerException
Stack Trace:
java.lang.NullPointerException
at __randomizedtesting.SeedInfo.seed([48F1A4A0031C885A:9B5FD0474FC0ADDA]:0)
at org.apache.solr.client.solrj.impl.BaseHttpClusterStateProvider.fetchClusterState(BaseHttpClusterStateProvider.java:143)
at org.apache.solr.client.solrj.impl.BaseHttpClusterStateProvider.getClusterState(BaseHttpClusterStateProvider.java:349)
at org.apache.solr.client.solrj.impl.ClusterStateProviderTest.testGetClusterState(ClusterStateProviderTest.java:71)
at java.base/jdk.internal.reflect.NativeMethodAccessorImpl.invoke0(Native Method)
at java.base/jdk.internal.reflect.NativeMethodAccessorImpl.invoke(NativeMethodAccessorImpl.java:62)
at java.base/jdk.internal.reflect.DelegatingMethodAccessorImpl.invoke(DelegatingMethodAccessorImpl.java:43)
at java.base/java.lang.reflect.Method.invoke(Method.java:566)
at com.carrotsearch.randomizedtesting.RandomizedRunner.invoke(RandomizedRunner.java:1758)
at com.carrotsearch.randomizedtesting.RandomizedRunner$8.evaluate(RandomizedRunner.java:946)
at com.carrotsearch.randomizedtesting.RandomizedRunner$9.evaluate(RandomizedRunner.java:982)
at com.carrotsearch.randomizedtesting.RandomizedRunner$10.evaluate(RandomizedRunner.java:996)
at com.carrotsearch.randomizedtesting.rules.SystemPropertiesRestoreRule$1.evaluate(SystemPropertiesRestoreRule.java:80)
at org.junit.rules.RunRules.evaluate(RunRules.java:20)
at org.apache.lucene.tests.util.TestRuleSetupTeardownChained$1.evaluate(TestRuleSetupTeardownChained.java:48)
at org.apache.lucene.tests.util.AbstractBeforeAfterRule$1.evaluate(AbstractBeforeAfterRule.java:43)
at org.apache.lucene.tests.util.TestRuleThreadAndTestName$1.evaluate(TestRuleThreadAndTestName.java:45)
at org.apache.lucene.tests.util.TestRuleIgnoreAfterMaxFailures$1.evaluate(TestRuleIgnoreAfterMaxFailures.java:60)
at org.apache.lucene.tests.util.TestRuleMarkFailure$1.evaluate(TestRuleMarkFailure.java:44)
at org.junit.rules.RunRules.evaluate(RunRules.java:20)
at com.carrotsearch.randomizedtesting.rules.StatementAdapter.evaluate(StatementAdapter.java:36)
at com.carrotsearch.randomizedtesting.ThreadLeakControl$StatementRunner.run(ThreadLeakControl.java:390)
at com.carrotsearch.randomizedtesting.ThreadLeakControl.forkTimeoutingTask(ThreadLeakControl.java:843)
at com.carrotsearch.randomizedtesting.ThreadLeakControl$3.evaluate(ThreadLeakControl.java:490)
at com.carrotsearch.randomizedtesting.RandomizedRunner.runSingleTest(RandomizedRunner.java:955)
at com.carrotsearch.randomizedtesting.RandomizedRunner$5.evaluate(RandomizedRunner.java:840)
at com.carrotsearch.randomizedtesting.RandomizedRunner$6.evaluate(RandomizedRunner.java:891)
at com.carrotsearch.randomizedtesting.RandomizedRunner$7.evaluate(RandomizedRunner.java:902)
at com.carrotsearch.randomizedtesting.rules.StatementAdapter.evaluate(StatementAdapter.java:36)
at com.carrotsearch.randomizedtesting.rules.StatementAdapter.evaluate(StatementAdapter.java:36)
at org.apache.lucene.tests.util.AbstractBeforeAfterRule$1.evaluate(AbstractBeforeAfterRule.java:43)
at org.apache.lucene.tests.util.AbstractBeforeAfterRule$1.evaluate(AbstractBeforeAfterRule.java:43)
at com.carrotsearch.randomizedtesting.rules.SystemPropertiesRestoreRule$1.evaluate(SystemPropertiesRestoreRule.java:80)
at org.junit.rules.RunRules.evaluate(RunRules.java:20)
at org.apache.lucene.tests.util.AbstractBeforeAfterRule$1.evaluate(AbstractBeforeAfterRule.java:43)
at com.carrotsearch.randomizedtesting.rules.StatementAdapter.evaluate(StatementAdapter.java:36)
at org.apache.lucene.tests.util.TestRuleStoreClassName$1.evaluate(TestRuleStoreClassName.java:38)
at com.carrotsearch.randomizedtesting.rules.NoShadowingOrOverridesOnMethodsRule$1.evaluate(NoShadowingOrOverridesOnMethodsRule.java:40)
at com.carrotsearch.randomizedtesting.rules.NoShadowingOrOverridesOnMethodsRule$1.evaluate(NoShadowingOrOverridesOnMethodsRule.java:40)
at com.carrotsearch.randomizedtesting.rules.StatementAdapter.evaluate(StatementAdapter.java:36)
at com.carrotsearch.randomizedtesting.rules.StatementAdapter.evaluate(StatementAdapter.java:36)
at org.apache.lucene.tests.util.TestRuleAssertionsRequired$1.evaluate(TestRuleAssertionsRequired.java:53)
at org.apache.lucene.tests.util.AbstractBeforeAfterRule$1.evaluate(AbstractBeforeAfterRule.java:43)
at org.apache.lucene.tests.util.TestRuleMarkFailure$1.evaluate(TestRuleMarkFailure.java:44)
at org.apache.lucene.tests.util.TestRuleIgnoreAfterMaxFailures$1.evaluate(TestRuleIgnoreAfterMaxFailures.java:60)
at org.apache.lucene.tests.util.TestRuleIgnoreTestSuites$1.evaluate(TestRuleIgnoreTestSuites.java:47)
at org.junit.rules.RunRules.evaluate(RunRules.java:20)
at com.carrotsearch.randomizedtesting.rules.StatementAdapter.evaluate(StatementAdapter.java:36)
at com.carrotsearch.randomizedtesting.ThreadLeakControl$StatementRunner.run(ThreadLeakControl.java:390)
at com.carrotsearch.randomizedtesting.ThreadLeakControl.lambda$forkTimeoutingTask$0(ThreadLeakControl.java:850)
at java.base/java.lang.Thread.run(Thread.java:829)
FAILED: org.apache.solr.client.solrj.impl.ClusterStateProviderTest.testGetClusterState
Error Message:
java.lang.NullPointerException
Stack Trace:
java.lang.NullPointerException
at __randomizedtesting.SeedInfo.seed([48F1A4A0031C885A:9B5FD0474FC0ADDA]:0)
at org.apache.solr.client.solrj.impl.BaseHttpClusterStateProvider.fetchClusterState(BaseHttpClusterStateProvider.java:143)
at org.apache.solr.client.solrj.impl.BaseHttpClusterStateProvider.getClusterState(BaseHttpClusterStateProvider.java:349)
at org.apache.solr.client.solrj.impl.ClusterStateProviderTest.testGetClusterState(ClusterStateProviderTest.java:71)
at java.base/jdk.internal.reflect.NativeMethodAccessorImpl.invoke0(Native Method)
at java.base/jdk.internal.reflect.NativeMethodAccessorImpl.invoke(NativeMethodAccessorImpl.java:62)
at java.base/jdk.internal.reflect.DelegatingMethodAccessorImpl.invoke(DelegatingMethodAccessorImpl.java:43)
at java.base/java.lang.reflect.Method.invoke(Method.java:566)
at com.carrotsearch.randomizedtesting.RandomizedRunner.invoke(RandomizedRunner.java:1758)
at com.carrotsearch.randomizedtesting.RandomizedRunner$8.evaluate(RandomizedRunner.java:946)
at com.carrotsearch.randomizedtesting.RandomizedRunner$9.evaluate(RandomizedRunner.java:982)
at com.carrotsearch.randomizedtesting.RandomizedRunner$10.evaluate(RandomizedRunner.java:996)
at com.carrotsearch.randomizedtesting.rules.SystemPropertiesRestoreRule$1.evaluate(SystemPropertiesRestoreRule.java:80)
at org.junit.rules.RunRules.evaluate(RunRules.java:20)
at org.apache.lucene.tests.util.TestRuleSetupTeardownChained$1.evaluate(TestRuleSetupTeardownChained.java:48)
at org.apache.lucene.tests.util.AbstractBeforeAfterRule$1.evaluate(AbstractBeforeAfterRule.java:43)
at org.apache.lucene.tests.util.TestRuleThreadAndTestName$1.evaluate(TestRuleThreadAndTestName.java:45)
at org.apache.lucene.tests.util.TestRuleIgnoreAfterMaxFailures$1.evaluate(TestRuleIgnoreAfterMaxFailures.java:60)
at org.apache.lucene.tests.util.TestRuleMarkFailure$1.evaluate(TestRuleMarkFailure.java:44)
at org.junit.rules.RunRules.evaluate(RunRules.java:20)
at com.carrotsearch.randomizedtesting.rules.StatementAdapter.evaluate(StatementAdapter.java:36)
at com.carrotsearch.randomizedtesting.ThreadLeakControl$StatementRunner.run(ThreadLeakControl.java:390)
at com.carrotsearch.randomizedtesting.ThreadLeakControl.forkTimeoutingTask(ThreadLeakControl.java:843)
at com.carrotsearch.randomizedtesting.ThreadLeakControl$3.evaluate(ThreadLeakControl.java:490)
at com.carrotsearch.randomizedtesting.RandomizedRunner.runSingleTest(RandomizedRunner.java:955)
at com.carrotsearch.randomizedtesting.RandomizedRunner$5.evaluate(RandomizedRunner.java:840)
at com.carrotsearch.randomizedtesting.RandomizedRunner$6.evaluate(RandomizedRunner.java:891)
at com.carrotsearch.randomizedtesting.RandomizedRunner$7.evaluate(RandomizedRunner.java:902)
at com.carrotsearch.randomizedtesting.rules.StatementAdapter.evaluate(StatementAdapter.java:36)
at com.carrotsearch.randomizedtesting.rules.StatementAdapter.evaluate(StatementAdapter.java:36)
at org.apache.lucene.tests.util.AbstractBeforeAfterRule$1.evaluate(AbstractBeforeAfterRule.java:43)
at org.apache.lucene.tests.util.AbstractBeforeAfterRule$1.evaluate(AbstractBeforeAfterRule.java:43)
at com.carrotsearch.randomizedtesting.rules.SystemPropertiesRestoreRule$1.evaluate(SystemPropertiesRestoreRule.java:80)
at org.junit.rules.RunRules.evaluate(RunRules.java:20)
at org.apache.lucene.tests.util.AbstractBeforeAfterRule$1.evaluate(AbstractBeforeAfterRule.java:43)
at com.carrotsearch.randomizedtesting.rules.StatementAdapter.evaluate(StatementAdapter.java:36)
at org.apache.lucene.tests.util.TestRuleStoreClassName$1.evaluate(TestRuleStoreClassName.java:38)
at com.carrotsearch.randomizedtesting.rules.NoShadowingOrOverridesOnMethodsRule$1.evaluate(NoShadowingOrOverridesOnMethodsRule.java:40)
at com.carrotsearch.randomizedtesting.rules.NoShadowingOrOverridesOnMethodsRule$1.evaluate(NoShadowingOrOverridesOnMethodsRule.java:40)
at com.carrotsearch.randomizedtesting.rules.StatementAdapter.evaluate(StatementAdapter.java:36)
at com.carrotsearch.randomizedtesting.rules.StatementAdapter.evaluate(StatementAdapter.java:36)
at org.apache.lucene.tests.util.TestRuleAssertionsRequired$1.evaluate(TestRuleAssertionsRequired.java:53)
at org.apache.lucene.tests.util.AbstractBeforeAfterRule$1.evaluate(AbstractBeforeAfterRule.java:43)
at org.apache.lucene.tests.util.TestRuleMarkFailure$1.evaluate(TestRuleMarkFailure.java:44)
at org.apache.lucene.tests.util.TestRuleIgnoreAfterMaxFailures$1.evaluate(TestRuleIgnoreAfterMaxFailures.java:60)
at org.apache.lucene.tests.util.TestRuleIgnoreTestSuites$1.evaluate(TestRuleIgnoreTestSuites.java:47)
at org.junit.rules.RunRules.evaluate(RunRules.java:20)
at com.carrotsearch.randomizedtesting.rules.StatementAdapter.evaluate(StatementAdapter.java:36)
at com.carrotsearch.randomizedtesting.ThreadLeakControl$StatementRunner.run(ThreadLeakControl.java:390)
at com.carrotsearch.randomizedtesting.ThreadLeakControl.lambda$forkTimeoutingTask$0(ThreadLeakControl.java:850)
at java.base/java.lang.Thread.run(Thread.java:829)
Build Log:
[...truncated 2876 lines...]
# ERROR: --version is not supported by this script
#
#
# Usage: solr start [-f] [-c] [--host host] [-p port] [-d directory] [-z zkHost] [-m memory] [-e example] [-s solr.solr.home] [-t solr.data.home] [--jvm-opts "jvm-opts"] [-V]
#
# -f Start Solr in foreground; default starts Solr in the background
# and sends stdout / stderr to solr-PORT-console.log
#
# -c or --cloud Start Solr in SolrCloud mode; if -z not supplied and ZK_HOST not defined in
# solr.in.sh, an embedded ZooKeeper instance is started on Solr port+1000,
# such as 9983 if Solr is bound to 8983
#
# --host <host> Specify the hostname for this Solr instance
#
# -p/--port <port> Specify the port to start the Solr HTTP listener on; default is 8983
# The specified port (SOLR_PORT) will also be used to determine the stop port
# STOP_PORT=($SOLR_PORT-1000) and JMX RMI listen port RMI_PORT=($SOLR_PORT+10000).
# For instance, if you set -p 8985, then the STOP_PORT=7985 and RMI_PORT=18985
#
# -d <dir> Specify the Solr server directory; defaults to server
#
# -z/--zk-host <zkHost> Zookeeper connection string; only used when running in SolrCloud mode using -c
# If neither ZK_HOST is defined in solr.in.sh nor the -z parameter is specified,
# an embedded ZooKeeper instance will be launched.
# Set the ZK_CREATE_CHROOT environment variable to true if your ZK host has a chroot path, and you want to create it automatically.
#
# -m/--memory <memory> Sets the min (-Xms) and max (-Xmx) heap size for the JVM, such as: -m 4g
# results in: -Xms4g -Xmx4g; by default, this script sets the heap size to 512m
#
# -s <dir> Sets the solr.solr.home system property; Solr will create core directories under
# this directory. This allows you to run multiple Solr instances on the same host
# while reusing the same server directory set using the -d parameter. If set, the
# specified directory should contain a solr.xml file, unless solr.xml exists in Zookeeper.
# This parameter is ignored when running examples (-e), as the solr.solr.home depends
# on which example is run. The default value is server/solr. If passed relative dir,
# validation with current dir will be done, before trying default server/<dir>
#
# -t/--data-home <dir> Sets the solr.data.home system property, where Solr will store index data in <instance_dir>/data subdirectories.
# If not set, Solr uses solr.solr.home for config and data.
#
# -e <example> Name of the example to run; available examples:
# cloud: SolrCloud example
# techproducts: Comprehensive example illustrating many of Solr's core capabilities
# schemaless: Schema-less example (schema is inferred from data during indexing)
# films: Example of starting with _default configset and adding explicit fields dynamically
#
# --jvm-opts <jvmParams> Additional parameters to pass to the JVM when starting Solr, such as to setup
# Java debug options. For example, to enable a Java debugger to attach to the Solr JVM
# you could pass: --jvm-opts "-agentlib:jdwp=transport=dt_socket,server=y,suspend=n,address=18983"
# In most cases, you should wrap the additional parameters in double quotes.
#
# -j <jettyParams> Additional parameters to pass to Jetty when starting Solr.
# For example, to add configuration folder that jetty should read
# you could pass: -j "--include-jetty-dir=/etc/jetty/custom/server/"
# In most cases, you should wrap the additional parameters in double quotes.
#
# --no-prompt Don't prompt for input; accept all defaults when running examples that accept user input
#
# --force If attempting to start Solr as the root user, the script will exit with a warning that running Solr as "root" can cause problems.
# It is possible to override this warning with the '--force' parameter.
#
# --verbose or --quiet/-q Verbose or quiet logging. Sets default log level of Solr to DEBUG or WARN instead of INFO
# --
#
# Last output:
#
# ERROR: --version is not supported by this script
#
#
# Usage: solr start [-f] [-c] [--host host] [-p port] [-d directory] [-z zkHost] [-m memory] [-e example] [-s solr.solr.home] [-t solr.data.home] [--jvm-opts "jvm-opts"] [-V]
#
# -f Start Solr in foreground; default starts Solr in the background
# and sends stdout / stderr to solr-PORT-console.log
#
# -c or --cloud Start Solr in SolrCloud mode; if -z not supplied and ZK_HOST not defined in
# solr.in.sh, an embedded ZooKeeper instance is started on Solr port+1000,
# such as 9983 if Solr is bound to 8983
#
# --host <host> Specify the hostname for this Solr instance
#
# -p/--port <port> Specify the port to start the Solr HTTP listener on; default is 8983
# The specified port (SOLR_PORT) will also be used to determine the stop port
# STOP_PORT=($SOLR_PORT-1000) and JMX RMI listen port RMI_PORT=($SOLR_PORT+10000).
# For instance, if you set -p 8985, then the STOP_PORT=7985 and RMI_PORT=18985
#
# -d <dir> Specify the Solr server directory; defaults to server
#
# -z/--zk-host <zkHost> Zookeeper connection string; only used when running in SolrCloud mode using -c
# If neither ZK_HOST is defined in solr.in.sh nor the -z parameter is specified,
# an embedded ZooKeeper instance will be launched.
# Set the ZK_CREATE_CHROOT environment variable to true if your ZK host has a chroot path, and you want to create it automatically.
#
# -m/--memory <memory> Sets the min (-Xms) and max (-Xmx) heap size for the JVM, such as: -m 4g
# results in: -Xms4g -Xmx4g; by default, this script sets the heap size to 512m
#
# -s <dir> Sets the solr.solr.home system property; Solr will create core directories under
# this directory. This allows you to run multiple Solr instances on the same host
# while reusing the same server directory set using the -d parameter. If set, the
# specified directory should contain a solr.xml file, unless solr.xml exists in Zookeeper.
# This parameter is ignored when running examples (-e), as the solr.solr.home depends
# on which example is run. The default value is server/solr. If passed relative dir,
# validation with current dir will be done, before trying default server/<dir>
#
# -t/--data-home <dir> Sets the solr.data.home system property, where Solr will store index data in <instance_dir>/data subdirectories.
# If not set, Solr uses solr.solr.home for config and data.
#
# -e <example> Name of the example to run; available examples:
# cloud: SolrCloud example
# techproducts: Comprehensive example illustrating many of Solr's core capabilities
# schemaless: Schema-less example (schema is inferred from data during indexing)
# films: Example of starting with _default configset and adding explicit fields dynamically
#
# --jvm-opts <jvmParams> Additional parameters to pass to the JVM when starting Solr, such as to setup
# Java debug options. For example, to enable a Java debugger to attach to the Solr JVM
# you could pass: --jvm-opts "-agentlib:jdwp=transport=dt_socket,server=y,suspend=n,address=18983"
# In most cases, you should wrap the additional parameters in double quotes.
#
# -j <jettyParams> Additional parameters to pass to Jetty when starting Solr.
# For example, to add configuration folder that jetty should read
# you could pass: -j "--include-jetty-dir=/etc/jetty/custom/server/"
# In most cases, you should wrap the additional parameters in double quotes.
#
# --no-prompt Don't prompt for input; accept all defaults when running examples that accept user input
#
# --force If attempting to start Solr as the root user, the script will exit with a warning that running Solr as "root" can cause problems.
# It is possible to override this warning with the '--force' parameter.
#
# --verbose or --quiet/-q Verbose or quiet logging. Sets default log level of Solr to DEBUG or WARN instead of INFO
not ok 87 -version and version both return Solr version and deprecation # in 492 ms
# (from function `assert_output' in file /home/jenkins/jenkins-slave/workspace/Solr/Solr-Check-9.x/.gradle/node/packaging/node_modules/bats-assert/src/assert.bash, line 247,
# in test file test/test_version.bats, line 35)
# `assert_output --partial "Solr version is:"' failed
#
# -- output does not contain substring --
# substring (1 lines):
# Solr version is:
# output (63 lines):
#
# ERROR: -version is not supported by this script
#
#
# Usage: solr start [-f] [-c] [--host host] [-p port] [-d directory] [-z zkHost] [-m memory] [-e example] [-s solr.solr.home] [-t solr.data.home] [--jvm-opts "jvm-opts"] [-V]
#
# -f Start Solr in foreground; default starts Solr in the background
# and sends stdout / stderr to solr-PORT-console.log
#
# -c or --cloud Start Solr in SolrCloud mode; if -z not supplied and ZK_HOST not defined in
# solr.in.sh, an embedded ZooKeeper instance is started on Solr port+1000,
# such as 9983 if Solr is bound to 8983
#
# --host <host> Specify the hostname for this Solr instance
#
# -p/--port <port> Specify the port to start the Solr HTTP listener on; default is 8983
# The specified port (SOLR_PORT) will also be used to determine the stop port
# STOP_PORT=($SOLR_PORT-1000) and JMX RMI listen port RMI_PORT=($SOLR_PORT+10000).
# For instance, if you set -p 8985, then the STOP_PORT=7985 and RMI_PORT=18985
#
# -d <dir> Specify the Solr server directory; defaults to server
#
# -z/--zk-host <zkHost> Zookeeper connection string; only used when running in SolrCloud mode using -c
# If neither ZK_HOST is defined in solr.in.sh nor the -z parameter is specified,
# an embedded ZooKeeper instance will be launched.
# Set the ZK_CREATE_CHROOT environment variable to true if your ZK host has a chroot path, and you want to create it automatically.
#
# -m/--memory <memory> Sets the min (-Xms) and max (-Xmx) heap size for the JVM, such as: -m 4g
# results in: -Xms4g -Xmx4g; by default, this script sets the heap size to 512m
#
# -s <dir> Sets the solr.solr.home system property; Solr will create core directories under
# this directory. This allows you to run multiple Solr instances on the same host
# while reusing the same server directory set using the -d parameter. If set, the
# specified directory should contain a solr.xml file, unless solr.xml exists in Zookeeper.
# This parameter is ignored when running examples (-e), as the solr.solr.home depends
# on which example is run. The default value is server/solr. If passed relative dir,
# validation with current dir will be done, before trying default server/<dir>
#
# -t/--data-home <dir> Sets the solr.data.home system property, where Solr will store index data in <instance_dir>/data subdirectories.
# If not set, Solr uses solr.solr.home for config and data.
#
# -e <example> Name of the example to run; available examples:
# cloud: SolrCloud example
# techproducts: Comprehensive example illustrating many of Solr's core capabilities
# schemaless: Schema-less example (schema is inferred from data during indexing)
# films: Example of starting with _default configset and adding explicit fields dynamically
#
# --jvm-opts <jvmParams> Additional parameters to pass to the JVM when starting Solr, such as to setup
# Java debug options. For example, to enable a Java debugger to attach to the Solr JVM
# you could pass: --jvm-opts "-agentlib:jdwp=transport=dt_socket,server=y,suspend=n,address=18983"
# In most cases, you should wrap the additional parameters in double quotes.
#
# -j <jettyParams> Additional parameters to pass to Jetty when starting Solr.
# For example, to add configuration folder that jetty should read
# you could pass: -j "--include-jetty-dir=/etc/jetty/custom/server/"
# In most cases, you should wrap the additional parameters in double quotes.
#
# --no-prompt Don't prompt for input; accept all defaults when running examples that accept user input
#
# --force If attempting to start Solr as the root user, the script will exit with a warning that running Solr as "root" can cause problems.
# It is possible to override this warning with the '--force' parameter.
#
# --verbose or --quiet/-q Verbose or quiet logging. Sets default log level of Solr to DEBUG or WARN instead of INFO
# --
#
# Last output:
#
# ERROR: -version is not supported by this script
#
#
# Usage: solr start [-f] [-c] [--host host] [-p port] [-d directory] [-z zkHost] [-m memory] [-e example] [-s solr.solr.home] [-t solr.data.home] [--jvm-opts "jvm-opts"] [-V]
#
# -f Start Solr in foreground; default starts Solr in the background
# and sends stdout / stderr to solr-PORT-console.log
#
# -c or --cloud Start Solr in SolrCloud mode; if -z not supplied and ZK_HOST not defined in
# solr.in.sh, an embedded ZooKeeper instance is started on Solr port+1000,
# such as 9983 if Solr is bound to 8983
#
# --host <host> Specify the hostname for this Solr instance
#
# -p/--port <port> Specify the port to start the Solr HTTP listener on; default is 8983
# The specified port (SOLR_PORT) will also be used to determine the stop port
# STOP_PORT=($SOLR_PORT-1000) and JMX RMI listen port RMI_PORT=($SOLR_PORT+10000).
# For instance, if you set -p 8985, then the STOP_PORT=7985 and RMI_PORT=18985
#
# -d <dir> Specify the Solr server directory; defaults to server
#
# -z/--zk-host <zkHost> Zookeeper connection string; only used when running in SolrCloud mode using -c
# If neither ZK_HOST is defined in solr.in.sh nor the -z parameter is specified,
# an embedded ZooKeeper instance will be launched.
# Set the ZK_CREATE_CHROOT environment variable to true if your ZK host has a chroot path, and you want to create it automatically.
#
# -m/--memory <memory> Sets the min (-Xms) and max (-Xmx) heap size for the JVM, such as: -m 4g
# results in: -Xms4g -Xmx4g; by default, this script sets the heap size to 512m
#
# -s <dir> Sets the solr.solr.home system property; Solr will create core directories under
# this directory. This allows you to run multiple Solr instances on the same host
# while reusing the same server directory set using the -d parameter. If set, the
# specified directory should contain a solr.xml file, unless solr.xml exists in Zookeeper.
# This parameter is ignored when running examples (-e), as the solr.solr.home depends
# on which example is run. The default value is server/solr. If passed relative dir,
# validation with current dir will be done, before trying default server/<dir>
#
# -t/--data-home <dir> Sets the solr.data.home system property, where Solr will store index data in <instance_dir>/data subdirectories.
# If not set, Solr uses solr.solr.home for config and data.
#
# -e <example> Name of the example to run; available examples:
# cloud: SolrCloud example
# techproducts: Comprehensive example illustrating many of Solr's core capabilities
# schemaless: Schema-less example (schema is inferred from data during indexing)
# films: Example of starting with _default configset and adding explicit fields dynamically
#
# --jvm-opts <jvmParams> Additional parameters to pass to the JVM when starting Solr, such as to setup
# Java debug options. For example, to enable a Java debugger to attach to the Solr JVM
# you could pass: --jvm-opts "-agentlib:jdwp=transport=dt_socket,server=y,suspend=n,address=18983"
# In most cases, you should wrap the additional parameters in double quotes.
#
# -j <jettyParams> Additional parameters to pass to Jetty when starting Solr.
# For example, to add configuration folder that jetty should read
# you could pass: -j "--include-jetty-dir=/etc/jetty/custom/server/"
# In most cases, you should wrap the additional parameters in double quotes.
#
# --no-prompt Don't prompt for input; accept all defaults when running examples that accept user input
#
# --force If attempting to start Solr as the root user, the script will exit with a warning that running Solr as "root" can cause problems.
# It is possible to override this warning with the '--force' parameter.
#
# --verbose or --quiet/-q Verbose or quiet logging. Sets default log level of Solr to DEBUG or WARN instead of INFO
ok 88 short help # in 1219 ms
ok 89 short help is inferred # in 2227 ms
ok 90 long help # in 901 ms
ok 91 running subcommands with zk is prevented # in 1073 ms
ok 92 listing out files # in 3363 ms
ok 93 connecting to solr via various solr urls and zk hosts # in 11318 ms
ok 94 copying files around # in 15951 ms
ok 95 upconfig # in 3872 ms
ok 96 downconfig # in 3467 ms
ok 97 zkcli.sh gets 'solrhome' from 'solr.home' system property # in 1849 ms
ok 98 zkcli.sh gets 'solrhome' from 'solrhome' command line option # in 1792 ms
ok 99 bin/solr zk cp gets 'solrhome' from '--solr-home' command line option # in 1507 ms
ok 100 Cleanup # in 1275 ms
> Task :solr:packaging:integrationTests FAILED
ERROR: The following test(s) have failed:
- org.apache.solr.client.solrj.impl.ClusterStateProviderTest.testGetClusterState (:solr:solrj)
Test history: https://ge.apache.org/scans/tests?search.rootProjectNames=solr-root&tests.container=org.apache.solr.client.solrj.impl.ClusterStateProviderTest&tests.test=testGetClusterState http://fucit.org/solr-jenkins-reports/history-trend-of-recent-failures.html#series/org.apache.solr.client.solrj.impl.ClusterStateProviderTest.testGetClusterState
Test output: /home/jenkins/jenkins-slave/workspace/Solr/Solr-Check-9.x/solr/solrj/build/test-results/test/outputs/OUTPUT-org.apache.solr.client.solrj.impl.ClusterStateProviderTest.txt
Reproduce with: ./gradlew :solr:solrj:test --tests "org.apache.solr.client.solrj.impl.ClusterStateProviderTest.testGetClusterState" -Ptests.jvms=4 -Ptests.haltonfailure=false "-Ptests.jvmargs=-XX:TieredStopAtLevel=1 -XX:+UseParallelGC -XX:ActiveProcessorCount=1 -XX:ReservedCodeCacheSize=120m" -Ptests.seed=48F1A4A0031C885A -Ptests.multiplier=2 -Ptests.badapples=false -Ptests.file.encoding=UTF-8
FAILURE: Build failed with an exception.
* Where:
Build file '/home/jenkins/jenkins-slave/workspace/Solr/Solr-Check-9.x/solr/packaging/build.gradle' line: 314
* What went wrong:
Execution failed for task ':solr:packaging:integrationTests'.
> Process 'command '/home/jenkins/jenkins-slave/workspace/Solr/Solr-Check-9.x/.gradle/node/packaging/node_modules/bats/bin/bats'' finished with non-zero exit value 1
* Try:
> Run with --stacktrace option to get the stack trace.
> Run with --info or --debug option to get more log output.
> Get more help at https://help.gradle.org.
Deprecated Gradle features were used in this build, making it incompatible with Gradle 9.0.
You can use '--warning-mode all' to show the individual deprecation warnings and determine if they come from your own scripts or plugins.
For more on this, please refer to https://docs.gradle.org/8.4/userguide/command_line_interface.html#sec:command_line_warnings in the Gradle documentation.
BUILD FAILED in 1h 13m 21s
742 actionable tasks: 742 executed
Publishing build scan...
https://ge.apache.org/s/i2lican4l2dos
Build step 'Invoke Gradle script' changed build result to FAILURE
Build step 'Invoke Gradle script' marked build as failure
Archiving artifacts
Recording test results
[Checks API] No suitable checks publisher found.
Email was triggered for: Failure - Any
Sending email for trigger: Failure - Any
[JENKINS] Solr » Solr-Check-9.x - Build # 6193 - Unstable!
Posted by Apache Jenkins Server <je...@builds.apache.org>.
Build: https://ci-builds.apache.org/job/Solr/job/Solr-Check-9.x/6193/
6 tests failed.
FAILED: org.apache.solr.search.TestStressVersions.testStressGetRealtimeVersions
Error Message:
com.carrotsearch.randomizedtesting.UncaughtExceptionError: Captured an uncaught exception in thread: Thread[id=18790, name=READER15, state=RUNNABLE, group=TGRP-TestStressVersions]
Stack Trace:
com.carrotsearch.randomizedtesting.UncaughtExceptionError: Captured an uncaught exception in thread: Thread[id=18790, name=READER15, state=RUNNABLE, group=TGRP-TestStressVersions]
at __randomizedtesting.SeedInfo.seed([27BDFAE58E90E7D0:22B9EBDAC3ECE38C]:0)
Caused by: java.lang.RuntimeException: java.util.concurrent.RejectedExecutionException: Task org.apache.solr.common.util.ExecutorUtil$MDCAwareThreadPoolExecutor$$Lambda$385/0x0000000100594c40@3dd5f399 rejected from org.apache.solr.common.util.ExecutorUtil$MDCAwareThreadPoolExecutor@303d584b[Running, pool size = 1, active threads = 1, queued tasks = 1000, completed tasks = 32162]
at __randomizedtesting.SeedInfo.seed([27BDFAE58E90E7D0]:0)
at org.apache.solr.search.TestStressVersions$2.run(TestStressVersions.java:263)
Caused by: java.util.concurrent.RejectedExecutionException: Task org.apache.solr.common.util.ExecutorUtil$MDCAwareThreadPoolExecutor$$Lambda$385/0x0000000100594c40@3dd5f399 rejected from org.apache.solr.common.util.ExecutorUtil$MDCAwareThreadPoolExecutor@303d584b[Running, pool size = 1, active threads = 1, queued tasks = 1000, completed tasks = 32162]
at java.base/java.util.concurrent.ThreadPoolExecutor$AbortPolicy.rejectedExecution(ThreadPoolExecutor.java:2055)
at java.base/java.util.concurrent.ThreadPoolExecutor.reject(ThreadPoolExecutor.java:825)
at java.base/java.util.concurrent.ThreadPoolExecutor.execute(ThreadPoolExecutor.java:1355)
at org.apache.solr.common.util.ExecutorUtil$MDCAwareThreadPoolExecutor.execute(ExecutorUtil.java:430)
at org.apache.lucene.search.TaskExecutor$TaskGroup.invokeAll(TaskExecutor.java:152)
at org.apache.lucene.search.TaskExecutor.invokeAll(TaskExecutor.java:76)
at org.apache.lucene.index.TermStates.build(TermStates.java:116)
at org.apache.lucene.search.TermQuery.createWeight(TermQuery.java:275)
at org.apache.lucene.search.IndexSearcher.createWeight(IndexSearcher.java:882)
at org.apache.lucene.search.IndexSearcher.search(IndexSearcher.java:560)
at org.apache.solr.search.SolrIndexSearcher.buildAndRunCollectorChain(SolrIndexSearcher.java:276)
at org.apache.solr.search.SolrIndexSearcher.getDocListNC(SolrIndexSearcher.java:1932)
at org.apache.solr.search.SolrIndexSearcher.getDocListC(SolrIndexSearcher.java:1729)
at org.apache.solr.search.SolrIndexSearcher.search(SolrIndexSearcher.java:726)
at org.apache.solr.search.SolrIndexSearcher.search(SolrIndexSearcher.java:721)
at org.apache.solr.handler.component.QueryComponent.doProcessUngroupedSearch(QueryComponent.java:1690)
at org.apache.solr.handler.component.QueryComponent.process(QueryComponent.java:432)
at org.apache.solr.handler.component.SearchHandler.handleRequestBody(SearchHandler.java:456)
at org.apache.solr.handler.RequestHandlerBase.handleRequest(RequestHandlerBase.java:226)
at org.apache.solr.core.SolrCore.execute(SolrCore.java:2878)
at org.apache.solr.util.TestHarness.query(TestHarness.java:355)
at org.apache.solr.util.TestHarness.query(TestHarness.java:335)
at org.apache.solr.search.TestStressVersions$2.run(TestStressVersions.java:240)
FAILED: org.apache.solr.client.solrj.TestLBHttp2SolrClient.testTwoServers
Error Message:
org.apache.solr.client.solrj.SolrServerException: Timeout occurred while waiting response from server at: https://127.0.0.1:39581/solr/collection1/select
Stack Trace:
org.apache.solr.client.solrj.SolrServerException: Timeout occurred while waiting response from server at: https://127.0.0.1:39581/solr/collection1/select
at __randomizedtesting.SeedInfo.seed([27BDFAE58E90E7D0:8757546855DBC9F0]:0)
at app//org.apache.solr.client.solrj.impl.Http2SolrClient.request(Http2SolrClient.java:533)
at app//org.apache.solr.client.solrj.impl.LBSolrClient.request(LBSolrClient.java:789)
at app//org.apache.solr.client.solrj.impl.LBSolrClient.request(LBSolrClient.java:731)
at app//org.apache.solr.client.solrj.SolrRequest.process(SolrRequest.java:279)
at app//org.apache.solr.client.solrj.SolrClient.query(SolrClient.java:927)
at app//org.apache.solr.client.solrj.SolrClient.query(SolrClient.java:940)
at app//org.apache.solr.client.solrj.TestLBHttp2SolrClient.testTwoServers(TestLBHttp2SolrClient.java:202)
at java.base@11.0.16.1/jdk.internal.reflect.NativeMethodAccessorImpl.invoke0(Native Method)
at java.base@11.0.16.1/jdk.internal.reflect.NativeMethodAccessorImpl.invoke(NativeMethodAccessorImpl.java:62)
at java.base@11.0.16.1/jdk.internal.reflect.DelegatingMethodAccessorImpl.invoke(DelegatingMethodAccessorImpl.java:43)
at java.base@11.0.16.1/java.lang.reflect.Method.invoke(Method.java:566)
at app//com.carrotsearch.randomizedtesting.RandomizedRunner.invoke(RandomizedRunner.java:1758)
at app//com.carrotsearch.randomizedtesting.RandomizedRunner$8.evaluate(RandomizedRunner.java:946)
at app//com.carrotsearch.randomizedtesting.RandomizedRunner$9.evaluate(RandomizedRunner.java:982)
at app//com.carrotsearch.randomizedtesting.RandomizedRunner$10.evaluate(RandomizedRunner.java:996)
at app//com.carrotsearch.randomizedtesting.rules.SystemPropertiesRestoreRule$1.evaluate(SystemPropertiesRestoreRule.java:80)
at app//org.junit.rules.RunRules.evaluate(RunRules.java:20)
at app//org.apache.lucene.tests.util.TestRuleSetupTeardownChained$1.evaluate(TestRuleSetupTeardownChained.java:48)
at app//org.apache.lucene.tests.util.AbstractBeforeAfterRule$1.evaluate(AbstractBeforeAfterRule.java:43)
at app//org.apache.lucene.tests.util.TestRuleThreadAndTestName$1.evaluate(TestRuleThreadAndTestName.java:45)
at app//org.apache.lucene.tests.util.TestRuleIgnoreAfterMaxFailures$1.evaluate(TestRuleIgnoreAfterMaxFailures.java:60)
at app//org.apache.lucene.tests.util.TestRuleMarkFailure$1.evaluate(TestRuleMarkFailure.java:44)
at app//org.junit.rules.RunRules.evaluate(RunRules.java:20)
at app//com.carrotsearch.randomizedtesting.rules.StatementAdapter.evaluate(StatementAdapter.java:36)
at app//com.carrotsearch.randomizedtesting.ThreadLeakControl$StatementRunner.run(ThreadLeakControl.java:390)
at app//com.carrotsearch.randomizedtesting.ThreadLeakControl.forkTimeoutingTask(ThreadLeakControl.java:843)
at app//com.carrotsearch.randomizedtesting.ThreadLeakControl$3.evaluate(ThreadLeakControl.java:490)
at app//com.carrotsearch.randomizedtesting.RandomizedRunner.runSingleTest(RandomizedRunner.java:955)
at app//com.carrotsearch.randomizedtesting.RandomizedRunner$5.evaluate(RandomizedRunner.java:840)
at app//com.carrotsearch.randomizedtesting.RandomizedRunner$6.evaluate(RandomizedRunner.java:891)
at app//com.carrotsearch.randomizedtesting.RandomizedRunner$7.evaluate(RandomizedRunner.java:902)
at app//com.carrotsearch.randomizedtesting.rules.StatementAdapter.evaluate(StatementAdapter.java:36)
at app//com.carrotsearch.randomizedtesting.rules.StatementAdapter.evaluate(StatementAdapter.java:36)
at app//org.apache.lucene.tests.util.AbstractBeforeAfterRule$1.evaluate(AbstractBeforeAfterRule.java:43)
at app//org.apache.lucene.tests.util.AbstractBeforeAfterRule$1.evaluate(AbstractBeforeAfterRule.java:43)
at app//com.carrotsearch.randomizedtesting.rules.SystemPropertiesRestoreRule$1.evaluate(SystemPropertiesRestoreRule.java:80)
at app//org.junit.rules.RunRules.evaluate(RunRules.java:20)
at app//org.apache.lucene.tests.util.AbstractBeforeAfterRule$1.evaluate(AbstractBeforeAfterRule.java:43)
at app//com.carrotsearch.randomizedtesting.rules.StatementAdapter.evaluate(StatementAdapter.java:36)
at app//org.apache.lucene.tests.util.TestRuleStoreClassName$1.evaluate(TestRuleStoreClassName.java:38)
at app//com.carrotsearch.randomizedtesting.rules.NoShadowingOrOverridesOnMethodsRule$1.evaluate(NoShadowingOrOverridesOnMethodsRule.java:40)
at app//com.carrotsearch.randomizedtesting.rules.NoShadowingOrOverridesOnMethodsRule$1.evaluate(NoShadowingOrOverridesOnMethodsRule.java:40)
at app//com.carrotsearch.randomizedtesting.rules.StatementAdapter.evaluate(StatementAdapter.java:36)
at app//com.carrotsearch.randomizedtesting.rules.StatementAdapter.evaluate(StatementAdapter.java:36)
at app//org.apache.lucene.tests.util.TestRuleAssertionsRequired$1.evaluate(TestRuleAssertionsRequired.java:53)
at app//org.apache.lucene.tests.util.AbstractBeforeAfterRule$1.evaluate(AbstractBeforeAfterRule.java:43)
at app//org.apache.lucene.tests.util.TestRuleMarkFailure$1.evaluate(TestRuleMarkFailure.java:44)
at app//org.apache.lucene.tests.util.TestRuleIgnoreAfterMaxFailures$1.evaluate(TestRuleIgnoreAfterMaxFailures.java:60)
at app//org.apache.lucene.tests.util.TestRuleIgnoreTestSuites$1.evaluate(TestRuleIgnoreTestSuites.java:47)
at app//org.junit.rules.RunRules.evaluate(RunRules.java:20)
at app//com.carrotsearch.randomizedtesting.rules.StatementAdapter.evaluate(StatementAdapter.java:36)
at app//com.carrotsearch.randomizedtesting.ThreadLeakControl$StatementRunner.run(ThreadLeakControl.java:390)
at app//com.carrotsearch.randomizedtesting.ThreadLeakControl.lambda$forkTimeoutingTask$0(ThreadLeakControl.java:850)
at java.base@11.0.16.1/java.lang.Thread.run(Thread.java:829)
Caused by: java.util.concurrent.TimeoutException
at org.eclipse.jetty.client.util.InputStreamResponseListener.get(InputStreamResponseListener.java:214)
at org.apache.solr.client.solrj.impl.Http2SolrClient.request(Http2SolrClient.java:524)
... 53 more
FAILED: org.apache.solr.cloud.PackageManagerCLITest.testPackageManager
Error Message:
java.lang.RuntimeException: SolrCLI failed to exit with status 1
Stack Trace:
java.lang.RuntimeException: SolrCLI failed to exit with status 1
at __randomizedtesting.SeedInfo.seed([27BDFAE58E90E7D0:2417B18B8C7E387B]:0)
at org.apache.solr.cli.SolrCLI.exit(SolrCLI.java:212)
at org.apache.solr.cli.SolrCLI.processCommandLineArgs(SolrCLI.java:477)
at org.apache.solr.cloud.PackageManagerCLITest.run(PackageManagerCLITest.java:221)
at org.apache.solr.cloud.PackageManagerCLITest.testPackageManager(PackageManagerCLITest.java:157)
at java.base/jdk.internal.reflect.NativeMethodAccessorImpl.invoke0(Native Method)
at java.base/jdk.internal.reflect.NativeMethodAccessorImpl.invoke(NativeMethodAccessorImpl.java:62)
at java.base/jdk.internal.reflect.DelegatingMethodAccessorImpl.invoke(DelegatingMethodAccessorImpl.java:43)
at java.base/java.lang.reflect.Method.invoke(Method.java:566)
at com.carrotsearch.randomizedtesting.RandomizedRunner.invoke(RandomizedRunner.java:1758)
at com.carrotsearch.randomizedtesting.RandomizedRunner$8.evaluate(RandomizedRunner.java:946)
at com.carrotsearch.randomizedtesting.RandomizedRunner$9.evaluate(RandomizedRunner.java:982)
at com.carrotsearch.randomizedtesting.RandomizedRunner$10.evaluate(RandomizedRunner.java:996)
at com.carrotsearch.randomizedtesting.rules.SystemPropertiesRestoreRule$1.evaluate(SystemPropertiesRestoreRule.java:80)
at org.junit.rules.RunRules.evaluate(RunRules.java:20)
at org.apache.lucene.tests.util.TestRuleSetupTeardownChained$1.evaluate(TestRuleSetupTeardownChained.java:48)
at org.apache.lucene.tests.util.AbstractBeforeAfterRule$1.evaluate(AbstractBeforeAfterRule.java:43)
at org.apache.lucene.tests.util.TestRuleThreadAndTestName$1.evaluate(TestRuleThreadAndTestName.java:45)
at org.apache.lucene.tests.util.TestRuleIgnoreAfterMaxFailures$1.evaluate(TestRuleIgnoreAfterMaxFailures.java:60)
at org.apache.lucene.tests.util.TestRuleMarkFailure$1.evaluate(TestRuleMarkFailure.java:44)
at org.junit.rules.RunRules.evaluate(RunRules.java:20)
at com.carrotsearch.randomizedtesting.rules.StatementAdapter.evaluate(StatementAdapter.java:36)
at com.carrotsearch.randomizedtesting.ThreadLeakControl$StatementRunner.run(ThreadLeakControl.java:390)
at com.carrotsearch.randomizedtesting.ThreadLeakControl.forkTimeoutingTask(ThreadLeakControl.java:843)
at com.carrotsearch.randomizedtesting.ThreadLeakControl$3.evaluate(ThreadLeakControl.java:490)
at com.carrotsearch.randomizedtesting.RandomizedRunner.runSingleTest(RandomizedRunner.java:955)
at com.carrotsearch.randomizedtesting.RandomizedRunner$5.evaluate(RandomizedRunner.java:840)
at com.carrotsearch.randomizedtesting.RandomizedRunner$6.evaluate(RandomizedRunner.java:891)
at com.carrotsearch.randomizedtesting.RandomizedRunner$7.evaluate(RandomizedRunner.java:902)
at com.carrotsearch.randomizedtesting.rules.StatementAdapter.evaluate(StatementAdapter.java:36)
at com.carrotsearch.randomizedtesting.rules.StatementAdapter.evaluate(StatementAdapter.java:36)
at org.apache.lucene.tests.util.AbstractBeforeAfterRule$1.evaluate(AbstractBeforeAfterRule.java:43)
at org.apache.lucene.tests.util.AbstractBeforeAfterRule$1.evaluate(AbstractBeforeAfterRule.java:43)
at com.carrotsearch.randomizedtesting.rules.SystemPropertiesRestoreRule$1.evaluate(SystemPropertiesRestoreRule.java:80)
at org.junit.rules.RunRules.evaluate(RunRules.java:20)
at org.apache.lucene.tests.util.AbstractBeforeAfterRule$1.evaluate(AbstractBeforeAfterRule.java:43)
at com.carrotsearch.randomizedtesting.rules.StatementAdapter.evaluate(StatementAdapter.java:36)
at org.apache.lucene.tests.util.TestRuleStoreClassName$1.evaluate(TestRuleStoreClassName.java:38)
at com.carrotsearch.randomizedtesting.rules.NoShadowingOrOverridesOnMethodsRule$1.evaluate(NoShadowingOrOverridesOnMethodsRule.java:40)
at com.carrotsearch.randomizedtesting.rules.NoShadowingOrOverridesOnMethodsRule$1.evaluate(NoShadowingOrOverridesOnMethodsRule.java:40)
at com.carrotsearch.randomizedtesting.rules.StatementAdapter.evaluate(StatementAdapter.java:36)
at com.carrotsearch.randomizedtesting.rules.StatementAdapter.evaluate(StatementAdapter.java:36)
at org.apache.lucene.tests.util.TestRuleAssertionsRequired$1.evaluate(TestRuleAssertionsRequired.java:53)
at org.apache.lucene.tests.util.AbstractBeforeAfterRule$1.evaluate(AbstractBeforeAfterRule.java:43)
at org.apache.lucene.tests.util.TestRuleMarkFailure$1.evaluate(TestRuleMarkFailure.java:44)
at org.apache.lucene.tests.util.TestRuleIgnoreAfterMaxFailures$1.evaluate(TestRuleIgnoreAfterMaxFailures.java:60)
at org.apache.lucene.tests.util.TestRuleIgnoreTestSuites$1.evaluate(TestRuleIgnoreTestSuites.java:47)
at org.junit.rules.RunRules.evaluate(RunRules.java:20)
at com.carrotsearch.randomizedtesting.rules.StatementAdapter.evaluate(StatementAdapter.java:36)
at com.carrotsearch.randomizedtesting.ThreadLeakControl$StatementRunner.run(ThreadLeakControl.java:390)
at com.carrotsearch.randomizedtesting.ThreadLeakControl.lambda$forkTimeoutingTask$0(ThreadLeakControl.java:850)
at java.base/java.lang.Thread.run(Thread.java:829)
FAILED: org.apache.solr.cloud.PackageManagerCLITest.testPackageManager
Error Message:
java.lang.RuntimeException: SolrCLI failed to exit with status 1
Stack Trace:
java.lang.RuntimeException: SolrCLI failed to exit with status 1
at __randomizedtesting.SeedInfo.seed([27BDFAE58E90E7D0:2417B18B8C7E387B]:0)
at org.apache.solr.cli.SolrCLI.exit(SolrCLI.java:212)
at org.apache.solr.cli.SolrCLI.processCommandLineArgs(SolrCLI.java:477)
at org.apache.solr.cloud.PackageManagerCLITest.run(PackageManagerCLITest.java:221)
at org.apache.solr.cloud.PackageManagerCLITest.testPackageManager(PackageManagerCLITest.java:157)
at java.base/jdk.internal.reflect.NativeMethodAccessorImpl.invoke0(Native Method)
at java.base/jdk.internal.reflect.NativeMethodAccessorImpl.invoke(NativeMethodAccessorImpl.java:62)
at java.base/jdk.internal.reflect.DelegatingMethodAccessorImpl.invoke(DelegatingMethodAccessorImpl.java:43)
at java.base/java.lang.reflect.Method.invoke(Method.java:566)
at com.carrotsearch.randomizedtesting.RandomizedRunner.invoke(RandomizedRunner.java:1758)
at com.carrotsearch.randomizedtesting.RandomizedRunner$8.evaluate(RandomizedRunner.java:946)
at com.carrotsearch.randomizedtesting.RandomizedRunner$9.evaluate(RandomizedRunner.java:982)
at com.carrotsearch.randomizedtesting.RandomizedRunner$10.evaluate(RandomizedRunner.java:996)
at com.carrotsearch.randomizedtesting.rules.SystemPropertiesRestoreRule$1.evaluate(SystemPropertiesRestoreRule.java:80)
at org.junit.rules.RunRules.evaluate(RunRules.java:20)
at org.apache.lucene.tests.util.TestRuleSetupTeardownChained$1.evaluate(TestRuleSetupTeardownChained.java:48)
at org.apache.lucene.tests.util.AbstractBeforeAfterRule$1.evaluate(AbstractBeforeAfterRule.java:43)
at org.apache.lucene.tests.util.TestRuleThreadAndTestName$1.evaluate(TestRuleThreadAndTestName.java:45)
at org.apache.lucene.tests.util.TestRuleIgnoreAfterMaxFailures$1.evaluate(TestRuleIgnoreAfterMaxFailures.java:60)
at org.apache.lucene.tests.util.TestRuleMarkFailure$1.evaluate(TestRuleMarkFailure.java:44)
at org.junit.rules.RunRules.evaluate(RunRules.java:20)
at com.carrotsearch.randomizedtesting.rules.StatementAdapter.evaluate(StatementAdapter.java:36)
at com.carrotsearch.randomizedtesting.ThreadLeakControl$StatementRunner.run(ThreadLeakControl.java:390)
at com.carrotsearch.randomizedtesting.ThreadLeakControl.forkTimeoutingTask(ThreadLeakControl.java:843)
at com.carrotsearch.randomizedtesting.ThreadLeakControl$3.evaluate(ThreadLeakControl.java:490)
at com.carrotsearch.randomizedtesting.RandomizedRunner.runSingleTest(RandomizedRunner.java:955)
at com.carrotsearch.randomizedtesting.RandomizedRunner$5.evaluate(RandomizedRunner.java:840)
at com.carrotsearch.randomizedtesting.RandomizedRunner$6.evaluate(RandomizedRunner.java:891)
at com.carrotsearch.randomizedtesting.RandomizedRunner$7.evaluate(RandomizedRunner.java:902)
at com.carrotsearch.randomizedtesting.rules.StatementAdapter.evaluate(StatementAdapter.java:36)
at com.carrotsearch.randomizedtesting.rules.StatementAdapter.evaluate(StatementAdapter.java:36)
at org.apache.lucene.tests.util.AbstractBeforeAfterRule$1.evaluate(AbstractBeforeAfterRule.java:43)
at org.apache.lucene.tests.util.AbstractBeforeAfterRule$1.evaluate(AbstractBeforeAfterRule.java:43)
at com.carrotsearch.randomizedtesting.rules.SystemPropertiesRestoreRule$1.evaluate(SystemPropertiesRestoreRule.java:80)
at org.junit.rules.RunRules.evaluate(RunRules.java:20)
at org.apache.lucene.tests.util.AbstractBeforeAfterRule$1.evaluate(AbstractBeforeAfterRule.java:43)
at com.carrotsearch.randomizedtesting.rules.StatementAdapter.evaluate(StatementAdapter.java:36)
at org.apache.lucene.tests.util.TestRuleStoreClassName$1.evaluate(TestRuleStoreClassName.java:38)
at com.carrotsearch.randomizedtesting.rules.NoShadowingOrOverridesOnMethodsRule$1.evaluate(NoShadowingOrOverridesOnMethodsRule.java:40)
at com.carrotsearch.randomizedtesting.rules.NoShadowingOrOverridesOnMethodsRule$1.evaluate(NoShadowingOrOverridesOnMethodsRule.java:40)
at com.carrotsearch.randomizedtesting.rules.StatementAdapter.evaluate(StatementAdapter.java:36)
at com.carrotsearch.randomizedtesting.rules.StatementAdapter.evaluate(StatementAdapter.java:36)
at org.apache.lucene.tests.util.TestRuleAssertionsRequired$1.evaluate(TestRuleAssertionsRequired.java:53)
at org.apache.lucene.tests.util.AbstractBeforeAfterRule$1.evaluate(AbstractBeforeAfterRule.java:43)
at org.apache.lucene.tests.util.TestRuleMarkFailure$1.evaluate(TestRuleMarkFailure.java:44)
at org.apache.lucene.tests.util.TestRuleIgnoreAfterMaxFailures$1.evaluate(TestRuleIgnoreAfterMaxFailures.java:60)
at org.apache.lucene.tests.util.TestRuleIgnoreTestSuites$1.evaluate(TestRuleIgnoreTestSuites.java:47)
at org.junit.rules.RunRules.evaluate(RunRules.java:20)
at com.carrotsearch.randomizedtesting.rules.StatementAdapter.evaluate(StatementAdapter.java:36)
at com.carrotsearch.randomizedtesting.ThreadLeakControl$StatementRunner.run(ThreadLeakControl.java:390)
at com.carrotsearch.randomizedtesting.ThreadLeakControl.lambda$forkTimeoutingTask$0(ThreadLeakControl.java:850)
at java.base/java.lang.Thread.run(Thread.java:829)
FAILED: org.apache.solr.cloud.PackageManagerCLITest.testPackageManager
Error Message:
java.lang.RuntimeException: SolrCLI failed to exit with status 1
Stack Trace:
java.lang.RuntimeException: SolrCLI failed to exit with status 1
at __randomizedtesting.SeedInfo.seed([27BDFAE58E90E7D0:2417B18B8C7E387B]:0)
at org.apache.solr.cli.SolrCLI.exit(SolrCLI.java:212)
at org.apache.solr.cli.SolrCLI.processCommandLineArgs(SolrCLI.java:477)
at org.apache.solr.cloud.PackageManagerCLITest.run(PackageManagerCLITest.java:221)
at org.apache.solr.cloud.PackageManagerCLITest.testPackageManager(PackageManagerCLITest.java:157)
at java.base/jdk.internal.reflect.NativeMethodAccessorImpl.invoke0(Native Method)
at java.base/jdk.internal.reflect.NativeMethodAccessorImpl.invoke(NativeMethodAccessorImpl.java:62)
at java.base/jdk.internal.reflect.DelegatingMethodAccessorImpl.invoke(DelegatingMethodAccessorImpl.java:43)
at java.base/java.lang.reflect.Method.invoke(Method.java:566)
at com.carrotsearch.randomizedtesting.RandomizedRunner.invoke(RandomizedRunner.java:1758)
at com.carrotsearch.randomizedtesting.RandomizedRunner$8.evaluate(RandomizedRunner.java:946)
at com.carrotsearch.randomizedtesting.RandomizedRunner$9.evaluate(RandomizedRunner.java:982)
at com.carrotsearch.randomizedtesting.RandomizedRunner$10.evaluate(RandomizedRunner.java:996)
at com.carrotsearch.randomizedtesting.rules.SystemPropertiesRestoreRule$1.evaluate(SystemPropertiesRestoreRule.java:80)
at org.junit.rules.RunRules.evaluate(RunRules.java:20)
at org.apache.lucene.tests.util.TestRuleSetupTeardownChained$1.evaluate(TestRuleSetupTeardownChained.java:48)
at org.apache.lucene.tests.util.AbstractBeforeAfterRule$1.evaluate(AbstractBeforeAfterRule.java:43)
at org.apache.lucene.tests.util.TestRuleThreadAndTestName$1.evaluate(TestRuleThreadAndTestName.java:45)
at org.apache.lucene.tests.util.TestRuleIgnoreAfterMaxFailures$1.evaluate(TestRuleIgnoreAfterMaxFailures.java:60)
at org.apache.lucene.tests.util.TestRuleMarkFailure$1.evaluate(TestRuleMarkFailure.java:44)
at org.junit.rules.RunRules.evaluate(RunRules.java:20)
at com.carrotsearch.randomizedtesting.rules.StatementAdapter.evaluate(StatementAdapter.java:36)
at com.carrotsearch.randomizedtesting.ThreadLeakControl$StatementRunner.run(ThreadLeakControl.java:390)
at com.carrotsearch.randomizedtesting.ThreadLeakControl.forkTimeoutingTask(ThreadLeakControl.java:843)
at com.carrotsearch.randomizedtesting.ThreadLeakControl$3.evaluate(ThreadLeakControl.java:490)
at com.carrotsearch.randomizedtesting.RandomizedRunner.runSingleTest(RandomizedRunner.java:955)
at com.carrotsearch.randomizedtesting.RandomizedRunner$5.evaluate(RandomizedRunner.java:840)
at com.carrotsearch.randomizedtesting.RandomizedRunner$6.evaluate(RandomizedRunner.java:891)
at com.carrotsearch.randomizedtesting.RandomizedRunner$7.evaluate(RandomizedRunner.java:902)
at com.carrotsearch.randomizedtesting.rules.StatementAdapter.evaluate(StatementAdapter.java:36)
at com.carrotsearch.randomizedtesting.rules.StatementAdapter.evaluate(StatementAdapter.java:36)
at org.apache.lucene.tests.util.AbstractBeforeAfterRule$1.evaluate(AbstractBeforeAfterRule.java:43)
at org.apache.lucene.tests.util.AbstractBeforeAfterRule$1.evaluate(AbstractBeforeAfterRule.java:43)
at com.carrotsearch.randomizedtesting.rules.SystemPropertiesRestoreRule$1.evaluate(SystemPropertiesRestoreRule.java:80)
at org.junit.rules.RunRules.evaluate(RunRules.java:20)
at org.apache.lucene.tests.util.AbstractBeforeAfterRule$1.evaluate(AbstractBeforeAfterRule.java:43)
at com.carrotsearch.randomizedtesting.rules.StatementAdapter.evaluate(StatementAdapter.java:36)
at org.apache.lucene.tests.util.TestRuleStoreClassName$1.evaluate(TestRuleStoreClassName.java:38)
at com.carrotsearch.randomizedtesting.rules.NoShadowingOrOverridesOnMethodsRule$1.evaluate(NoShadowingOrOverridesOnMethodsRule.java:40)
at com.carrotsearch.randomizedtesting.rules.NoShadowingOrOverridesOnMethodsRule$1.evaluate(NoShadowingOrOverridesOnMethodsRule.java:40)
at com.carrotsearch.randomizedtesting.rules.StatementAdapter.evaluate(StatementAdapter.java:36)
at com.carrotsearch.randomizedtesting.rules.StatementAdapter.evaluate(StatementAdapter.java:36)
at org.apache.lucene.tests.util.TestRuleAssertionsRequired$1.evaluate(TestRuleAssertionsRequired.java:53)
at org.apache.lucene.tests.util.AbstractBeforeAfterRule$1.evaluate(AbstractBeforeAfterRule.java:43)
at org.apache.lucene.tests.util.TestRuleMarkFailure$1.evaluate(TestRuleMarkFailure.java:44)
at org.apache.lucene.tests.util.TestRuleIgnoreAfterMaxFailures$1.evaluate(TestRuleIgnoreAfterMaxFailures.java:60)
at org.apache.lucene.tests.util.TestRuleIgnoreTestSuites$1.evaluate(TestRuleIgnoreTestSuites.java:47)
at org.junit.rules.RunRules.evaluate(RunRules.java:20)
at com.carrotsearch.randomizedtesting.rules.StatementAdapter.evaluate(StatementAdapter.java:36)
at com.carrotsearch.randomizedtesting.ThreadLeakControl$StatementRunner.run(ThreadLeakControl.java:390)
at com.carrotsearch.randomizedtesting.ThreadLeakControl.lambda$forkTimeoutingTask$0(ThreadLeakControl.java:850)
at java.base/java.lang.Thread.run(Thread.java:829)
FAILED: org.apache.solr.cloud.PackageManagerCLITest.testPackageManager
Error Message:
java.lang.RuntimeException: SolrCLI failed to exit with status 1
Stack Trace:
java.lang.RuntimeException: SolrCLI failed to exit with status 1
at __randomizedtesting.SeedInfo.seed([27BDFAE58E90E7D0:2417B18B8C7E387B]:0)
at org.apache.solr.cli.SolrCLI.exit(SolrCLI.java:212)
at org.apache.solr.cli.SolrCLI.processCommandLineArgs(SolrCLI.java:477)
at org.apache.solr.cloud.PackageManagerCLITest.run(PackageManagerCLITest.java:221)
at org.apache.solr.cloud.PackageManagerCLITest.testPackageManager(PackageManagerCLITest.java:157)
at java.base/jdk.internal.reflect.NativeMethodAccessorImpl.invoke0(Native Method)
at java.base/jdk.internal.reflect.NativeMethodAccessorImpl.invoke(NativeMethodAccessorImpl.java:62)
at java.base/jdk.internal.reflect.DelegatingMethodAccessorImpl.invoke(DelegatingMethodAccessorImpl.java:43)
at java.base/java.lang.reflect.Method.invoke(Method.java:566)
at com.carrotsearch.randomizedtesting.RandomizedRunner.invoke(RandomizedRunner.java:1758)
at com.carrotsearch.randomizedtesting.RandomizedRunner$8.evaluate(RandomizedRunner.java:946)
at com.carrotsearch.randomizedtesting.RandomizedRunner$9.evaluate(RandomizedRunner.java:982)
at com.carrotsearch.randomizedtesting.RandomizedRunner$10.evaluate(RandomizedRunner.java:996)
at com.carrotsearch.randomizedtesting.rules.SystemPropertiesRestoreRule$1.evaluate(SystemPropertiesRestoreRule.java:80)
at org.junit.rules.RunRules.evaluate(RunRules.java:20)
at org.apache.lucene.tests.util.TestRuleSetupTeardownChained$1.evaluate(TestRuleSetupTeardownChained.java:48)
at org.apache.lucene.tests.util.AbstractBeforeAfterRule$1.evaluate(AbstractBeforeAfterRule.java:43)
at org.apache.lucene.tests.util.TestRuleThreadAndTestName$1.evaluate(TestRuleThreadAndTestName.java:45)
at org.apache.lucene.tests.util.TestRuleIgnoreAfterMaxFailures$1.evaluate(TestRuleIgnoreAfterMaxFailures.java:60)
at org.apache.lucene.tests.util.TestRuleMarkFailure$1.evaluate(TestRuleMarkFailure.java:44)
at org.junit.rules.RunRules.evaluate(RunRules.java:20)
at com.carrotsearch.randomizedtesting.rules.StatementAdapter.evaluate(StatementAdapter.java:36)
at com.carrotsearch.randomizedtesting.ThreadLeakControl$StatementRunner.run(ThreadLeakControl.java:390)
at com.carrotsearch.randomizedtesting.ThreadLeakControl.forkTimeoutingTask(ThreadLeakControl.java:843)
at com.carrotsearch.randomizedtesting.ThreadLeakControl$3.evaluate(ThreadLeakControl.java:490)
at com.carrotsearch.randomizedtesting.RandomizedRunner.runSingleTest(RandomizedRunner.java:955)
at com.carrotsearch.randomizedtesting.RandomizedRunner$5.evaluate(RandomizedRunner.java:840)
at com.carrotsearch.randomizedtesting.RandomizedRunner$6.evaluate(RandomizedRunner.java:891)
at com.carrotsearch.randomizedtesting.RandomizedRunner$7.evaluate(RandomizedRunner.java:902)
at com.carrotsearch.randomizedtesting.rules.StatementAdapter.evaluate(StatementAdapter.java:36)
at com.carrotsearch.randomizedtesting.rules.StatementAdapter.evaluate(StatementAdapter.java:36)
at org.apache.lucene.tests.util.AbstractBeforeAfterRule$1.evaluate(AbstractBeforeAfterRule.java:43)
at org.apache.lucene.tests.util.AbstractBeforeAfterRule$1.evaluate(AbstractBeforeAfterRule.java:43)
at com.carrotsearch.randomizedtesting.rules.SystemPropertiesRestoreRule$1.evaluate(SystemPropertiesRestoreRule.java:80)
at org.junit.rules.RunRules.evaluate(RunRules.java:20)
at org.apache.lucene.tests.util.AbstractBeforeAfterRule$1.evaluate(AbstractBeforeAfterRule.java:43)
at com.carrotsearch.randomizedtesting.rules.StatementAdapter.evaluate(StatementAdapter.java:36)
at org.apache.lucene.tests.util.TestRuleStoreClassName$1.evaluate(TestRuleStoreClassName.java:38)
at com.carrotsearch.randomizedtesting.rules.NoShadowingOrOverridesOnMethodsRule$1.evaluate(NoShadowingOrOverridesOnMethodsRule.java:40)
at com.carrotsearch.randomizedtesting.rules.NoShadowingOrOverridesOnMethodsRule$1.evaluate(NoShadowingOrOverridesOnMethodsRule.java:40)
at com.carrotsearch.randomizedtesting.rules.StatementAdapter.evaluate(StatementAdapter.java:36)
at com.carrotsearch.randomizedtesting.rules.StatementAdapter.evaluate(StatementAdapter.java:36)
at org.apache.lucene.tests.util.TestRuleAssertionsRequired$1.evaluate(TestRuleAssertionsRequired.java:53)
at org.apache.lucene.tests.util.AbstractBeforeAfterRule$1.evaluate(AbstractBeforeAfterRule.java:43)
at org.apache.lucene.tests.util.TestRuleMarkFailure$1.evaluate(TestRuleMarkFailure.java:44)
at org.apache.lucene.tests.util.TestRuleIgnoreAfterMaxFailures$1.evaluate(TestRuleIgnoreAfterMaxFailures.java:60)
at org.apache.lucene.tests.util.TestRuleIgnoreTestSuites$1.evaluate(TestRuleIgnoreTestSuites.java:47)
at org.junit.rules.RunRules.evaluate(RunRules.java:20)
at com.carrotsearch.randomizedtesting.rules.StatementAdapter.evaluate(StatementAdapter.java:36)
at com.carrotsearch.randomizedtesting.ThreadLeakControl$StatementRunner.run(ThreadLeakControl.java:390)
at com.carrotsearch.randomizedtesting.ThreadLeakControl.lambda$forkTimeoutingTask$0(ThreadLeakControl.java:850)
at java.base/java.lang.Thread.run(Thread.java:829)
Build Log:
[...truncated 23005 lines...]
ERROR: The following test(s) have failed:
- org.apache.solr.client.solrj.TestLBHttp2SolrClient.testTwoServers (:solr:solrj)
Test history: https://ge.apache.org/scans/tests?search.rootProjectNames=solr-root&tests.container=org.apache.solr.client.solrj.TestLBHttp2SolrClient&tests.test=testTwoServers http://fucit.org/solr-jenkins-reports/history-trend-of-recent-failures.html#series/org.apache.solr.client.solrj.TestLBHttp2SolrClient.testTwoServers
Test output: /home/jenkins/jenkins-slave/workspace/Solr/Solr-Check-9.x/solr/solrj/build/test-results/test/outputs/OUTPUT-org.apache.solr.client.solrj.TestLBHttp2SolrClient.txt
Reproduce with: ./gradlew :solr:solrj:test --tests "org.apache.solr.client.solrj.TestLBHttp2SolrClient.testTwoServers" -Ptests.jvms=4 -Ptests.haltonfailure=false "-Ptests.jvmargs=-XX:TieredStopAtLevel=1 -XX:+UseParallelGC -XX:ActiveProcessorCount=1 -XX:ReservedCodeCacheSize=120m" -Ptests.seed=27BDFAE58E90E7D0 -Ptests.multiplier=2 -Ptests.badapples=false -Ptests.file.encoding=US-ASCII
- org.apache.solr.cloud.PackageManagerCLITest.testPackageManager (:solr:core)
Test history: https://ge.apache.org/scans/tests?search.rootProjectNames=solr-root&tests.container=org.apache.solr.cloud.PackageManagerCLITest&tests.test=testPackageManager http://fucit.org/solr-jenkins-reports/history-trend-of-recent-failures.html#series/org.apache.solr.cloud.PackageManagerCLITest.testPackageManager
Test output: /home/jenkins/jenkins-slave/workspace/Solr/Solr-Check-9.x/solr/core/build/test-results/test/outputs/OUTPUT-org.apache.solr.cloud.PackageManagerCLITest.txt
Reproduce with: ./gradlew :solr:core:test --tests "org.apache.solr.cloud.PackageManagerCLITest.testPackageManager" -Ptests.jvms=4 -Ptests.haltonfailure=false "-Ptests.jvmargs=-XX:TieredStopAtLevel=1 -XX:+UseParallelGC -XX:ActiveProcessorCount=1 -XX:ReservedCodeCacheSize=120m" -Ptests.seed=27BDFAE58E90E7D0 -Ptests.multiplier=2 -Ptests.badapples=false -Ptests.file.encoding=US-ASCII
- org.apache.solr.search.TestStressVersions.testStressGetRealtimeVersions (:solr:core)
Test history: https://ge.apache.org/scans/tests?search.rootProjectNames=solr-root&tests.container=org.apache.solr.search.TestStressVersions&tests.test=testStressGetRealtimeVersions http://fucit.org/solr-jenkins-reports/history-trend-of-recent-failures.html#series/org.apache.solr.search.TestStressVersions.testStressGetRealtimeVersions
Test output: /home/jenkins/jenkins-slave/workspace/Solr/Solr-Check-9.x/solr/core/build/test-results/test/outputs/OUTPUT-org.apache.solr.search.TestStressVersions.txt
Reproduce with: ./gradlew :solr:core:test --tests "org.apache.solr.search.TestStressVersions.testStressGetRealtimeVersions" -Ptests.jvms=4 -Ptests.haltonfailure=false "-Ptests.jvmargs=-XX:TieredStopAtLevel=1 -XX:+UseParallelGC -XX:ActiveProcessorCount=1 -XX:ReservedCodeCacheSize=120m" -Ptests.seed=27BDFAE58E90E7D0 -Ptests.multiplier=2 -Ptests.badapples=false -Ptests.file.encoding=US-ASCII
Deprecated Gradle features were used in this build, making it incompatible with Gradle 9.0.
You can use '--warning-mode all' to show the individual deprecation warnings and determine if they come from your own scripts or plugins.
For more on this, please refer to https://docs.gradle.org/8.4/userguide/command_line_interface.html#sec:command_line_warnings in the Gradle documentation.
BUILD SUCCESSFUL in 1h 14m 45s
742 actionable tasks: 742 executed
Publishing build scan...
https://ge.apache.org/s/a7ai64a75776q
Build step 'Invoke Gradle script' changed build result to SUCCESS
Archiving artifacts
‘**/*.events’ doesn’t match anything: ‘**’ exists but not ‘**/*.events’
No artifacts found that match the file pattern "**/*.events,heapdumps/**,**/hs_err_pid*". Configuration error?
Recording test results
[Checks API] No suitable checks publisher found.
Build step 'Publish JUnit test result report' changed build result to UNSTABLE
Email was triggered for: Unstable (Test Failures)
Sending email for trigger: Unstable (Test Failures)
[JENKINS] Solr » Solr-Check-9.x - Build # 6192 - Still Failing!
Posted by Apache Jenkins Server <je...@builds.apache.org>.
Build: https://ci-builds.apache.org/job/Solr/job/Solr-Check-9.x/6192/
9 tests failed.
FAILED: org.apache.solr.cloud.PackageManagerCLITest.testPackageManager
Error Message:
java.lang.RuntimeException: SolrCLI failed to exit with status 1
Stack Trace:
java.lang.RuntimeException: SolrCLI failed to exit with status 1
at __randomizedtesting.SeedInfo.seed([187E691D0A035F2F:1BD4227308ED8084]:0)
at org.apache.solr.cli.SolrCLI.exit(SolrCLI.java:212)
at org.apache.solr.cli.SolrCLI.processCommandLineArgs(SolrCLI.java:476)
at org.apache.solr.cloud.PackageManagerCLITest.run(PackageManagerCLITest.java:221)
at org.apache.solr.cloud.PackageManagerCLITest.testPackageManager(PackageManagerCLITest.java:157)
at java.base/jdk.internal.reflect.NativeMethodAccessorImpl.invoke0(Native Method)
at java.base/jdk.internal.reflect.NativeMethodAccessorImpl.invoke(NativeMethodAccessorImpl.java:62)
at java.base/jdk.internal.reflect.DelegatingMethodAccessorImpl.invoke(DelegatingMethodAccessorImpl.java:43)
at java.base/java.lang.reflect.Method.invoke(Method.java:566)
at com.carrotsearch.randomizedtesting.RandomizedRunner.invoke(RandomizedRunner.java:1758)
at com.carrotsearch.randomizedtesting.RandomizedRunner$8.evaluate(RandomizedRunner.java:946)
at com.carrotsearch.randomizedtesting.RandomizedRunner$9.evaluate(RandomizedRunner.java:982)
at com.carrotsearch.randomizedtesting.RandomizedRunner$10.evaluate(RandomizedRunner.java:996)
at com.carrotsearch.randomizedtesting.rules.SystemPropertiesRestoreRule$1.evaluate(SystemPropertiesRestoreRule.java:80)
at org.junit.rules.RunRules.evaluate(RunRules.java:20)
at org.apache.lucene.tests.util.TestRuleSetupTeardownChained$1.evaluate(TestRuleSetupTeardownChained.java:48)
at org.apache.lucene.tests.util.AbstractBeforeAfterRule$1.evaluate(AbstractBeforeAfterRule.java:43)
at org.apache.lucene.tests.util.TestRuleThreadAndTestName$1.evaluate(TestRuleThreadAndTestName.java:45)
at org.apache.lucene.tests.util.TestRuleIgnoreAfterMaxFailures$1.evaluate(TestRuleIgnoreAfterMaxFailures.java:60)
at org.apache.lucene.tests.util.TestRuleMarkFailure$1.evaluate(TestRuleMarkFailure.java:44)
at org.junit.rules.RunRules.evaluate(RunRules.java:20)
at com.carrotsearch.randomizedtesting.rules.StatementAdapter.evaluate(StatementAdapter.java:36)
at com.carrotsearch.randomizedtesting.ThreadLeakControl$StatementRunner.run(ThreadLeakControl.java:390)
at com.carrotsearch.randomizedtesting.ThreadLeakControl.forkTimeoutingTask(ThreadLeakControl.java:843)
at com.carrotsearch.randomizedtesting.ThreadLeakControl$3.evaluate(ThreadLeakControl.java:490)
at com.carrotsearch.randomizedtesting.RandomizedRunner.runSingleTest(RandomizedRunner.java:955)
at com.carrotsearch.randomizedtesting.RandomizedRunner$5.evaluate(RandomizedRunner.java:840)
at com.carrotsearch.randomizedtesting.RandomizedRunner$6.evaluate(RandomizedRunner.java:891)
at com.carrotsearch.randomizedtesting.RandomizedRunner$7.evaluate(RandomizedRunner.java:902)
at com.carrotsearch.randomizedtesting.rules.StatementAdapter.evaluate(StatementAdapter.java:36)
at com.carrotsearch.randomizedtesting.rules.StatementAdapter.evaluate(StatementAdapter.java:36)
at org.apache.lucene.tests.util.AbstractBeforeAfterRule$1.evaluate(AbstractBeforeAfterRule.java:43)
at org.apache.lucene.tests.util.AbstractBeforeAfterRule$1.evaluate(AbstractBeforeAfterRule.java:43)
at com.carrotsearch.randomizedtesting.rules.SystemPropertiesRestoreRule$1.evaluate(SystemPropertiesRestoreRule.java:80)
at org.junit.rules.RunRules.evaluate(RunRules.java:20)
at org.apache.lucene.tests.util.AbstractBeforeAfterRule$1.evaluate(AbstractBeforeAfterRule.java:43)
at com.carrotsearch.randomizedtesting.rules.StatementAdapter.evaluate(StatementAdapter.java:36)
at org.apache.lucene.tests.util.TestRuleStoreClassName$1.evaluate(TestRuleStoreClassName.java:38)
at com.carrotsearch.randomizedtesting.rules.NoShadowingOrOverridesOnMethodsRule$1.evaluate(NoShadowingOrOverridesOnMethodsRule.java:40)
at com.carrotsearch.randomizedtesting.rules.NoShadowingOrOverridesOnMethodsRule$1.evaluate(NoShadowingOrOverridesOnMethodsRule.java:40)
at com.carrotsearch.randomizedtesting.rules.StatementAdapter.evaluate(StatementAdapter.java:36)
at com.carrotsearch.randomizedtesting.rules.StatementAdapter.evaluate(StatementAdapter.java:36)
at org.apache.lucene.tests.util.TestRuleAssertionsRequired$1.evaluate(TestRuleAssertionsRequired.java:53)
at org.apache.lucene.tests.util.AbstractBeforeAfterRule$1.evaluate(AbstractBeforeAfterRule.java:43)
at org.apache.lucene.tests.util.TestRuleMarkFailure$1.evaluate(TestRuleMarkFailure.java:44)
at org.apache.lucene.tests.util.TestRuleIgnoreAfterMaxFailures$1.evaluate(TestRuleIgnoreAfterMaxFailures.java:60)
at org.apache.lucene.tests.util.TestRuleIgnoreTestSuites$1.evaluate(TestRuleIgnoreTestSuites.java:47)
at org.junit.rules.RunRules.evaluate(RunRules.java:20)
at com.carrotsearch.randomizedtesting.rules.StatementAdapter.evaluate(StatementAdapter.java:36)
at com.carrotsearch.randomizedtesting.ThreadLeakControl$StatementRunner.run(ThreadLeakControl.java:390)
at com.carrotsearch.randomizedtesting.ThreadLeakControl.lambda$forkTimeoutingTask$0(ThreadLeakControl.java:850)
at java.base/java.lang.Thread.run(Thread.java:829)
FAILED: org.apache.solr.cloud.PackageManagerCLITest.testPackageManager
Error Message:
java.lang.RuntimeException: SolrCLI failed to exit with status 1
Stack Trace:
java.lang.RuntimeException: SolrCLI failed to exit with status 1
at __randomizedtesting.SeedInfo.seed([187E691D0A035F2F:1BD4227308ED8084]:0)
at org.apache.solr.cli.SolrCLI.exit(SolrCLI.java:212)
at org.apache.solr.cli.SolrCLI.processCommandLineArgs(SolrCLI.java:476)
at org.apache.solr.cloud.PackageManagerCLITest.run(PackageManagerCLITest.java:221)
at org.apache.solr.cloud.PackageManagerCLITest.testPackageManager(PackageManagerCLITest.java:157)
at java.base/jdk.internal.reflect.NativeMethodAccessorImpl.invoke0(Native Method)
at java.base/jdk.internal.reflect.NativeMethodAccessorImpl.invoke(NativeMethodAccessorImpl.java:62)
at java.base/jdk.internal.reflect.DelegatingMethodAccessorImpl.invoke(DelegatingMethodAccessorImpl.java:43)
at java.base/java.lang.reflect.Method.invoke(Method.java:566)
at com.carrotsearch.randomizedtesting.RandomizedRunner.invoke(RandomizedRunner.java:1758)
at com.carrotsearch.randomizedtesting.RandomizedRunner$8.evaluate(RandomizedRunner.java:946)
at com.carrotsearch.randomizedtesting.RandomizedRunner$9.evaluate(RandomizedRunner.java:982)
at com.carrotsearch.randomizedtesting.RandomizedRunner$10.evaluate(RandomizedRunner.java:996)
at com.carrotsearch.randomizedtesting.rules.SystemPropertiesRestoreRule$1.evaluate(SystemPropertiesRestoreRule.java:80)
at org.junit.rules.RunRules.evaluate(RunRules.java:20)
at org.apache.lucene.tests.util.TestRuleSetupTeardownChained$1.evaluate(TestRuleSetupTeardownChained.java:48)
at org.apache.lucene.tests.util.AbstractBeforeAfterRule$1.evaluate(AbstractBeforeAfterRule.java:43)
at org.apache.lucene.tests.util.TestRuleThreadAndTestName$1.evaluate(TestRuleThreadAndTestName.java:45)
at org.apache.lucene.tests.util.TestRuleIgnoreAfterMaxFailures$1.evaluate(TestRuleIgnoreAfterMaxFailures.java:60)
at org.apache.lucene.tests.util.TestRuleMarkFailure$1.evaluate(TestRuleMarkFailure.java:44)
at org.junit.rules.RunRules.evaluate(RunRules.java:20)
at com.carrotsearch.randomizedtesting.rules.StatementAdapter.evaluate(StatementAdapter.java:36)
at com.carrotsearch.randomizedtesting.ThreadLeakControl$StatementRunner.run(ThreadLeakControl.java:390)
at com.carrotsearch.randomizedtesting.ThreadLeakControl.forkTimeoutingTask(ThreadLeakControl.java:843)
at com.carrotsearch.randomizedtesting.ThreadLeakControl$3.evaluate(ThreadLeakControl.java:490)
at com.carrotsearch.randomizedtesting.RandomizedRunner.runSingleTest(RandomizedRunner.java:955)
at com.carrotsearch.randomizedtesting.RandomizedRunner$5.evaluate(RandomizedRunner.java:840)
at com.carrotsearch.randomizedtesting.RandomizedRunner$6.evaluate(RandomizedRunner.java:891)
at com.carrotsearch.randomizedtesting.RandomizedRunner$7.evaluate(RandomizedRunner.java:902)
at com.carrotsearch.randomizedtesting.rules.StatementAdapter.evaluate(StatementAdapter.java:36)
at com.carrotsearch.randomizedtesting.rules.StatementAdapter.evaluate(StatementAdapter.java:36)
at org.apache.lucene.tests.util.AbstractBeforeAfterRule$1.evaluate(AbstractBeforeAfterRule.java:43)
at org.apache.lucene.tests.util.AbstractBeforeAfterRule$1.evaluate(AbstractBeforeAfterRule.java:43)
at com.carrotsearch.randomizedtesting.rules.SystemPropertiesRestoreRule$1.evaluate(SystemPropertiesRestoreRule.java:80)
at org.junit.rules.RunRules.evaluate(RunRules.java:20)
at org.apache.lucene.tests.util.AbstractBeforeAfterRule$1.evaluate(AbstractBeforeAfterRule.java:43)
at com.carrotsearch.randomizedtesting.rules.StatementAdapter.evaluate(StatementAdapter.java:36)
at org.apache.lucene.tests.util.TestRuleStoreClassName$1.evaluate(TestRuleStoreClassName.java:38)
at com.carrotsearch.randomizedtesting.rules.NoShadowingOrOverridesOnMethodsRule$1.evaluate(NoShadowingOrOverridesOnMethodsRule.java:40)
at com.carrotsearch.randomizedtesting.rules.NoShadowingOrOverridesOnMethodsRule$1.evaluate(NoShadowingOrOverridesOnMethodsRule.java:40)
at com.carrotsearch.randomizedtesting.rules.StatementAdapter.evaluate(StatementAdapter.java:36)
at com.carrotsearch.randomizedtesting.rules.StatementAdapter.evaluate(StatementAdapter.java:36)
at org.apache.lucene.tests.util.TestRuleAssertionsRequired$1.evaluate(TestRuleAssertionsRequired.java:53)
at org.apache.lucene.tests.util.AbstractBeforeAfterRule$1.evaluate(AbstractBeforeAfterRule.java:43)
at org.apache.lucene.tests.util.TestRuleMarkFailure$1.evaluate(TestRuleMarkFailure.java:44)
at org.apache.lucene.tests.util.TestRuleIgnoreAfterMaxFailures$1.evaluate(TestRuleIgnoreAfterMaxFailures.java:60)
at org.apache.lucene.tests.util.TestRuleIgnoreTestSuites$1.evaluate(TestRuleIgnoreTestSuites.java:47)
at org.junit.rules.RunRules.evaluate(RunRules.java:20)
at com.carrotsearch.randomizedtesting.rules.StatementAdapter.evaluate(StatementAdapter.java:36)
at com.carrotsearch.randomizedtesting.ThreadLeakControl$StatementRunner.run(ThreadLeakControl.java:390)
at com.carrotsearch.randomizedtesting.ThreadLeakControl.lambda$forkTimeoutingTask$0(ThreadLeakControl.java:850)
at java.base/java.lang.Thread.run(Thread.java:829)
FAILED: org.apache.solr.cloud.PackageManagerCLITest.testPackageManager
Error Message:
java.lang.RuntimeException: SolrCLI failed to exit with status 1
Stack Trace:
java.lang.RuntimeException: SolrCLI failed to exit with status 1
at __randomizedtesting.SeedInfo.seed([187E691D0A035F2F:1BD4227308ED8084]:0)
at org.apache.solr.cli.SolrCLI.exit(SolrCLI.java:212)
at org.apache.solr.cli.SolrCLI.processCommandLineArgs(SolrCLI.java:476)
at org.apache.solr.cloud.PackageManagerCLITest.run(PackageManagerCLITest.java:221)
at org.apache.solr.cloud.PackageManagerCLITest.testPackageManager(PackageManagerCLITest.java:157)
at java.base/jdk.internal.reflect.NativeMethodAccessorImpl.invoke0(Native Method)
at java.base/jdk.internal.reflect.NativeMethodAccessorImpl.invoke(NativeMethodAccessorImpl.java:62)
at java.base/jdk.internal.reflect.DelegatingMethodAccessorImpl.invoke(DelegatingMethodAccessorImpl.java:43)
at java.base/java.lang.reflect.Method.invoke(Method.java:566)
at com.carrotsearch.randomizedtesting.RandomizedRunner.invoke(RandomizedRunner.java:1758)
at com.carrotsearch.randomizedtesting.RandomizedRunner$8.evaluate(RandomizedRunner.java:946)
at com.carrotsearch.randomizedtesting.RandomizedRunner$9.evaluate(RandomizedRunner.java:982)
at com.carrotsearch.randomizedtesting.RandomizedRunner$10.evaluate(RandomizedRunner.java:996)
at com.carrotsearch.randomizedtesting.rules.SystemPropertiesRestoreRule$1.evaluate(SystemPropertiesRestoreRule.java:80)
at org.junit.rules.RunRules.evaluate(RunRules.java:20)
at org.apache.lucene.tests.util.TestRuleSetupTeardownChained$1.evaluate(TestRuleSetupTeardownChained.java:48)
at org.apache.lucene.tests.util.AbstractBeforeAfterRule$1.evaluate(AbstractBeforeAfterRule.java:43)
at org.apache.lucene.tests.util.TestRuleThreadAndTestName$1.evaluate(TestRuleThreadAndTestName.java:45)
at org.apache.lucene.tests.util.TestRuleIgnoreAfterMaxFailures$1.evaluate(TestRuleIgnoreAfterMaxFailures.java:60)
at org.apache.lucene.tests.util.TestRuleMarkFailure$1.evaluate(TestRuleMarkFailure.java:44)
at org.junit.rules.RunRules.evaluate(RunRules.java:20)
at com.carrotsearch.randomizedtesting.rules.StatementAdapter.evaluate(StatementAdapter.java:36)
at com.carrotsearch.randomizedtesting.ThreadLeakControl$StatementRunner.run(ThreadLeakControl.java:390)
at com.carrotsearch.randomizedtesting.ThreadLeakControl.forkTimeoutingTask(ThreadLeakControl.java:843)
at com.carrotsearch.randomizedtesting.ThreadLeakControl$3.evaluate(ThreadLeakControl.java:490)
at com.carrotsearch.randomizedtesting.RandomizedRunner.runSingleTest(RandomizedRunner.java:955)
at com.carrotsearch.randomizedtesting.RandomizedRunner$5.evaluate(RandomizedRunner.java:840)
at com.carrotsearch.randomizedtesting.RandomizedRunner$6.evaluate(RandomizedRunner.java:891)
at com.carrotsearch.randomizedtesting.RandomizedRunner$7.evaluate(RandomizedRunner.java:902)
at com.carrotsearch.randomizedtesting.rules.StatementAdapter.evaluate(StatementAdapter.java:36)
at com.carrotsearch.randomizedtesting.rules.StatementAdapter.evaluate(StatementAdapter.java:36)
at org.apache.lucene.tests.util.AbstractBeforeAfterRule$1.evaluate(AbstractBeforeAfterRule.java:43)
at org.apache.lucene.tests.util.AbstractBeforeAfterRule$1.evaluate(AbstractBeforeAfterRule.java:43)
at com.carrotsearch.randomizedtesting.rules.SystemPropertiesRestoreRule$1.evaluate(SystemPropertiesRestoreRule.java:80)
at org.junit.rules.RunRules.evaluate(RunRules.java:20)
at org.apache.lucene.tests.util.AbstractBeforeAfterRule$1.evaluate(AbstractBeforeAfterRule.java:43)
at com.carrotsearch.randomizedtesting.rules.StatementAdapter.evaluate(StatementAdapter.java:36)
at org.apache.lucene.tests.util.TestRuleStoreClassName$1.evaluate(TestRuleStoreClassName.java:38)
at com.carrotsearch.randomizedtesting.rules.NoShadowingOrOverridesOnMethodsRule$1.evaluate(NoShadowingOrOverridesOnMethodsRule.java:40)
at com.carrotsearch.randomizedtesting.rules.NoShadowingOrOverridesOnMethodsRule$1.evaluate(NoShadowingOrOverridesOnMethodsRule.java:40)
at com.carrotsearch.randomizedtesting.rules.StatementAdapter.evaluate(StatementAdapter.java:36)
at com.carrotsearch.randomizedtesting.rules.StatementAdapter.evaluate(StatementAdapter.java:36)
at org.apache.lucene.tests.util.TestRuleAssertionsRequired$1.evaluate(TestRuleAssertionsRequired.java:53)
at org.apache.lucene.tests.util.AbstractBeforeAfterRule$1.evaluate(AbstractBeforeAfterRule.java:43)
at org.apache.lucene.tests.util.TestRuleMarkFailure$1.evaluate(TestRuleMarkFailure.java:44)
at org.apache.lucene.tests.util.TestRuleIgnoreAfterMaxFailures$1.evaluate(TestRuleIgnoreAfterMaxFailures.java:60)
at org.apache.lucene.tests.util.TestRuleIgnoreTestSuites$1.evaluate(TestRuleIgnoreTestSuites.java:47)
at org.junit.rules.RunRules.evaluate(RunRules.java:20)
at com.carrotsearch.randomizedtesting.rules.StatementAdapter.evaluate(StatementAdapter.java:36)
at com.carrotsearch.randomizedtesting.ThreadLeakControl$StatementRunner.run(ThreadLeakControl.java:390)
at com.carrotsearch.randomizedtesting.ThreadLeakControl.lambda$forkTimeoutingTask$0(ThreadLeakControl.java:850)
at java.base/java.lang.Thread.run(Thread.java:829)
FAILED: org.apache.solr.cloud.PackageManagerCLITest.testPackageManager
Error Message:
java.lang.RuntimeException: SolrCLI failed to exit with status 1
Stack Trace:
java.lang.RuntimeException: SolrCLI failed to exit with status 1
at __randomizedtesting.SeedInfo.seed([187E691D0A035F2F:1BD4227308ED8084]:0)
at org.apache.solr.cli.SolrCLI.exit(SolrCLI.java:212)
at org.apache.solr.cli.SolrCLI.processCommandLineArgs(SolrCLI.java:476)
at org.apache.solr.cloud.PackageManagerCLITest.run(PackageManagerCLITest.java:221)
at org.apache.solr.cloud.PackageManagerCLITest.testPackageManager(PackageManagerCLITest.java:157)
at java.base/jdk.internal.reflect.NativeMethodAccessorImpl.invoke0(Native Method)
at java.base/jdk.internal.reflect.NativeMethodAccessorImpl.invoke(NativeMethodAccessorImpl.java:62)
at java.base/jdk.internal.reflect.DelegatingMethodAccessorImpl.invoke(DelegatingMethodAccessorImpl.java:43)
at java.base/java.lang.reflect.Method.invoke(Method.java:566)
at com.carrotsearch.randomizedtesting.RandomizedRunner.invoke(RandomizedRunner.java:1758)
at com.carrotsearch.randomizedtesting.RandomizedRunner$8.evaluate(RandomizedRunner.java:946)
at com.carrotsearch.randomizedtesting.RandomizedRunner$9.evaluate(RandomizedRunner.java:982)
at com.carrotsearch.randomizedtesting.RandomizedRunner$10.evaluate(RandomizedRunner.java:996)
at com.carrotsearch.randomizedtesting.rules.SystemPropertiesRestoreRule$1.evaluate(SystemPropertiesRestoreRule.java:80)
at org.junit.rules.RunRules.evaluate(RunRules.java:20)
at org.apache.lucene.tests.util.TestRuleSetupTeardownChained$1.evaluate(TestRuleSetupTeardownChained.java:48)
at org.apache.lucene.tests.util.AbstractBeforeAfterRule$1.evaluate(AbstractBeforeAfterRule.java:43)
at org.apache.lucene.tests.util.TestRuleThreadAndTestName$1.evaluate(TestRuleThreadAndTestName.java:45)
at org.apache.lucene.tests.util.TestRuleIgnoreAfterMaxFailures$1.evaluate(TestRuleIgnoreAfterMaxFailures.java:60)
at org.apache.lucene.tests.util.TestRuleMarkFailure$1.evaluate(TestRuleMarkFailure.java:44)
at org.junit.rules.RunRules.evaluate(RunRules.java:20)
at com.carrotsearch.randomizedtesting.rules.StatementAdapter.evaluate(StatementAdapter.java:36)
at com.carrotsearch.randomizedtesting.ThreadLeakControl$StatementRunner.run(ThreadLeakControl.java:390)
at com.carrotsearch.randomizedtesting.ThreadLeakControl.forkTimeoutingTask(ThreadLeakControl.java:843)
at com.carrotsearch.randomizedtesting.ThreadLeakControl$3.evaluate(ThreadLeakControl.java:490)
at com.carrotsearch.randomizedtesting.RandomizedRunner.runSingleTest(RandomizedRunner.java:955)
at com.carrotsearch.randomizedtesting.RandomizedRunner$5.evaluate(RandomizedRunner.java:840)
at com.carrotsearch.randomizedtesting.RandomizedRunner$6.evaluate(RandomizedRunner.java:891)
at com.carrotsearch.randomizedtesting.RandomizedRunner$7.evaluate(RandomizedRunner.java:902)
at com.carrotsearch.randomizedtesting.rules.StatementAdapter.evaluate(StatementAdapter.java:36)
at com.carrotsearch.randomizedtesting.rules.StatementAdapter.evaluate(StatementAdapter.java:36)
at org.apache.lucene.tests.util.AbstractBeforeAfterRule$1.evaluate(AbstractBeforeAfterRule.java:43)
at org.apache.lucene.tests.util.AbstractBeforeAfterRule$1.evaluate(AbstractBeforeAfterRule.java:43)
at com.carrotsearch.randomizedtesting.rules.SystemPropertiesRestoreRule$1.evaluate(SystemPropertiesRestoreRule.java:80)
at org.junit.rules.RunRules.evaluate(RunRules.java:20)
at org.apache.lucene.tests.util.AbstractBeforeAfterRule$1.evaluate(AbstractBeforeAfterRule.java:43)
at com.carrotsearch.randomizedtesting.rules.StatementAdapter.evaluate(StatementAdapter.java:36)
at org.apache.lucene.tests.util.TestRuleStoreClassName$1.evaluate(TestRuleStoreClassName.java:38)
at com.carrotsearch.randomizedtesting.rules.NoShadowingOrOverridesOnMethodsRule$1.evaluate(NoShadowingOrOverridesOnMethodsRule.java:40)
at com.carrotsearch.randomizedtesting.rules.NoShadowingOrOverridesOnMethodsRule$1.evaluate(NoShadowingOrOverridesOnMethodsRule.java:40)
at com.carrotsearch.randomizedtesting.rules.StatementAdapter.evaluate(StatementAdapter.java:36)
at com.carrotsearch.randomizedtesting.rules.StatementAdapter.evaluate(StatementAdapter.java:36)
at org.apache.lucene.tests.util.TestRuleAssertionsRequired$1.evaluate(TestRuleAssertionsRequired.java:53)
at org.apache.lucene.tests.util.AbstractBeforeAfterRule$1.evaluate(AbstractBeforeAfterRule.java:43)
at org.apache.lucene.tests.util.TestRuleMarkFailure$1.evaluate(TestRuleMarkFailure.java:44)
at org.apache.lucene.tests.util.TestRuleIgnoreAfterMaxFailures$1.evaluate(TestRuleIgnoreAfterMaxFailures.java:60)
at org.apache.lucene.tests.util.TestRuleIgnoreTestSuites$1.evaluate(TestRuleIgnoreTestSuites.java:47)
at org.junit.rules.RunRules.evaluate(RunRules.java:20)
at com.carrotsearch.randomizedtesting.rules.StatementAdapter.evaluate(StatementAdapter.java:36)
at com.carrotsearch.randomizedtesting.ThreadLeakControl$StatementRunner.run(ThreadLeakControl.java:390)
at com.carrotsearch.randomizedtesting.ThreadLeakControl.lambda$forkTimeoutingTask$0(ThreadLeakControl.java:850)
at java.base/java.lang.Thread.run(Thread.java:829)
FAILED: org.apache.solr.cloud.ReindexCollectionTest.testAbort
Error Message:
java.lang.AssertionError: {responseHeader={status=0, QTime=4}, exception={msg=Operation (asyncId: 43bfae94-33df-4931-bf3c-152bc631c050) failed due to server restart. Please resubmit., rspCode=500}, status={state=failed, msg=found [43bfae94-33df-4931-bf3c-152bc631c050] in failed tasks}}
Stack Trace:
java.lang.AssertionError: {responseHeader={status=0, QTime=4}, exception={msg=Operation (asyncId: 43bfae94-33df-4931-bf3c-152bc631c050) failed due to server restart. Please resubmit., rspCode=500}, status={state=failed, msg=found [43bfae94-33df-4931-bf3c-152bc631c050] in failed tasks}}
at __randomizedtesting.SeedInfo.seed([187E691D0A035F2F:7E1DDE8A7ED9CD56]:0)
at org.junit.Assert.fail(Assert.java:89)
at org.junit.Assert.assertTrue(Assert.java:42)
at org.junit.Assert.assertNotNull(Assert.java:713)
at org.apache.solr.cloud.ReindexCollectionTest.testAbort(ReindexCollectionTest.java:447)
at java.base/jdk.internal.reflect.NativeMethodAccessorImpl.invoke0(Native Method)
at java.base/jdk.internal.reflect.NativeMethodAccessorImpl.invoke(NativeMethodAccessorImpl.java:62)
at java.base/jdk.internal.reflect.DelegatingMethodAccessorImpl.invoke(DelegatingMethodAccessorImpl.java:43)
at java.base/java.lang.reflect.Method.invoke(Method.java:566)
at com.carrotsearch.randomizedtesting.RandomizedRunner.invoke(RandomizedRunner.java:1758)
at com.carrotsearch.randomizedtesting.RandomizedRunner$8.evaluate(RandomizedRunner.java:946)
at com.carrotsearch.randomizedtesting.RandomizedRunner$9.evaluate(RandomizedRunner.java:982)
at com.carrotsearch.randomizedtesting.RandomizedRunner$10.evaluate(RandomizedRunner.java:996)
at com.carrotsearch.randomizedtesting.rules.SystemPropertiesRestoreRule$1.evaluate(SystemPropertiesRestoreRule.java:80)
at org.junit.rules.RunRules.evaluate(RunRules.java:20)
at org.apache.lucene.tests.util.TestRuleSetupTeardownChained$1.evaluate(TestRuleSetupTeardownChained.java:48)
at org.apache.lucene.tests.util.AbstractBeforeAfterRule$1.evaluate(AbstractBeforeAfterRule.java:43)
at org.apache.lucene.tests.util.TestRuleThreadAndTestName$1.evaluate(TestRuleThreadAndTestName.java:45)
at org.apache.lucene.tests.util.TestRuleIgnoreAfterMaxFailures$1.evaluate(TestRuleIgnoreAfterMaxFailures.java:60)
at org.apache.lucene.tests.util.TestRuleMarkFailure$1.evaluate(TestRuleMarkFailure.java:44)
at org.junit.rules.RunRules.evaluate(RunRules.java:20)
at com.carrotsearch.randomizedtesting.rules.StatementAdapter.evaluate(StatementAdapter.java:36)
at com.carrotsearch.randomizedtesting.ThreadLeakControl$StatementRunner.run(ThreadLeakControl.java:390)
at com.carrotsearch.randomizedtesting.ThreadLeakControl.forkTimeoutingTask(ThreadLeakControl.java:843)
at com.carrotsearch.randomizedtesting.ThreadLeakControl$3.evaluate(ThreadLeakControl.java:490)
at com.carrotsearch.randomizedtesting.RandomizedRunner.runSingleTest(RandomizedRunner.java:955)
at com.carrotsearch.randomizedtesting.RandomizedRunner$5.evaluate(RandomizedRunner.java:840)
at com.carrotsearch.randomizedtesting.RandomizedRunner$6.evaluate(RandomizedRunner.java:891)
at com.carrotsearch.randomizedtesting.RandomizedRunner$7.evaluate(RandomizedRunner.java:902)
at com.carrotsearch.randomizedtesting.rules.StatementAdapter.evaluate(StatementAdapter.java:36)
at com.carrotsearch.randomizedtesting.rules.StatementAdapter.evaluate(StatementAdapter.java:36)
at org.apache.lucene.tests.util.AbstractBeforeAfterRule$1.evaluate(AbstractBeforeAfterRule.java:43)
at org.apache.lucene.tests.util.AbstractBeforeAfterRule$1.evaluate(AbstractBeforeAfterRule.java:43)
at com.carrotsearch.randomizedtesting.rules.SystemPropertiesRestoreRule$1.evaluate(SystemPropertiesRestoreRule.java:80)
at org.junit.rules.RunRules.evaluate(RunRules.java:20)
at org.apache.lucene.tests.util.AbstractBeforeAfterRule$1.evaluate(AbstractBeforeAfterRule.java:43)
at com.carrotsearch.randomizedtesting.rules.StatementAdapter.evaluate(StatementAdapter.java:36)
at org.apache.lucene.tests.util.TestRuleStoreClassName$1.evaluate(TestRuleStoreClassName.java:38)
at com.carrotsearch.randomizedtesting.rules.NoShadowingOrOverridesOnMethodsRule$1.evaluate(NoShadowingOrOverridesOnMethodsRule.java:40)
at com.carrotsearch.randomizedtesting.rules.NoShadowingOrOverridesOnMethodsRule$1.evaluate(NoShadowingOrOverridesOnMethodsRule.java:40)
at com.carrotsearch.randomizedtesting.rules.StatementAdapter.evaluate(StatementAdapter.java:36)
at com.carrotsearch.randomizedtesting.rules.StatementAdapter.evaluate(StatementAdapter.java:36)
at org.apache.lucene.tests.util.TestRuleAssertionsRequired$1.evaluate(TestRuleAssertionsRequired.java:53)
at org.apache.lucene.tests.util.AbstractBeforeAfterRule$1.evaluate(AbstractBeforeAfterRule.java:43)
at org.apache.lucene.tests.util.TestRuleMarkFailure$1.evaluate(TestRuleMarkFailure.java:44)
at org.apache.lucene.tests.util.TestRuleIgnoreAfterMaxFailures$1.evaluate(TestRuleIgnoreAfterMaxFailures.java:60)
at org.apache.lucene.tests.util.TestRuleIgnoreTestSuites$1.evaluate(TestRuleIgnoreTestSuites.java:47)
at org.junit.rules.RunRules.evaluate(RunRules.java:20)
at com.carrotsearch.randomizedtesting.rules.StatementAdapter.evaluate(StatementAdapter.java:36)
at com.carrotsearch.randomizedtesting.ThreadLeakControl$StatementRunner.run(ThreadLeakControl.java:390)
at com.carrotsearch.randomizedtesting.ThreadLeakControl.lambda$forkTimeoutingTask$0(ThreadLeakControl.java:850)
at java.base/java.lang.Thread.run(Thread.java:829)
FAILED: org.apache.solr.search.TestStressReorder.testStressReorderVersions
Error Message:
com.carrotsearch.randomizedtesting.UncaughtExceptionError: Captured an uncaught exception in thread: Thread[id=19330, name=READER5, state=RUNNABLE, group=TGRP-TestStressReorder]
Stack Trace:
com.carrotsearch.randomizedtesting.UncaughtExceptionError: Captured an uncaught exception in thread: Thread[id=19330, name=READER5, state=RUNNABLE, group=TGRP-TestStressReorder]
at __randomizedtesting.SeedInfo.seed([187E691D0A035F2F:4B8500B00C8DBA2]:0)
Caused by: java.lang.RuntimeException: java.util.concurrent.RejectedExecutionException: Task org.apache.solr.common.util.ExecutorUtil$MDCAwareThreadPoolExecutor$$Lambda$385/0x0000000100594840@16757b8b rejected from org.apache.solr.common.util.ExecutorUtil$MDCAwareThreadPoolExecutor@b70c713[Running, pool size = 1, active threads = 1, queued tasks = 1000, completed tasks = 36583]
at __randomizedtesting.SeedInfo.seed([187E691D0A035F2F]:0)
at org.apache.solr.search.TestStressReorder$2.run(TestStressReorder.java:357)
Caused by: java.util.concurrent.RejectedExecutionException: Task org.apache.solr.common.util.ExecutorUtil$MDCAwareThreadPoolExecutor$$Lambda$385/0x0000000100594840@16757b8b rejected from org.apache.solr.common.util.ExecutorUtil$MDCAwareThreadPoolExecutor@b70c713[Running, pool size = 1, active threads = 1, queued tasks = 1000, completed tasks = 36583]
at java.base/java.util.concurrent.ThreadPoolExecutor$AbortPolicy.rejectedExecution(ThreadPoolExecutor.java:2055)
at java.base/java.util.concurrent.ThreadPoolExecutor.reject(ThreadPoolExecutor.java:825)
at java.base/java.util.concurrent.ThreadPoolExecutor.execute(ThreadPoolExecutor.java:1355)
at org.apache.solr.common.util.ExecutorUtil$MDCAwareThreadPoolExecutor.execute(ExecutorUtil.java:430)
at org.apache.lucene.search.TaskExecutor$TaskGroup.invokeAll(TaskExecutor.java:152)
at org.apache.lucene.search.TaskExecutor.invokeAll(TaskExecutor.java:76)
at org.apache.lucene.index.TermStates.build(TermStates.java:116)
at org.apache.lucene.search.TermQuery.createWeight(TermQuery.java:275)
at org.apache.lucene.search.IndexSearcher.createWeight(IndexSearcher.java:882)
at org.apache.lucene.search.IndexSearcher.search(IndexSearcher.java:560)
at org.apache.solr.search.SolrIndexSearcher.buildAndRunCollectorChain(SolrIndexSearcher.java:276)
at org.apache.solr.search.SolrIndexSearcher.getDocListNC(SolrIndexSearcher.java:1932)
at org.apache.solr.search.SolrIndexSearcher.getDocListC(SolrIndexSearcher.java:1729)
at org.apache.solr.search.SolrIndexSearcher.search(SolrIndexSearcher.java:726)
at org.apache.solr.search.SolrIndexSearcher.search(SolrIndexSearcher.java:721)
at org.apache.solr.handler.component.QueryComponent.doProcessUngroupedSearch(QueryComponent.java:1690)
at org.apache.solr.handler.component.QueryComponent.process(QueryComponent.java:432)
at org.apache.solr.handler.component.SearchHandler.handleRequestBody(SearchHandler.java:456)
at org.apache.solr.handler.RequestHandlerBase.handleRequest(RequestHandlerBase.java:226)
at org.apache.solr.core.SolrCore.execute(SolrCore.java:2878)
at org.apache.solr.util.TestHarness.query(TestHarness.java:355)
at org.apache.solr.util.TestHarness.query(TestHarness.java:335)
at org.apache.solr.search.TestStressReorder$2.run(TestStressReorder.java:333)
FAILED: org.apache.solr.search.TestStressReorder.testStressReorderVersions
Error Message:
com.carrotsearch.randomizedtesting.UncaughtExceptionError: Captured an uncaught exception in thread: Thread[id=62, name=READER20, state=RUNNABLE, group=TGRP-TestStressReorder]
Stack Trace:
com.carrotsearch.randomizedtesting.UncaughtExceptionError: Captured an uncaught exception in thread: Thread[id=62, name=READER20, state=RUNNABLE, group=TGRP-TestStressReorder]
at __randomizedtesting.SeedInfo.seed([187E691D0A035F2F:4B8500B00C8DBA2]:0)
Caused by: java.lang.RuntimeException: java.util.concurrent.RejectedExecutionException: Task org.apache.solr.common.util.ExecutorUtil$MDCAwareThreadPoolExecutor$$Lambda$384/0x00000001005e4c40@7e03a326 rejected from org.apache.solr.common.util.ExecutorUtil$MDCAwareThreadPoolExecutor@57cb57[Running, pool size = 1, active threads = 1, queued tasks = 1000, completed tasks = 56746]
at __randomizedtesting.SeedInfo.seed([187E691D0A035F2F]:0)
at org.apache.solr.search.TestStressReorder$2.run(TestStressReorder.java:357)
Caused by: java.util.concurrent.RejectedExecutionException: Task org.apache.solr.common.util.ExecutorUtil$MDCAwareThreadPoolExecutor$$Lambda$384/0x00000001005e4c40@7e03a326 rejected from org.apache.solr.common.util.ExecutorUtil$MDCAwareThreadPoolExecutor@57cb57[Running, pool size = 1, active threads = 1, queued tasks = 1000, completed tasks = 56746]
at java.base/java.util.concurrent.ThreadPoolExecutor$AbortPolicy.rejectedExecution(ThreadPoolExecutor.java:2055)
at java.base/java.util.concurrent.ThreadPoolExecutor.reject(ThreadPoolExecutor.java:825)
at java.base/java.util.concurrent.ThreadPoolExecutor.execute(ThreadPoolExecutor.java:1355)
at org.apache.solr.common.util.ExecutorUtil$MDCAwareThreadPoolExecutor.execute(ExecutorUtil.java:430)
at org.apache.lucene.search.TaskExecutor$TaskGroup.invokeAll(TaskExecutor.java:152)
at org.apache.lucene.search.TaskExecutor.invokeAll(TaskExecutor.java:76)
at org.apache.lucene.index.TermStates.build(TermStates.java:116)
at org.apache.lucene.search.TermQuery.createWeight(TermQuery.java:275)
at org.apache.lucene.search.IndexSearcher.createWeight(IndexSearcher.java:882)
at org.apache.lucene.search.IndexSearcher.search(IndexSearcher.java:560)
at org.apache.solr.search.SolrIndexSearcher.buildAndRunCollectorChain(SolrIndexSearcher.java:276)
at org.apache.solr.search.SolrIndexSearcher.getDocListNC(SolrIndexSearcher.java:1932)
at org.apache.solr.search.SolrIndexSearcher.getDocListC(SolrIndexSearcher.java:1729)
at org.apache.solr.search.SolrIndexSearcher.search(SolrIndexSearcher.java:726)
at org.apache.solr.search.SolrIndexSearcher.search(SolrIndexSearcher.java:721)
at org.apache.solr.handler.component.QueryComponent.doProcessUngroupedSearch(QueryComponent.java:1690)
at org.apache.solr.handler.component.QueryComponent.process(QueryComponent.java:432)
at org.apache.solr.handler.component.SearchHandler.handleRequestBody(SearchHandler.java:456)
at org.apache.solr.handler.RequestHandlerBase.handleRequest(RequestHandlerBase.java:226)
at org.apache.solr.core.SolrCore.execute(SolrCore.java:2878)
at org.apache.solr.util.TestHarness.query(TestHarness.java:355)
at org.apache.solr.util.TestHarness.query(TestHarness.java:335)
at org.apache.solr.search.TestStressReorder$2.run(TestStressReorder.java:333)
FAILED: org.apache.solr.search.TestStressReorder.testStressReorderVersions
Error Message:
com.carrotsearch.randomizedtesting.UncaughtExceptionError: Captured an uncaught exception in thread: Thread[id=53, name=READER11, state=RUNNABLE, group=TGRP-TestStressReorder]
Stack Trace:
com.carrotsearch.randomizedtesting.UncaughtExceptionError: Captured an uncaught exception in thread: Thread[id=53, name=READER11, state=RUNNABLE, group=TGRP-TestStressReorder]
Caused by: java.lang.RuntimeException: java.util.concurrent.RejectedExecutionException: Task org.apache.solr.common.util.ExecutorUtil$MDCAwareThreadPoolExecutor$$Lambda$384/0x00000001005e4c40@673dce3d rejected from org.apache.solr.common.util.ExecutorUtil$MDCAwareThreadPoolExecutor@610ac85d[Running, pool size = 1, active threads = 1, queued tasks = 1000, completed tasks = 199607]
at __randomizedtesting.SeedInfo.seed([187E691D0A035F2F]:0)
at org.apache.solr.search.TestStressReorder$2.run(TestStressReorder.java:357)
Caused by: java.util.concurrent.RejectedExecutionException: Task org.apache.solr.common.util.ExecutorUtil$MDCAwareThreadPoolExecutor$$Lambda$384/0x00000001005e4c40@673dce3d rejected from org.apache.solr.common.util.ExecutorUtil$MDCAwareThreadPoolExecutor@610ac85d[Running, pool size = 1, active threads = 1, queued tasks = 1000, completed tasks = 199607]
at java.base/java.util.concurrent.ThreadPoolExecutor$AbortPolicy.rejectedExecution(ThreadPoolExecutor.java:2055)
at java.base/java.util.concurrent.ThreadPoolExecutor.reject(ThreadPoolExecutor.java:825)
at java.base/java.util.concurrent.ThreadPoolExecutor.execute(ThreadPoolExecutor.java:1355)
at org.apache.solr.common.util.ExecutorUtil$MDCAwareThreadPoolExecutor.execute(ExecutorUtil.java:430)
at org.apache.lucene.search.TaskExecutor$TaskGroup.invokeAll(TaskExecutor.java:152)
at org.apache.lucene.search.TaskExecutor.invokeAll(TaskExecutor.java:76)
at org.apache.lucene.index.TermStates.build(TermStates.java:116)
at org.apache.lucene.search.TermQuery.createWeight(TermQuery.java:275)
at org.apache.lucene.search.IndexSearcher.createWeight(IndexSearcher.java:882)
at org.apache.lucene.search.IndexSearcher.search(IndexSearcher.java:560)
at org.apache.solr.search.SolrIndexSearcher.buildAndRunCollectorChain(SolrIndexSearcher.java:276)
at org.apache.solr.search.SolrIndexSearcher.getDocListNC(SolrIndexSearcher.java:1932)
at org.apache.solr.search.SolrIndexSearcher.getDocListC(SolrIndexSearcher.java:1729)
at org.apache.solr.search.SolrIndexSearcher.search(SolrIndexSearcher.java:726)
at org.apache.solr.search.SolrIndexSearcher.search(SolrIndexSearcher.java:721)
at org.apache.solr.handler.component.QueryComponent.doProcessUngroupedSearch(QueryComponent.java:1690)
at org.apache.solr.handler.component.QueryComponent.process(QueryComponent.java:432)
at org.apache.solr.handler.component.SearchHandler.handleRequestBody(SearchHandler.java:456)
at org.apache.solr.handler.RequestHandlerBase.handleRequest(RequestHandlerBase.java:226)
at org.apache.solr.core.SolrCore.execute(SolrCore.java:2878)
at org.apache.solr.util.TestHarness.query(TestHarness.java:355)
at org.apache.solr.util.TestHarness.query(TestHarness.java:335)
at org.apache.solr.search.TestStressReorder$2.run(TestStressReorder.java:333)
FAILED: org.apache.solr.search.TestStressReorder.testStressReorderVersions
Error Message:
com.carrotsearch.randomizedtesting.UncaughtExceptionError: Captured an uncaught exception in thread: Thread[id=55, name=READER13, state=RUNNABLE, group=TGRP-TestStressReorder]
Stack Trace:
com.carrotsearch.randomizedtesting.UncaughtExceptionError: Captured an uncaught exception in thread: Thread[id=55, name=READER13, state=RUNNABLE, group=TGRP-TestStressReorder]
Caused by: java.lang.RuntimeException: java.util.concurrent.RejectedExecutionException: Task org.apache.solr.common.util.ExecutorUtil$MDCAwareThreadPoolExecutor$$Lambda$384/0x00000001005e4c40@771331d4 rejected from org.apache.solr.common.util.ExecutorUtil$MDCAwareThreadPoolExecutor@45fa6bcb[Running, pool size = 1, active threads = 1, queued tasks = 1000, completed tasks = 40084]
at __randomizedtesting.SeedInfo.seed([187E691D0A035F2F]:0)
at org.apache.solr.search.TestStressReorder$2.run(TestStressReorder.java:357)
Caused by: java.util.concurrent.RejectedExecutionException: Task org.apache.solr.common.util.ExecutorUtil$MDCAwareThreadPoolExecutor$$Lambda$384/0x00000001005e4c40@771331d4 rejected from org.apache.solr.common.util.ExecutorUtil$MDCAwareThreadPoolExecutor@45fa6bcb[Running, pool size = 1, active threads = 1, queued tasks = 1000, completed tasks = 40084]
at java.base/java.util.concurrent.ThreadPoolExecutor$AbortPolicy.rejectedExecution(ThreadPoolExecutor.java:2055)
at java.base/java.util.concurrent.ThreadPoolExecutor.reject(ThreadPoolExecutor.java:825)
at java.base/java.util.concurrent.ThreadPoolExecutor.execute(ThreadPoolExecutor.java:1355)
at org.apache.solr.common.util.ExecutorUtil$MDCAwareThreadPoolExecutor.execute(ExecutorUtil.java:430)
at org.apache.lucene.search.TaskExecutor$TaskGroup.invokeAll(TaskExecutor.java:152)
at org.apache.lucene.search.TaskExecutor.invokeAll(TaskExecutor.java:76)
at org.apache.lucene.index.TermStates.build(TermStates.java:116)
at org.apache.lucene.search.TermQuery.createWeight(TermQuery.java:275)
at org.apache.lucene.search.IndexSearcher.createWeight(IndexSearcher.java:882)
at org.apache.lucene.search.IndexSearcher.search(IndexSearcher.java:560)
at org.apache.solr.search.SolrIndexSearcher.buildAndRunCollectorChain(SolrIndexSearcher.java:276)
at org.apache.solr.search.SolrIndexSearcher.getDocListNC(SolrIndexSearcher.java:1932)
at org.apache.solr.search.SolrIndexSearcher.getDocListC(SolrIndexSearcher.java:1729)
at org.apache.solr.search.SolrIndexSearcher.search(SolrIndexSearcher.java:726)
at org.apache.solr.search.SolrIndexSearcher.search(SolrIndexSearcher.java:721)
at org.apache.solr.handler.component.QueryComponent.doProcessUngroupedSearch(QueryComponent.java:1690)
at org.apache.solr.handler.component.QueryComponent.process(QueryComponent.java:432)
at org.apache.solr.handler.component.SearchHandler.handleRequestBody(SearchHandler.java:456)
at org.apache.solr.handler.RequestHandlerBase.handleRequest(RequestHandlerBase.java:226)
at org.apache.solr.core.SolrCore.execute(SolrCore.java:2878)
at org.apache.solr.util.TestHarness.query(TestHarness.java:355)
at org.apache.solr.util.TestHarness.query(TestHarness.java:335)
at org.apache.solr.search.TestStressReorder$2.run(TestStressReorder.java:333)
Build Log:
[...truncated 109145 lines...]
# ERROR: --version is not supported by this script
#
#
# Usage: solr start [-f] [-c] [--host host] [-p port] [-d directory] [-z zkHost] [-m memory] [-e example] [-s solr.solr.home] [-t solr.data.home] [--jvm-opts "jvm-opts"] [-V]
#
# -f Start Solr in foreground; default starts Solr in the background
# and sends stdout / stderr to solr-PORT-console.log
#
# -c or --cloud Start Solr in SolrCloud mode; if -z not supplied and ZK_HOST not defined in
# solr.in.sh, an embedded ZooKeeper instance is started on Solr port+1000,
# such as 9983 if Solr is bound to 8983
#
# --host <host> Specify the hostname for this Solr instance
#
# -p/--port <port> Specify the port to start the Solr HTTP listener on; default is 8983
# The specified port (SOLR_PORT) will also be used to determine the stop port
# STOP_PORT=($SOLR_PORT-1000) and JMX RMI listen port RMI_PORT=($SOLR_PORT+10000).
# For instance, if you set -p 8985, then the STOP_PORT=7985 and RMI_PORT=18985
#
# -d <dir> Specify the Solr server directory; defaults to server
#
# -z/--zk-host <zkHost> Zookeeper connection string; only used when running in SolrCloud mode using -c
# If neither ZK_HOST is defined in solr.in.sh nor the -z parameter is specified,
# an embedded ZooKeeper instance will be launched.
# Set the ZK_CREATE_CHROOT environment variable to true if your ZK host has a chroot path, and you want to create it automatically.
#
# -m/--memory <memory> Sets the min (-Xms) and max (-Xmx) heap size for the JVM, such as: -m 4g
# results in: -Xms4g -Xmx4g; by default, this script sets the heap size to 512m
#
# -s <dir> Sets the solr.solr.home system property; Solr will create core directories under
# this directory. This allows you to run multiple Solr instances on the same host
# while reusing the same server directory set using the -d parameter. If set, the
# specified directory should contain a solr.xml file, unless solr.xml exists in Zookeeper.
# This parameter is ignored when running examples (-e), as the solr.solr.home depends
# on which example is run. The default value is server/solr. If passed relative dir,
# validation with current dir will be done, before trying default server/<dir>
#
# -t/--data-home <dir> Sets the solr.data.home system property, where Solr will store index data in <instance_dir>/data subdirectories.
# If not set, Solr uses solr.solr.home for config and data.
#
# -e <example> Name of the example to run; available examples:
# cloud: SolrCloud example
# techproducts: Comprehensive example illustrating many of Solr's core capabilities
# schemaless: Schema-less example (schema is inferred from data during indexing)
# films: Example of starting with _default configset and adding explicit fields dynamically
#
# --jvm-opts <jvmParams> Additional parameters to pass to the JVM when starting Solr, such as to setup
# Java debug options. For example, to enable a Java debugger to attach to the Solr JVM
# you could pass: --jvm-opts "-agentlib:jdwp=transport=dt_socket,server=y,suspend=n,address=18983"
# In most cases, you should wrap the additional parameters in double quotes.
#
# -j <jettyParams> Additional parameters to pass to Jetty when starting Solr.
# For example, to add configuration folder that jetty should read
# you could pass: -j "--include-jetty-dir=/etc/jetty/custom/server/"
# In most cases, you should wrap the additional parameters in double quotes.
#
# --no-prompt Don't prompt for input; accept all defaults when running examples that accept user input
#
# --force If attempting to start Solr as the root user, the script will exit with a warning that running Solr as "root" can cause problems.
# It is possible to override this warning with the '--force' parameter.
#
# --verbose or --quiet/-q Verbose or quiet logging. Sets default log level of Solr to DEBUG or WARN instead of INFO
# --
#
# Last output:
#
# ERROR: --version is not supported by this script
#
#
# Usage: solr start [-f] [-c] [--host host] [-p port] [-d directory] [-z zkHost] [-m memory] [-e example] [-s solr.solr.home] [-t solr.data.home] [--jvm-opts "jvm-opts"] [-V]
#
# -f Start Solr in foreground; default starts Solr in the background
# and sends stdout / stderr to solr-PORT-console.log
#
# -c or --cloud Start Solr in SolrCloud mode; if -z not supplied and ZK_HOST not defined in
# solr.in.sh, an embedded ZooKeeper instance is started on Solr port+1000,
# such as 9983 if Solr is bound to 8983
#
# --host <host> Specify the hostname for this Solr instance
#
# -p/--port <port> Specify the port to start the Solr HTTP listener on; default is 8983
# The specified port (SOLR_PORT) will also be used to determine the stop port
# STOP_PORT=($SOLR_PORT-1000) and JMX RMI listen port RMI_PORT=($SOLR_PORT+10000).
# For instance, if you set -p 8985, then the STOP_PORT=7985 and RMI_PORT=18985
#
# -d <dir> Specify the Solr server directory; defaults to server
#
# -z/--zk-host <zkHost> Zookeeper connection string; only used when running in SolrCloud mode using -c
# If neither ZK_HOST is defined in solr.in.sh nor the -z parameter is specified,
# an embedded ZooKeeper instance will be launched.
# Set the ZK_CREATE_CHROOT environment variable to true if your ZK host has a chroot path, and you want to create it automatically.
#
# -m/--memory <memory> Sets the min (-Xms) and max (-Xmx) heap size for the JVM, such as: -m 4g
# results in: -Xms4g -Xmx4g; by default, this script sets the heap size to 512m
#
# -s <dir> Sets the solr.solr.home system property; Solr will create core directories under
# this directory. This allows you to run multiple Solr instances on the same host
# while reusing the same server directory set using the -d parameter. If set, the
# specified directory should contain a solr.xml file, unless solr.xml exists in Zookeeper.
# This parameter is ignored when running examples (-e), as the solr.solr.home depends
# on which example is run. The default value is server/solr. If passed relative dir,
# validation with current dir will be done, before trying default server/<dir>
#
# -t/--data-home <dir> Sets the solr.data.home system property, where Solr will store index data in <instance_dir>/data subdirectories.
# If not set, Solr uses solr.solr.home for config and data.
#
# -e <example> Name of the example to run; available examples:
# cloud: SolrCloud example
# techproducts: Comprehensive example illustrating many of Solr's core capabilities
# schemaless: Schema-less example (schema is inferred from data during indexing)
# films: Example of starting with _default configset and adding explicit fields dynamically
#
# --jvm-opts <jvmParams> Additional parameters to pass to the JVM when starting Solr, such as to setup
# Java debug options. For example, to enable a Java debugger to attach to the Solr JVM
# you could pass: --jvm-opts "-agentlib:jdwp=transport=dt_socket,server=y,suspend=n,address=18983"
# In most cases, you should wrap the additional parameters in double quotes.
#
# -j <jettyParams> Additional parameters to pass to Jetty when starting Solr.
# For example, to add configuration folder that jetty should read
# you could pass: -j "--include-jetty-dir=/etc/jetty/custom/server/"
# In most cases, you should wrap the additional parameters in double quotes.
#
# --no-prompt Don't prompt for input; accept all defaults when running examples that accept user input
#
# --force If attempting to start Solr as the root user, the script will exit with a warning that running Solr as "root" can cause problems.
# It is possible to override this warning with the '--force' parameter.
#
# --verbose or --quiet/-q Verbose or quiet logging. Sets default log level of Solr to DEBUG or WARN instead of INFO
not ok 87 -version and version both return Solr version and deprecation # in 558 ms
# (from function `assert_output' in file /home/jenkins/jenkins-slave/workspace/Solr/Solr-Check-9.x/.gradle/node/packaging/node_modules/bats-assert/src/assert.bash, line 247,
# in test file test/test_version.bats, line 35)
# `assert_output --partial "Solr version is:"' failed
#
# -- output does not contain substring --
# substring (1 lines):
# Solr version is:
# output (63 lines):
#
# ERROR: -version is not supported by this script
#
#
# Usage: solr start [-f] [-c] [--host host] [-p port] [-d directory] [-z zkHost] [-m memory] [-e example] [-s solr.solr.home] [-t solr.data.home] [--jvm-opts "jvm-opts"] [-V]
#
# -f Start Solr in foreground; default starts Solr in the background
# and sends stdout / stderr to solr-PORT-console.log
#
# -c or --cloud Start Solr in SolrCloud mode; if -z not supplied and ZK_HOST not defined in
# solr.in.sh, an embedded ZooKeeper instance is started on Solr port+1000,
# such as 9983 if Solr is bound to 8983
#
# --host <host> Specify the hostname for this Solr instance
#
# -p/--port <port> Specify the port to start the Solr HTTP listener on; default is 8983
# The specified port (SOLR_PORT) will also be used to determine the stop port
# STOP_PORT=($SOLR_PORT-1000) and JMX RMI listen port RMI_PORT=($SOLR_PORT+10000).
# For instance, if you set -p 8985, then the STOP_PORT=7985 and RMI_PORT=18985
#
# -d <dir> Specify the Solr server directory; defaults to server
#
# -z/--zk-host <zkHost> Zookeeper connection string; only used when running in SolrCloud mode using -c
# If neither ZK_HOST is defined in solr.in.sh nor the -z parameter is specified,
# an embedded ZooKeeper instance will be launched.
# Set the ZK_CREATE_CHROOT environment variable to true if your ZK host has a chroot path, and you want to create it automatically.
#
# -m/--memory <memory> Sets the min (-Xms) and max (-Xmx) heap size for the JVM, such as: -m 4g
# results in: -Xms4g -Xmx4g; by default, this script sets the heap size to 512m
#
# -s <dir> Sets the solr.solr.home system property; Solr will create core directories under
# this directory. This allows you to run multiple Solr instances on the same host
# while reusing the same server directory set using the -d parameter. If set, the
# specified directory should contain a solr.xml file, unless solr.xml exists in Zookeeper.
# This parameter is ignored when running examples (-e), as the solr.solr.home depends
# on which example is run. The default value is server/solr. If passed relative dir,
# validation with current dir will be done, before trying default server/<dir>
#
# -t/--data-home <dir> Sets the solr.data.home system property, where Solr will store index data in <instance_dir>/data subdirectories.
# If not set, Solr uses solr.solr.home for config and data.
#
# -e <example> Name of the example to run; available examples:
# cloud: SolrCloud example
# techproducts: Comprehensive example illustrating many of Solr's core capabilities
# schemaless: Schema-less example (schema is inferred from data during indexing)
# films: Example of starting with _default configset and adding explicit fields dynamically
#
# --jvm-opts <jvmParams> Additional parameters to pass to the JVM when starting Solr, such as to setup
# Java debug options. For example, to enable a Java debugger to attach to the Solr JVM
# you could pass: --jvm-opts "-agentlib:jdwp=transport=dt_socket,server=y,suspend=n,address=18983"
# In most cases, you should wrap the additional parameters in double quotes.
#
# -j <jettyParams> Additional parameters to pass to Jetty when starting Solr.
# For example, to add configuration folder that jetty should read
# you could pass: -j "--include-jetty-dir=/etc/jetty/custom/server/"
# In most cases, you should wrap the additional parameters in double quotes.
#
# --no-prompt Don't prompt for input; accept all defaults when running examples that accept user input
#
# --force If attempting to start Solr as the root user, the script will exit with a warning that running Solr as "root" can cause problems.
# It is possible to override this warning with the '--force' parameter.
#
# --verbose or --quiet/-q Verbose or quiet logging. Sets default log level of Solr to DEBUG or WARN instead of INFO
# --
#
# Last output:
#
# ERROR: -version is not supported by this script
#
#
# Usage: solr start [-f] [-c] [--host host] [-p port] [-d directory] [-z zkHost] [-m memory] [-e example] [-s solr.solr.home] [-t solr.data.home] [--jvm-opts "jvm-opts"] [-V]
#
# -f Start Solr in foreground; default starts Solr in the background
# and sends stdout / stderr to solr-PORT-console.log
#
# -c or --cloud Start Solr in SolrCloud mode; if -z not supplied and ZK_HOST not defined in
# solr.in.sh, an embedded ZooKeeper instance is started on Solr port+1000,
# such as 9983 if Solr is bound to 8983
#
# --host <host> Specify the hostname for this Solr instance
#
# -p/--port <port> Specify the port to start the Solr HTTP listener on; default is 8983
# The specified port (SOLR_PORT) will also be used to determine the stop port
# STOP_PORT=($SOLR_PORT-1000) and JMX RMI listen port RMI_PORT=($SOLR_PORT+10000).
# For instance, if you set -p 8985, then the STOP_PORT=7985 and RMI_PORT=18985
#
# -d <dir> Specify the Solr server directory; defaults to server
#
# -z/--zk-host <zkHost> Zookeeper connection string; only used when running in SolrCloud mode using -c
# If neither ZK_HOST is defined in solr.in.sh nor the -z parameter is specified,
# an embedded ZooKeeper instance will be launched.
# Set the ZK_CREATE_CHROOT environment variable to true if your ZK host has a chroot path, and you want to create it automatically.
#
# -m/--memory <memory> Sets the min (-Xms) and max (-Xmx) heap size for the JVM, such as: -m 4g
# results in: -Xms4g -Xmx4g; by default, this script sets the heap size to 512m
#
# -s <dir> Sets the solr.solr.home system property; Solr will create core directories under
# this directory. This allows you to run multiple Solr instances on the same host
# while reusing the same server directory set using the -d parameter. If set, the
# specified directory should contain a solr.xml file, unless solr.xml exists in Zookeeper.
# This parameter is ignored when running examples (-e), as the solr.solr.home depends
# on which example is run. The default value is server/solr. If passed relative dir,
# validation with current dir will be done, before trying default server/<dir>
#
# -t/--data-home <dir> Sets the solr.data.home system property, where Solr will store index data in <instance_dir>/data subdirectories.
# If not set, Solr uses solr.solr.home for config and data.
#
# -e <example> Name of the example to run; available examples:
# cloud: SolrCloud example
# techproducts: Comprehensive example illustrating many of Solr's core capabilities
# schemaless: Schema-less example (schema is inferred from data during indexing)
# films: Example of starting with _default configset and adding explicit fields dynamically
#
# --jvm-opts <jvmParams> Additional parameters to pass to the JVM when starting Solr, such as to setup
# Java debug options. For example, to enable a Java debugger to attach to the Solr JVM
# you could pass: --jvm-opts "-agentlib:jdwp=transport=dt_socket,server=y,suspend=n,address=18983"
# In most cases, you should wrap the additional parameters in double quotes.
#
# -j <jettyParams> Additional parameters to pass to Jetty when starting Solr.
# For example, to add configuration folder that jetty should read
# you could pass: -j "--include-jetty-dir=/etc/jetty/custom/server/"
# In most cases, you should wrap the additional parameters in double quotes.
#
# --no-prompt Don't prompt for input; accept all defaults when running examples that accept user input
#
# --force If attempting to start Solr as the root user, the script will exit with a warning that running Solr as "root" can cause problems.
# It is possible to override this warning with the '--force' parameter.
#
# --verbose or --quiet/-q Verbose or quiet logging. Sets default log level of Solr to DEBUG or WARN instead of INFO
ok 88 short help # in 1175 ms
ok 89 short help is inferred # in 1057 ms
ok 90 long help # in 1040 ms
ok 91 running subcommands with zk is prevented # in 2014 ms
ok 92 listing out files # in 2364 ms
ok 93 connecting to solr via various solr urls and zk hosts # in 12971 ms
ok 94 copying files around # in 21837 ms
ok 95 upconfig # in 9761 ms
ok 96 downconfig # in 2648 ms
ok 97 zkcli.sh gets 'solrhome' from 'solr.home' system property # in 1864 ms
ok 98 zkcli.sh gets 'solrhome' from 'solrhome' command line option # in 1904 ms
ok 99 bin/solr zk cp gets 'solrhome' from '--solr-home' command line option # in 2039 ms
ok 100 Cleanup # in 1350 ms
> Task :solr:packaging:integrationTests FAILED
ERROR: The following test(s) have failed:
- org.apache.solr.cloud.PackageManagerCLITest.testPackageManager (:solr:core)
Test history: https://ge.apache.org/scans/tests?search.rootProjectNames=solr-root&tests.container=org.apache.solr.cloud.PackageManagerCLITest&tests.test=testPackageManager http://fucit.org/solr-jenkins-reports/history-trend-of-recent-failures.html#series/org.apache.solr.cloud.PackageManagerCLITest.testPackageManager
Test output: /home/jenkins/jenkins-slave/workspace/Solr/Solr-Check-9.x/solr/core/build/test-results/test/outputs/OUTPUT-org.apache.solr.cloud.PackageManagerCLITest.txt
Reproduce with: ./gradlew :solr:core:test --tests "org.apache.solr.cloud.PackageManagerCLITest.testPackageManager" -Ptests.jvms=4 -Ptests.haltonfailure=false "-Ptests.jvmargs=-XX:TieredStopAtLevel=1 -XX:+UseParallelGC -XX:ActiveProcessorCount=1 -XX:ReservedCodeCacheSize=120m" -Ptests.seed=187E691D0A035F2F -Ptests.multiplier=2 -Ptests.badapples=false -Ptests.file.encoding=UTF-8
- org.apache.solr.cloud.ReindexCollectionTest.testAbort (:solr:core)
Test history: https://ge.apache.org/scans/tests?search.rootProjectNames=solr-root&tests.container=org.apache.solr.cloud.ReindexCollectionTest&tests.test=testAbort http://fucit.org/solr-jenkins-reports/history-trend-of-recent-failures.html#series/org.apache.solr.cloud.ReindexCollectionTest.testAbort
Test output: /home/jenkins/jenkins-slave/workspace/Solr/Solr-Check-9.x/solr/core/build/test-results/test/outputs/OUTPUT-org.apache.solr.cloud.ReindexCollectionTest.txt
Reproduce with: ./gradlew :solr:core:test --tests "org.apache.solr.cloud.ReindexCollectionTest.testAbort" -Ptests.jvms=4 -Ptests.haltonfailure=false "-Ptests.jvmargs=-XX:TieredStopAtLevel=1 -XX:+UseParallelGC -XX:ActiveProcessorCount=1 -XX:ReservedCodeCacheSize=120m" -Ptests.seed=187E691D0A035F2F -Ptests.multiplier=2 -Ptests.badapples=false -Ptests.file.encoding=UTF-8
- org.apache.solr.search.TestStressReorder.testStressReorderVersions (:solr:core)
Test history: https://ge.apache.org/scans/tests?search.rootProjectNames=solr-root&tests.container=org.apache.solr.search.TestStressReorder&tests.test=testStressReorderVersions http://fucit.org/solr-jenkins-reports/history-trend-of-recent-failures.html#series/org.apache.solr.search.TestStressReorder.testStressReorderVersions
Test output: /home/jenkins/jenkins-slave/workspace/Solr/Solr-Check-9.x/solr/core/build/test-results/test/outputs/OUTPUT-org.apache.solr.search.TestStressReorder.txt
Reproduce with: ./gradlew :solr:core:test --tests "org.apache.solr.search.TestStressReorder.testStressReorderVersions" -Ptests.jvms=4 -Ptests.haltonfailure=false "-Ptests.jvmargs=-XX:TieredStopAtLevel=1 -XX:+UseParallelGC -XX:ActiveProcessorCount=1 -XX:ReservedCodeCacheSize=120m" -Ptests.seed=187E691D0A035F2F -Ptests.multiplier=2 -Ptests.badapples=false -Ptests.file.encoding=UTF-8
FAILURE: Build failed with an exception.
* Where:
Build file '/home/jenkins/jenkins-slave/workspace/Solr/Solr-Check-9.x/solr/packaging/build.gradle' line: 314
* What went wrong:
Execution failed for task ':solr:packaging:integrationTests'.
> Process 'command '/home/jenkins/jenkins-slave/workspace/Solr/Solr-Check-9.x/.gradle/node/packaging/node_modules/bats/bin/bats'' finished with non-zero exit value 1
* Try:
> Run with --stacktrace option to get the stack trace.
> Run with --info or --debug option to get more log output.
> Get more help at https://help.gradle.org.
Deprecated Gradle features were used in this build, making it incompatible with Gradle 9.0.
You can use '--warning-mode all' to show the individual deprecation warnings and determine if they come from your own scripts or plugins.
For more on this, please refer to https://docs.gradle.org/8.4/userguide/command_line_interface.html#sec:command_line_warnings in the Gradle documentation.
BUILD FAILED in 1h 16m 28s
742 actionable tasks: 742 executed
Publishing build scan...
https://ge.apache.org/s/txev5ybn4sqfw
Build step 'Invoke Gradle script' changed build result to FAILURE
Build step 'Invoke Gradle script' marked build as failure
Archiving artifacts
Recording test results
[Checks API] No suitable checks publisher found.
Email was triggered for: Failure - Any
Sending email for trigger: Failure - Any
[JENKINS] Solr » Solr-Check-9.x - Build # 6191 - Still Failing!
Posted by Apache Jenkins Server <je...@builds.apache.org>.
Build: https://ci-builds.apache.org/job/Solr/job/Solr-Check-9.x/6191/
No tests ran.
Build Log:
[...truncated 36 lines...]
ERROR: Timeout after 10 minutes
ERROR: Error cloning remote repo 'origin'
hudson.plugins.git.GitException: Command "git fetch --tags --progress -- https://gitbox.apache.org/repos/asf/solr.git +refs/heads/*:refs/remotes/origin/*" returned status code 128:
stdout:
stderr: remote: Enumerating objects: 1
remote: Enumerating objects: 1302925, done.
remote: Counting objects: 0% (1/1302925)
remote: Counting objects: 1% (13030/1302925)
remote: Counting objects: 2% (26059/1302925)
remote: Counting objects: 3% (39088/1302925)
remote: Counting objects: 4% (52117/1302925)
remote: Counting objects: 5% (65147/1302925)
remote: Counting objects: 6% (78176/1302925)
remote: Counting objects: 7% (91205/1302925)
remote: Counting objects: 8% (104234/1302925)
remote: Counting objects: 9% (117264/1302925)
remote: Counting objects: 10% (130293/1302925)
remote: Counting objects: 11% (143322/1302925)
remote: Counting objects: 12% (156351/1302925)
remote: Counting objects: 13% (169381/1302925)
remote: Counting objects: 14% (182410/1302925)
remote: Counting objects: 15% (195439/1302925)
remote: Counting objects: 16% (208468/1302925)
remote: Counting objects: 17% (221498/1302925)
remote: Counting objects: 18% (234527/1302925)
remote: Counting objects: 19% (247556/1302925)
remote: Counting objects: 20% (260585/1302925)
remote: Counting objects: 21% (273615/1302925)
remote: Counting objects: 22% (286644/1302925)
remote: Counting objects: 23% (299673/1302925)
remote: Counting objects: 24% (312702/1302925)
remote: Counting objects: 25% (325732/1302925)
remote: Counting objects: 26% (338761/1302925)
remote: Counting objects: 27% (351790/1302925)
remote: Counting objects: 28% (364819/1302925)
remote: Counting objects: 29% (377849/1302925)
remote: Counting objects: 30% (390878/1302925)
remote: Counting objects: 31% (403907/1302925)
remote: Counting objects: 32% (416936/1302925)
remote: Counting objects: 33% (429966/1302925)
remote: Counting objects: 34% (442995/1302925)
remote: Counting objects: 35% (456024/1302925)
remote: Counting objects: 36% (469053/1302925)
remote: Counting objects: 37% (482083/1302925)
remote: Counting objects: 38% (495112/1302925)
remote: Counting objects: 39% (508141/1302925)
remote: Counting objects: 40% (521170/1302925)
remote: Counting objects: 41% (534200/1302925)
remote: Counting objects: 42% (547229/1302925)
remote: Counting objects: 43% (560258/1302925)
remote: Counting objects: 44% (573287/1302925)
remote: Counting objects: 45% (586317/1302925)
remote: Counting objects: 46% (599346/1302925)
remote: Counting objects: 47% (612375/1302925)
remote: Counting objects: 48% (625404/1302925)
remote: Counting objects: 49% (638434/1302925)
remote: Counting objects: 50% (651463/1302925)
remote: Counting objects: 51% (664492/1302925)
remote: Counting objects: 52% (677521/1302925)
remote: Counting objects: 53% (690551/1302925)
remote: Counting objects: 54% (703580/1302925)
remote: Counting objects: 55% (716609/1302925)
remote: Counting objects: 56% (729638/1302925)
remote: Counting objects: 57% (742668/1302925)
remote: Counting objects: 58% (755697/1302925)
remote: Counting objects: 59% (768726/1302925)
remote: Counting objects: 60% (781755/1302925)
remote: Counting objects: 61% (794785/1302925)
remote: Counting objects: 62% (807814/1302925)
remote: Counting objects: 63% (820843/1302925)
remote: Counting objects: 64% (833872/1302925)
remote: Counting objects: 65% (846902/1302925)
remote: Counting objects: 66% (859931/1302925)
remote: Counting objects: 67% (872960/1302925)
remote: Counting objects: 68% (885989/1302925)
remote: Counting objects: 69% (899019/1302925)
remote: Counting objects: 70% (912048/1302925)
remote: Counting objects: 71% (925077/1302925)
remote: Counting objects: 72% (938106/1302925)
remote: Counting objects: 73% (951136/1302925)
remote: Counting objects: 74% (964165/1302925)
remote: Counting objects: 75% (977194/1302925)
remote: Counting objects: 76% (990223/1302925)
remote: Counting objects: 77% (1003253/1302925)
remote: Counting objects: 78% (1016282/1302925)
remote: Counting objects: 79% (1029311/1302925)
remote: Counting objects: 80% (1042340/1302925)
remote: Counting objects: 81% (1055370/1302925)
remote: Counting objects: 82% (1068399/1302925)
remote: Counting objects: 83% (1081428/1302925)
remote: Counting objects: 84% (1094457/1302925)
remote: Counting objects: 85% (1107487/1302925)
remote: Counting objects: 86% (1120516/1302925)
remote: Counting objects: 87% (1133545/1302925)
remote: Counting objects: 88% (1146574/1302925)
remote: Counting objects: 89% (1159604/1302925)
remote: Counting objects: 90% (1172633/1302925)
remote: Counting objects: 91% (1185662/1302925)
remote: Counting objects: 92% (1198691/1302925)
remote: Counting objects: 93% (1211721/1302925)
remote: Counting objects: 94% (1224750/1302925)
remote: Counting objects: 95% (1237779/1302925)
remote: Counting objects: 96% (1250808/1302925)
remote: Counting objects: 97% (1263838/1302925)
remote: Counting objects: 98% (1276867/1302925)
remote: Counting objects: 99% (1289896/1302925)
remote: Counting objects: 100% (1302925/1302925)
remote: Counting objects: 100% (1302925/1302925), done.
remote: Compressing objects: 0% (1/274677)
remote: Compressing objects: 1% (2747/274677)
remote: Compressing objects: 2% (5494/274677)
remote: Compressing objects: 3% (8241/274677)
remote: Compressing objects: 4% (10988/274677)
remote: Compressing objects: 5% (13734/274677)
remote: Compressing objects: 6% (16481/274677)
remote: Compressing objects: 7% (19228/274677)
remote: Compressing objects: 8% (21975/274677)
remote: Compressing objects: 9% (24721/274677)
remote: Compressing objects: 10% (27468/274677)
remote: Compressing objects: 11% (30215/274677)
remote: Compressing objects: 12% (32962/274677)
remote: Compressing objects: 13% (35709/274677)
remote: Compressing objects: 14% (38455/274677)
remote: Compressing objects: 15% (41202/274677)
remote: Compressing objects: 16% (43949/274677)
remote: Compressing objects: 17% (46696/274677)
remote: Compressing objects: 18% (49442/274677)
remote: Compressing objects: 19% (52189/274677)
remote: Compressing objects: 20% (54936/274677)
remote: Compressing objects: 21% (57683/274677)
remote: Compressing objects: 22% (60429/274677)
remote: Compressing objects: 23% (63176/274677)
remote: Compressing objects: 24% (65923/274677)
remote: Compressing objects: 25% (68670/274677)
remote: Compressing objects: 26% (71417/274677)
remote: Compressing objects: 27% (74163/274677)
remote: Compressing objects: 28% (76910/274677)
remote: Compressing objects: 29% (79657/274677)
remote: Compressing objects: 30% (82404/274677)
remote: Compressing objects: 31% (85150/274677)
remote: Compressing objects: 32% (87897/274677)
remote: Compressing objects: 33% (90644/274677)
remote: Compressing objects: 34% (93391/274677)
remote: Compressing objects: 35% (96137/274677)
remote: Compressing objects: 36% (98884/274677)
remote: Compressing objects: 37% (101631/274677)
remote: Compressing objects: 38% (104378/274677)
remote: Compressing objects: 39% (107125/274677)
remote: Compressing objects: 40% (109871/274677)
remote: Compressing objects: 41% (112618/274677)
remote: Compressing objects: 42% (115365/274677)
remote: Compressing objects: 43% (118112/274677)
remote: Compressing objects: 44% (120858/274677)
remote: Compressing objects: 45% (123605/274677)
remote: Compressing objects: 46% (126352/274677)
remote: Compressing objects: 47% (129099/274677)
remote: Compressing objects: 48% (131845/274677)
remote: Compressing objects: 49% (134592/274677)
remote: Compressing objects: 50% (137339/274677)
remote: Compressing objects: 51% (140086/274677)
remote: Compressing objects: 52% (142833/274677)
remote: Compressing objects: 53% (145579/274677)
remote: Compressing objects: 54% (148326/274677)
remote: Compressing objects: 55% (151073/274677)
remote: Compressing objects: 56% (153820/274677)
remote: Compressing objects: 57% (156566/274677)
remote: Compressing objects: 58% (159313/274677)
remote: Compressing objects: 59% (162060/274677)
remote: Compressing objects: 60% (164807/274677)
remote: Compressing objects: 61% (167553/274677)
remote: Compressing objects: 62% (170300/274677)
remote: Compressing objects: 63% (173047/274677)
remote: Compressing objects: 64% (175794/274677)
remote: Compressing objects: 65% (178541/274677)
remote: Compressing objects: 66% (181287/274677)
remote: Compressing objects: 67% (184034/274677)
remote: Compressing objects: 68% (186781/274677)
remote: Compressing objects: 69% (189528/274677)
remote: Compressing objects: 70% (192274/274677)
remote: Compressing objects: 71% (195021/274677)
remote: Compressing objects: 72% (197768/274677)
remote: Compressing objects: 73% (200515/274677)
remote: Compressing objects: 74% (203261/274677)
remote: Compressing objects: 75% (206008/274677)
remote: Compressing objects: 76% (208755/274677)
remote: Compressing objects: 77% (211502/274677)
remote: Compressing objects: 78% (214249/274677)
remote: Compressing objects: 79% (216995/274677)
remote: Compressing objects: 80% (219742/274677)
remote: Compressing objects: 81% (222489/274677)
remote: Compressing objects: 82% (225236/274677)
remote: Compressing objects: 83% (227982/274677)
remote: Compressing objects: 84% (230729/274677)
remote: Compressing objects: 85% (233476/274677)
remote: Compressing objects: 86% (236223/274677)
remote: Compressing objects: 87% (238969/274677)
remote: Compressing objects: 88% (241716/274677)
remote: Compressing objects: 89% (244463/274677)
remote: Compressing objects: 90% (247210/274677)
remote: Compressing objects: 91% (249957/274677)
remote: Compressing objects: 92% (252703/274677)
remote: Compressing objects: 93% (255450/274677)
remote: Compressing objects: 94% (258197/274677)
remote: Compressing objects: 95% (260944/274677)
remote: Compressing objects: 96% (263690/274677)
remote: Compressing objects: 97% (266437/274677)
remote: Compressing objects: 98% (269184/274677)
remote: Compressing objects: 98% (269794/274677)
remote: Compressing objects: 99% (271931/274677)
remote: Compressing objects: 100% (274677/274677)
remote: Compressing objects: 100% (274677/274677), done.
Receiving objects: 0% (1/1302925)
Receiving objects: 0% (482/1302925), 60.00 KiB | 105.00 KiB/s
Receiving objects: 0% (734/1302925), 196.00 KiB | 118.00 KiB/s
Receiving objects: 0% (1011/1302925), 348.00 KiB | 126.00 KiB/s
Receiving objects: 0% (1389/1302925), 548.00 KiB | 145.00 KiB/s
Receiving objects: 0% (1819/1302925), 764.00 KiB | 158.00 KiB/s
Receiving objects: 0% (2405/1302925), 1.01 MiB | 191.00 KiB/s
Receiving objects: 0% (3389/1302925), 1.46 MiB | 257.00 KiB/s
Receiving objects: 0% (4804/1302925), 2.20 MiB | 388.00 KiB/s
Receiving objects: 0% (6180/1302925), 2.82 MiB | 478.00 KiB/s
Receiving objects: 0% (7479/1302925), 3.05 MiB | 497.00 KiB/s
Receiving objects: 0% (9195/1302925), 3.44 MiB | 522.00 KiB/s
Receiving objects: 0% (10534/1302925), 3.92 MiB | 532.00 KiB/s
Receiving objects: 0% (12427/1302925), 4.43 MiB | 480.00 KiB/s
Receiving objects: 1% (13030/1302925), 4.67 MiB | 433.00 KiB/s
Receiving objects: 1% (14546/1302925), 4.91 MiB | 450.00 KiB/s
Receiving objects: 1% (16940/1302925), 5.43 MiB | 480.00 KiB/s
Receiving objects: 1% (19572/1302925), 6.00 MiB | 509.00 KiB/s
Receiving objects: 1% (22590/1302925), 6.62 MiB | 539.00 KiB/s
Receiving objects: 1% (25577/1302925), 7.19 MiB | 555.00 KiB/s
Receiving objects: 2% (26059/1302925), 7.45 MiB | 556.00 KiB/s
Receiving objects: 2% (27154/1302925), 7.66 MiB | 543.00 KiB/s
Receiving objects: 2% (27624/1302925), 7.77 MiB | 451.00 KiB/s
Receiving objects: 2% (27929/1302925), 7.82 MiB | 387.00 KiB/s
Receiving objects: 2% (28270/1302925), 7.91 MiB | 273.00 KiB/s
Receiving objects: 2% (28704/1302925), 8.03 MiB | 174.00 KiB/s
Receiving objects: 2% (29199/1302925), 8.17 MiB | 106.00 KiB/s
Receiving objects: 2% (29835/1302925), 8.34 MiB | 118.00 KiB/s
Receiving objects: 2% (30586/1302925), 8.55 MiB | 146.00 KiB/s
Receiving objects: 2% (31761/1302925), 8.86 MiB | 196.00 KiB/s
Receiving objects: 2% (34006/1302925), 9.38 MiB | 281.00 KiB/s
Receiving objects: 2% (35536/1302925), 9.89 MiB | 359.00 KiB/s
Receiving objects: 2% (37159/1302925), 10.32 MiB | 413.00 KiB/s
Receiving objects: 2% (38215/1302925), 10.44 MiB | 416.00 KiB/s
Receiving objects: 3% (39088/1302925), 10.64 MiB | 434.00 KiB/s
Receiving objects: 3% (39806/1302925), 10.84 MiB | 433.00 KiB/s
Receiving objects: 3% (41212/1302925), 11.25 MiB | 410.00 KiB/s
Receiving objects: 3% (42808/1302925), 11.65 MiB | 389.00 KiB/s
Receiving objects: 3% (44496/1302925), 12.11 MiB | 390.00 KiB/s
Receiving objects: 3% (46191/1302925), 12.61 MiB | 427.00 KiB/s
Receiving objects: 3% (47893/1302925), 13.09 MiB | 442.00 KiB/s
Receiving objects: 3% (49752/1302925), 13.58 MiB | 458.00 KiB/s
Receiving objects: 3% (51256/1302925), 14.02 MiB | 456.00 KiB/s
Receiving objects: 3% (52012/1302925), 14.07 MiB | 405.00 KiB/s
Receiving objects: 4% (52117/1302925), 14.24 MiB | 378.00 KiB/s
Receiving objects: 4% (52587/1302925), 14.35 MiB | 348.00 KiB/s
Receiving objects: 4% (53068/1302925), 14.50 MiB | 280.00 KiB/s
Receiving objects: 4% (53728/1302925), 14.67 MiB | 213.00 KiB/s
Receiving objects: 4% (54427/1302925), 14.78 MiB | 183.00 KiB/s
Receiving objects: 4% (55270/1302925), 14.98 MiB | 187.00 KiB/s
Receiving objects: 4% (56218/1302925), 15.24 MiB | 188.00 KiB/s
Receiving objects: 4% (57466/1302925), 15.54 MiB | 226.00 KiB/s
Receiving objects: 4% (58754/1302925), 15.88 MiB | 264.00 KiB/s
Receiving objects: 4% (59702/1302925), 16.16 MiB | 281.00 KiB/s
Receiving objects: 4% (60060/1302925), 16.30 MiB | 251.00 KiB/s
Receiving objects: 4% (60148/1302925), 16.32 MiB | 206.00 KiB/s
Receiving objects: 4% (60386/1302925), 16.36 MiB | 185.00 KiB/s
Receiving objects: 4% (60718/1302925), 16.46 MiB | 135.00 KiB/s
Receiving objects: 4% (61196/1302925), 16.60 MiB | 95.00 KiB/s
Receiving objects: 4% (61764/1302925), 16.67 MiB | 90.00 KiB/s
Receiving objects: 4% (62354/1302925), 16.86 MiB | 100.00 KiB/s
Receiving objects: 4% (63239/1302925), 17.04 MiB | 140.00 KiB/s
Receiving objects: 4% (64930/1302925), 17.40 MiB | 200.00 KiB/s
Receiving objects: 5% (65147/1302925), 17.40 MiB | 200.00 KiB/s
Receiving objects: 5% (67583/1302925), 18.00 MiB | 305.00 KiB/s
Receiving objects: 5% (71154/1302925), 18.29 MiB | 317.00 KiB/s
Receiving objects: 5% (74300/1302925), 18.50 MiB | 342.00 KiB/s
Receiving objects: 5% (77179/1302925), 18.71 MiB | 330.00 KiB/s
Receiving objects: 6% (78176/1302925), 18.71 MiB | 330.00 KiB/s
Receiving objects: 6% (80549/1302925), 18.93 MiB | 273.00 KiB/s
Receiving objects: 6% (83929/1302925), 19.21 MiB | 238.00 KiB/s
Receiving objects: 6% (87376/1302925), 19.35 MiB | 233.00 KiB/s
Receiving objects: 7% (91205/1302925), 19.64 MiB | 248.00 KiB/s
Receiving objects: 7% (91217/1302925), 19.64 MiB | 248.00 KiB/s
Receiving objects: 7% (95600/1302925), 19.95 MiB | 268.00 KiB/s
Receiving objects: 7% (101049/1302925), 20.37 MiB | 317.00 KiB/s
Receiving objects: 8% (104234/1302925), 20.66 MiB | 352.00 KiB/s
Receiving objects: 8% (107705/1302925), 21.00 MiB | 398.00 KiB/s
Receiving objects: 8% (112105/1302925), 21.30 MiB | 382.00 KiB/s
Receiving objects: 8% (115324/1302925), 21.71 MiB | 395.00 KiB/s
Receiving objects: 9% (117264/1302925), 21.81 MiB | 386.00 KiB/s
Receiving objects: 9% (118419/1302925), 21.81 MiB | 386.00 KiB/s
Receiving objects: 9% (121604/1302925), 22.06 MiB | 346.00 KiB/s
Receiving objects: 9% (125211/1302925), 22.32 MiB | 273.00 KiB/s
Receiving objects: 9% (129812/1302925), 22.59 MiB | 277.00 KiB/s
Receiving objects: 10% (130293/1302925), 22.59 MiB | 277.00 KiB/s
Receiving objects: 10% (134240/1302925), 22.92 MiB | 268.00 KiB/s
Receiving objects: 10% (139371/1302925), 23.26 MiB | 289.00 KiB/s
Receiving objects: 11% (143322/1302925), 23.50 MiB | 314.00 KiB/s
Receiving objects: 11% (146523/1302925), 23.77 MiB | 348.00 KiB/s
Receiving objects: 11% (154992/1302925), 24.45 MiB | 437.00 KiB/s
Receiving objects: 12% (156351/1302925), 24.45 MiB | 437.00 KiB/s
Receiving objects: 12% (159358/1302925), 24.71 MiB | 414.00 KiB/s
Receiving objects: 12% (162734/1302925), 24.84 MiB | 385.00 KiB/s
Receiving objects: 12% (166441/1302925), 25.16 MiB | 384.00 KiB/s
Receiving objects: 13% (169381/1302925), 25.28 MiB | 361.00 KiB/s
Receiving objects: 13% (170463/1302925), 25.40 MiB | 331.00 KiB/s
Receiving objects: 13% (174781/1302925), 25.67 MiB | 248.00 KiB/s
Receiving objects: 13% (179456/1302925), 25.99 MiB | 266.00 KiB/s
Receiving objects: 14% (182410/1302925), 26.14 MiB | 288.00 KiB/s
Receiving objects: 14% (185452/1302925), 26.32 MiB | 284.00 KiB/s
Receiving objects: 14% (191115/1302925), 26.70 MiB | 313.00 KiB/s
Receiving objects: 15% (195439/1302925), 26.89 MiB | 328.00 KiB/s
Receiving objects: 15% (197122/1302925), 27.17 MiB | 356.00 KiB/s
Receiving objects: 15% (205561/1302925), 27.72 MiB | 400.00 KiB/s
Receiving objects: 16% (208468/1302925), 27.72 MiB | 400.00 KiB/s
Receiving objects: 16% (209439/1302925), 27.96 MiB | 405.00 KiB/s
Receiving objects: 16% (212269/1302925), 28.18 MiB | 382.00 KiB/s
Receiving objects: 16% (214555/1302925), 28.32 MiB | 331.00 KiB/s
Receiving objects: 16% (217463/1302925), 28.50 MiB | 273.00 KiB/s
Receiving objects: 16% (220599/1302925), 28.69 MiB | 207.00 KiB/s
Receiving objects: 17% (221498/1302925), 28.69 MiB | 207.00 KiB/s
Receiving objects: 17% (224244/1302925), 28.81 MiB | 186.00 KiB/s
Receiving objects: 17% (228102/1302925), 29.05 MiB | 192.00 KiB/s
Receiving objects: 17% (233460/1302925), 29.34 MiB | 228.00 KiB/s
Receiving objects: 18% (234527/1302925), 29.52 MiB | 247.00 KiB/s
Receiving objects: 18% (242035/1302925), 29.75 MiB | 278.00 KiB/s
Receiving objects: 19% (247556/1302925), 30.41 MiB | 382.00 KiB/s
Receiving objects: 19% (252033/1302925), 30.41 MiB | 382.00 KiB/s
Receiving objects: 19% (256084/1302925), 31.11 MiB | 437.00 KiB/s
Receiving objects: 19% (259606/1302925), 31.25 MiB | 433.00 KiB/s
Receiving objects: 20% (260585/1302925), 31.37 MiB | 431.00 KiB/s
Receiving objects: 20% (263910/1302925), 31.50 MiB | 423.00 KiB/s
Receiving objects: 20% (268227/1302925), 31.80 MiB | 403.00 KiB/s
Receiving objects: 20% (273477/1302925), 32.09 MiB | 329.00 KiB/s
Receiving objects: 21% (273615/1302925), 32.09 MiB | 329.00 KiB/s
Receiving objects: 21% (278679/1302925), 32.43 MiB | 286.00 KiB/s
Receiving objects: 21% (284444/1302925), 32.80 MiB | 315.00 KiB/s
Receiving objects: 22% (286644/1302925), 32.80 MiB | 315.00 KiB/s
Receiving objects: 22% (290771/1302925), 33.18 MiB | 337.00 KiB/s
Receiving objects: 22% (299127/1302925), 33.70 MiB | 388.00 KiB/s
Receiving objects: 23% (299673/1302925), 33.70 MiB | 388.00 KiB/s
Receiving objects: 23% (310555/1302925), 34.45 MiB | 477.00 KiB/s
Receiving objects: 24% (312702/1302925), 34.55 MiB | 463.00 KiB/s
Receiving objects: 24% (315820/1302925), 34.55 MiB | 463.00 KiB/s
Receiving objects: 24% (320772/1302925), 34.99 MiB | 464.00 KiB/s
Receiving objects: 24% (324023/1302925), 35.28 MiB | 445.00 KiB/s
Receiving objects: 25% (325732/1302925), 35.39 MiB | 420.00 KiB/s
Receiving objects: 25% (327499/1302925), 35.52 MiB | 384.00 KiB/s
Receiving objects: 25% (331556/1302925), 35.81 MiB | 289.00 KiB/s
Receiving objects: 25% (336572/1302925), 36.13 MiB | 282.00 KiB/s
Receiving objects: 26% (338761/1302925), 36.29 MiB | 285.00 KiB/s
Receiving objects: 26% (342235/1302925), 36.47 MiB | 292.00 KiB/s
Receiving objects: 26% (347891/1302925), 36.85 MiB | 319.00 KiB/s
Receiving objects: 27% (351790/1302925), 37.10 MiB | 344.00 KiB/s
Receiving objects: 27% (356526/1302925), 37.39 MiB | 376.00 KiB/s
Receiving objects: 28% (364819/1302925), 37.76 MiB | 429.00 KiB/s
Receiving objects: 28% (368905/1302925), 37.76 MiB | 429.00 KiB/s
Receiving objects: 28% (375391/1302925), 38.55 MiB | 491.00 KiB/s
Receiving objects: 29% (377849/1302925), 38.55 MiB | 491.00 KiB/s
Receiving objects: 29% (381376/1302925), 38.81 MiB | 507.00 KiB/s
Receiving objects: 29% (386624/1302925), 39.18 MiB | 508.00 KiB/s
Receiving objects: 30% (390878/1302925), 39.37 MiB | 499.00 KiB/s
Receiving objects: 30% (392515/1302925), 39.60 MiB | 484.00 KiB/s
Receiving objects: 30% (398097/1302925), 40.01 MiB | 396.00 KiB/s
Receiving objects: 31% (403907/1302925), 40.47 MiB | 423.00 KiB/s
Receiving objects: 31% (404625/1302925), 40.47 MiB | 423.00 KiB/s
Receiving objects: 31% (411920/1302925), 40.95 MiB | 430.00 KiB/s
Receiving objects: 32% (416936/1302925), 41.17 MiB | 438.00 KiB/s
Receiving objects: 32% (418907/1302925), 41.41 MiB | 445.00 KiB/s
Receiving objects: 32% (428204/1302925), 42.03 MiB | 484.00 KiB/s
Receiving objects: 33% (429966/1302925), 42.03 MiB | 484.00 KiB/s
Receiving objects: 33% (439767/1302925), 42.88 MiB | 573.00 KiB/s
Receiving objects: 34% (442995/1302925), 42.88 MiB | 573.00 KiB/s
Receiving objects: 34% (446715/1302925), 43.21 MiB | 567.00 KiB/s
Receiving objects: 34% (452803/1302925), 43.67 MiB | 563.00 KiB/s
Receiving objects: 35% (456024/1302925), 43.83 MiB | 551.00 KiB/s
Receiving objects: 35% (457133/1302925), 43.97 MiB | 532.00 KiB/s
Receiving objects: 35% (461688/1302925), 44.26 MiB | 464.00 KiB/s
Receiving objects: 35% (466120/1302925), 44.58 MiB | 356.00 KiB/s
Receiving objects: 36% (469053/1302925), 44.75 MiB | 336.00 KiB/s
Receiving objects: 36% (471315/1302925), 44.92 MiB | 314.00 KiB/s
Receiving objects: 36% (477124/1302925), 45.32 MiB | 320.00 KiB/s
Receiving objects: 36% (481063/1302925), 45.42 MiB | 312.00 KiB/s
Receiving objects: 37% (482083/1302925), 45.57 MiB | 315.00 KiB/s
Receiving objects: 37% (486680/1302925), 45.73 MiB | 319.00 KiB/s
Receiving objects: 37% (492904/1302925), 46.11 MiB | 331.00 KiB/s
Receiving objects: 38% (495112/1302925), 46.31 MiB | 341.00 KiB/s
Receiving objects: 38% (496001/1302925), 46.43 MiB | 324.00 KiB/s
Receiving objects: 38% (497465/1302925), 46.60 MiB | 260.00 KiB/s
Receiving objects: 38% (498811/1302925), 46.64 MiB | 248.00 KiB/s
Receiving objects: 38% (500448/1302925), 46.75 MiB | 203.00 KiB/s
Receiving objects: 38% (502193/1302925), 46.89 MiB | 154.00 KiB/s
Receiving objects: 38% (504258/1302925), 47.06 MiB | 126.00 KiB/s
Receiving objects: 38% (505293/1302925), 47.26 MiB | 141.00 KiB/s
Receiving objects: 38% (507364/1302925), 47.54 MiB | 179.00 KiB/s
Receiving objects: 39% (508141/1302925), 47.54 MiB | 179.00 KiB/s
Receiving objects: 39% (509268/1302925), 48.01 MiB | 257.00 KiB/s
Receiving objects: 39% (516719/1302925), 48.83 MiB | 404.00 KiB/s
Receiving objects: 39% (520603/1302925), 49.07 MiB | 402.00 KiB/s
Receiving objects: 40% (521170/1302925), 49.37 MiB | 443.00 KiB/s
Receiving objects: 40% (521250/1302925), 49.49 MiB | 444.00 KiB/s
Receiving objects: 40% (523433/1302925), 49.60 MiB | 439.00 KiB/s
Receiving objects: 40% (527865/1302925), 49.90 MiB | 421.00 KiB/s
Receiving objects: 40% (532205/1302925), 50.21 MiB | 367.00 KiB/s
Receiving objects: 41% (534200/1302925), 50.39 MiB | 306.00 KiB/s
Receiving objects: 41% (536419/1302925), 50.56 MiB | 316.00 KiB/s
Receiving objects: 41% (541416/1302925), 50.93 MiB | 312.00 KiB/s
Receiving objects: 41% (544603/1302925), 51.22 MiB | 314.00 KiB/s
Receiving objects: 41% (546948/1302925), 51.44 MiB | 294.00 KiB/s
Receiving objects: 42% (547229/1302925), 51.44 MiB | 294.00 KiB/s
Receiving objects: 42% (550128/1302925), 51.68 MiB | 274.00 KiB/s
Receiving objects: 42% (552344/1302925), 51.83 MiB | 208.00 KiB/s
Receiving objects: 42% (553088/1302925), 51.88 MiB | 173.00 KiB/s
Receiving objects: 42% (554744/1302925), 51.96 MiB | 166.00 KiB/s
Receiving objects: 42% (556225/1302925), 52.07 MiB | 138.00 KiB/s
Receiving objects: 42% (558102/1302925), 52.21 MiB | 119.00 KiB/s
Receiving objects: 42% (560080/1302925), 52.29 MiB | 112.00 KiB/s
Receiving objects: 43% (560258/1302925), 52.37 MiB | 106.00 KiB/s
Receiving objects: 43% (562506/1302925), 52.45 MiB | 126.00 KiB/s
Receiving objects: 43% (565292/1302925), 52.66 MiB | 144.00 KiB/s
Receiving objects: 43% (567474/1302925), 52.88 MiB | 171.00 KiB/s
Receiving objects: 43% (570416/1302925), 53.11 MiB | 193.00 KiB/s
Receiving objects: 43% (572384/1302925), 53.29 MiB | 189.00 KiB/s
Receiving objects: 44% (573287/1302925), 53.29 MiB | 189.00 KiB/s
Receiving objects: 44% (574142/1302925), 53.34 MiB | 175.00 KiB/s
Receiving objects: 44% (574843/1302925), 53.43 MiB | 153.00 KiB/s
Receiving objects: 44% (576020/1302925), 53.50 MiB | 122.00 KiB/s
Receiving objects: 44% (577762/1302925), 53.55 MiB | 110.00 KiB/s
Receiving objects: 44% (579741/1302925), 53.68 MiB | 85.00 KiB/s
Receiving objects: 44% (582470/1302925), 53.85 MiB | 106.00 KiB/s
Receiving objects: 44% (584859/1302925), 53.99 MiB | 119.00 KiB/s
Receiving objects: 45% (586317/1302925), 54.13 MiB | 142.00 KiB/s
Receiving objects: 45% (588114/1302925), 54.24 MiB | 157.00 KiB/s
Receiving objects: 45% (592781/1302925), 54.51 MiB | 192.00 KiB/s
Receiving objects: 45% (595910/1302925), 54.71 MiB | 204.00 KiB/s
Receiving objects: 45% (597094/1302925), 54.81 MiB | 180.00 KiB/s
Receiving objects: 45% (598210/1302925), 54.85 MiB | 177.00 KiB/s
Receiving objects: 45% (598966/1302925), 54.90 MiB | 138.00 KiB/s
Receiving objects: 46% (599346/1302925), 54.93 MiB | 116.00 KiB/s
Receiving objects: 46% (600386/1302925), 54.96 MiB | 94.00 KiB/s
Receiving objects: 46% (602059/1302925), 55.07 MiB | 76.00 KiB/s
Receiving objects: 46% (603792/1302925), 55.21 MiB | 87.00 KiB/s
Receiving objects: 46% (606370/1302925), 55.38 MiB | 108.00 KiB/s
Receiving objects: 46% (611305/1302925), 55.71 MiB | 166.00 KiB/s
Receiving objects: 47% (612375/1302925), 55.71 MiB | 166.00 KiB/s
Receiving objects: 47% (621866/1302925), 56.00 MiB | 221.00 KiB/s
Receiving objects: 48% (625404/1302925), 56.36 MiB | 285.00 KiB/s
Receiving objects: 48% (633307/1302925), 56.89 MiB | 373.00 KiB/s
Receiving objects: 49% (638434/1302925), 57.21 MiB | 417.00 KiB/s
Receiving objects: 49% (639134/1302925), 57.21 MiB | 417.00 KiB/s
Receiving objects: 49% (643514/1302925), 57.50 MiB | 441.00 KiB/s
Receiving objects: 49% (648070/1302925), 57.78 MiB | 433.00 KiB/s
Receiving objects: 50% (651463/1302925), 57.93 MiB | 406.00 KiB/s
Receiving objects: 50% (653295/1302925), 58.09 MiB | 365.00 KiB/s
Receiving objects: 50% (658955/1302925), 58.41 MiB | 320.00 KiB/s
Receiving objects: 50% (664487/1302925), 58.77 MiB | 320.00 KiB/s
Receiving objects: 51% (664492/1302925), 58.77 MiB | 320.00 KiB/s
Receiving objects: 51% (670476/1302925), 58.96 MiB | 323.00 KiB/s
Receiving objects: 52% (677521/1302925), 59.32 MiB | 337.00 KiB/s
Receiving objects: 52% (678268/1302925), 59.32 MiB | 337.00 KiB/s
Receiving objects: 52% (689110/1302925), 59.84 MiB | 383.00 KiB/s
Receiving objects: 53% (690551/1302925), 59.84 MiB | 383.00 KiB/s
Receiving objects: 53% (699889/1302925), 60.57 MiB | 472.00 KiB/s
Receiving objects: 54% (703580/1302925), 60.82 MiB | 434.00 KiB/s
Receiving objects: 54% (706705/1302925), 60.82 MiB | 434.00 KiB/s
Receiving objects: 54% (709054/1302925), 61.13 MiB | 413.00 KiB/s
Receiving objects: 54% (713088/1302925), 61.24 MiB | 399.00 KiB/s
Receiving objects: 55% (716609/1302925), 61.50 MiB | 346.00 KiB/s
Receiving objects: 55% (717941/1302925), 61.50 MiB | 346.00 KiB/s
Receiving objects: 55% (723300/1302925), 61.78 MiB | 252.00 KiB/s
Receiving objects: 55% (729558/1302925), 62.07 MiB | 270.00 KiB/s
Receiving objects: 56% (729638/1302925), 62.07 MiB | 270.00 KiB/s
Receiving objects: 56% (735400/1302925), 62.43 MiB | 284.00 KiB/s
Receiving objects: 56% (740063/1302925), 62.80 MiB | 311.00 KiB/s
Receiving objects: 57% (742668/1302925), 63.05 MiB | 337.00 KiB/s
Receiving objects: 57% (749216/1302925), 63.33 MiB | 369.00 KiB/s
Receiving objects: 58% (755697/1302925), 63.68 MiB | 414.00 KiB/s
Receiving objects: 58% (757086/1302925), 64.00 MiB | 442.00 KiB/s
Receiving objects: 58% (763490/1302925), 64.40 MiB | 460.00 KiB/s
Receiving objects: 58% (767317/1302925), 64.70 MiB | 450.00 KiB/s
Receiving objects: 59% (768726/1302925), 64.70 MiB | 450.00 KiB/s
Receiving objects: 59% (772411/1302925), 64.82 MiB | 432.00 KiB/s
Receiving objects: 59% (776889/1302925), 65.08 MiB | 374.00 KiB/s
Receiving objects: 59% (781383/1302925), 65.38 MiB | 302.00 KiB/s
Receiving objects: 60% (781755/1302925), 65.38 MiB | 302.00 KiB/s
Receiving objects: 60% (787188/1302925), 65.70 MiB | 282.00 KiB/s
Receiving objects: 60% (793955/1302925), 66.04 MiB | 294.00 KiB/s
Receiving objects: 61% (794785/1302925), 66.04 MiB | 294.00 KiB/s
Receiving objects: 61% (801339/1302925), 66.48 MiB | 334.00 KiB/s
Receiving objects: 62% (807814/1302925), 66.75 MiB | 364.00 KiB/s
Receiving objects: 62% (813002/1302925), 67.11 MiB | 410.00 KiB/s
Receiving objects: 63% (820843/1302925), 67.51 MiB | 468.00 KiB/s
Receiving objects: 63% (829172/1302925), 68.01 MiB | 540.00 KiB/s
Receiving objects: 64% (833872/1302925), 68.01 MiB | 540.00 KiB/s
Receiving objects: 65% (846902/1302925), 68.57 MiB | 624.00 KiB/s
Receiving objects: 65% (854099/1302925), 69.32 MiB | 751.00 KiB/s
Receiving objects: 66% (859931/1302925), 69.32 MiB | 751.00 KiB/s
Receiving objects: 67% (872960/1302925), 70.24 MiB | 913.00 KiB/s
Receiving objects: 68% (885989/1302925), 71.29 MiB | 1.07 MiB/s
Receiving objects: 68% (889344/1302925), 71.29 MiB | 1.07 MiB/s
Receiving objects: 69% (899019/1302925), 71.29 MiB | 1.07 MiB/s
Receiving objects: 70% (912048/1302925), 72.57 MiB | 1.30 MiB/s
Receiving objects: 71% (925077/1302925), 72.57 MiB | 1.30 MiB/s
Receiving objects: 71% (932460/1302925), 74.07 MiB | 1.56 MiB/s
Receiving objects: 72% (938106/1302925), 74.07 MiB | 1.56 MiB/s
Receiving objects: 73% (951136/1302925), 74.07 MiB | 1.56 MiB/s
Receiving objects: 74% (964165/1302925), 75.75 MiB | 1.84 MiB/s
Receiving objects: 75% (977194/1302925), 75.75 MiB | 1.84 MiB/s
Receiving objects: 75% (984646/1302925), 77.80 MiB | 2.19 MiB/s
Receiving objects: 76% (990223/1302925), 77.80 MiB | 2.19 MiB/s
Receiving objects: 76% (997084/1302925), 82.64 MiB | 3.04 MiB/s
Receiving objects: 77% (1003253/1302925), 82.64 MiB | 3.04 MiB/s
Receiving objects: 78% (1016282/1302925), 85.38 MiB | 3.47 MiB/s
Receiving objects: 78% (1018679/1302925), 88.88 MiB | 4.04 MiB/s
Receiving objects: 79% (1029311/1302925), 88.88 MiB | 4.04 MiB/s
Receiving objects: 80% (1042340/1302925), 92.59 MiB | 4.65 MiB/s
Receiving objects: 80% (1050521/1302925), 92.59 MiB | 4.65 MiB/s
Receiving objects: 81% (1055370/1302925), 96.69 MiB | 5.26 MiB/s
Receiving objects: 82% (1068399/1302925), 101.11 MiB | 5.91 MiB/s
Receiving objects: 82% (1074319/1302925), 101.11 MiB | 5.91 MiB/s
Receiving objects: 82% (1076641/1302925), 118.55 MiB | 8.45 MiB/s
Receiving objects: 82% (1076667/1302925), 125.11 MiB | 9.32 MiB/s
Receiving objects: 82% (1076690/1302925), 136.86 MiB | 10.35 MiB/s
Receiving objects: 82% (1076764/1302925), 149.73 MiB | 11.44 MiB/s
Receiving objects: 82% (1076840/1302925), 162.27 MiB | 12.01 MiB/s
Receiving objects: 83% (1081428/1302925), 177.33 MiB | 12.68 MiB/s
Receiving objects: 83% (1085263/1302925), 177.33 MiB | 12.68 MiB/s
Receiving objects: 84% (1094457/1302925), 177.33 MiB | 12.68 MiB/s
Receiving objects: 85% (1107487/1302925), 184.12 MiB | 12.74 MiB/s
Receiving objects: 86% (1120516/1302925), 190.07 MiB | 12.57 MiB/s
Receiving objects: 87% (1133545/1302925), 190.07 MiB | 12.57 MiB/s
Receiving objects: 87% (1133994/1302925), 190.07 MiB | 12.57 MiB/s
Receiving objects: 87% (1138641/1302925), 205.84 MiB | 13.95 MiB/s
Receiving objects: 87% (1138648/1302925), 216.28 MiB | 13.11 MiB/s
Receiving objects: 87% (1141854/1302925), 224.49 MiB | 11.95 MiB/s
Receiving objects: 88% (1146574/1302925), 229.57 MiB | 11.10 MiB/s
Receiving objects: 88% (1152719/1302925), 233.57 MiB | 10.49 MiB/s
Receiving objects: 89% (1159604/1302925), 233.57 MiB | 10.49 MiB/s
Receiving objects: 90% (1172633/1302925), 237.61 MiB | 10.09 MiB/s
Receiving objects: 91% (1185662/1302925), 237.61 MiB | 10.09 MiB/s
Receiving objects: 91% (1193125/1302925), 242.68 MiB | 9.59 MiB/s
Receiving objects: 92% (1198691/1302925), 244.50 MiB | 8.17 MiB/s
Receiving objects: 92% (1206873/1302925), 246.54 MiB | 7.09 MiB/s
Receiving objects: 92% (1207209/1302925), 247.49 MiB | 5.93 MiB/s
Receiving objects: 92% (1208603/1302925), 248.11 MiB | 5.21 MiB/s
Receiving objects: 93% (1211721/1302925), 249.16 MiB | 4.71 MiB/s
Receiving objects: 93% (1216515/1302925), 251.73 MiB | 3.45 MiB/s
Receiving objects: 93% (1216515/1302925), 254.11 MiB | 2.16 MiB/s
Receiving objects: 93% (1216515/1302925), 256.90 MiB | 1.98 MiB/s
Receiving objects: 93% (1216515/1302925), 258.86 MiB | 2.24 MiB/s
Receiving objects: 93% (1216516/1302925), 260.11 MiB | 2.29 MiB/s
Receiving objects: 93% (1218183/1302925), 262.26 MiB | 2.24 MiB/s
Receiving objects: 93% (1220340/1302925), 264.80 MiB | 2.28 MiB/s
Receiving objects: 93% (1223275/1302925), 266.15 MiB | 1.75 MiB/s
Receiving objects: 93% (1223275/1302925), 267.10 MiB | 1.73 MiB/s
Receiving objects: 93% (1223275/1302925), 268.10 MiB | 1.52 MiB/s
Receiving objects: 93% (1223484/1302925), 269.17 MiB | 1.30 MiB/s
Receiving objects: 93% (1223484/1302925), 270.21 MiB | 1.02 MiB/s
Receiving objects: 93% (1223484/1302925), 271.29 MiB | 1.09 MiB/s
Receiving objects: 93% (1223484/1302925), 272.16 MiB | 968.00 KiB/s
Receiving objects: 93% (1223485/1302925), 272.62 MiB | 974.00 KiB/s
Receiving objects: 93% (1224060/1302925), 273.57 MiB | 951.00 KiB/s
Receiving objects: 93% (1224071/1302925), 274.62 MiB | 954.00 KiB/s
Receiving objects: 93% (1224074/1302925), 275.14 MiB | 798.00 KiB/s
Receiving objects: 93% (1224078/1302925), 275.29 MiB | 767.00 KiB/s
Receiving objects: 94% (1224750/1302925), 275.54 MiB | 707.00 KiB/s
Receiving objects: 94% (1225684/1302925), 275.67 MiB | 638.00 KiB/s
Receiving objects: 94% (1227282/1302925), 275.98 MiB | 498.00 KiB/s
Receiving objects: 94% (1228941/1302925), 276.30 MiB | 339.00 KiB/s
Receiving objects: 94% (1230656/1302925), 276.50 MiB | 315.00 KiB/s
Receiving objects: 94% (1232155/1302925), 276.84 MiB | 323.00 KiB/s
Receiving objects: 94% (1233711/1302925), 277.21 MiB | 323.00 KiB/s
Receiving objects: 94% (1235252/1302925), 277.70 MiB | 359.00 KiB/s
Receiving objects: 94% (1235763/1302925), 278.33 MiB | 435.00 KiB/s
Receiving objects: 94% (1235867/1302925), 278.82 MiB | 464.00 KiB/s
Receiving objects: 94% (1235867/1302925), 279.26 MiB | 464.00 KiB/s
Receiving objects: 94% (1235967/1302925), 279.39 MiB | 446.00 KiB/s
Receiving objects: 94% (1236740/1302925), 279.57 MiB | 386.00 KiB/s
Receiving objects: 94% (1237714/1302925), 279.87 MiB | 242.00 KiB/s
Receiving objects: 94% (1237714/1302925), 280.11 MiB | 214.00 KiB/s
Receiving objects: 94% (1237714/1302925), 280.39 MiB | 217.00 KiB/s
Receiving objects: 94% (1237714/1302925), 280.72 MiB | 248.00 KiB/s
Receiving objects: 94% (1237715/1302925), 280.93 MiB | 272.00 KiB/s
Receiving objects: 95% (1237779/1302925), 281.18 MiB | 306.00 KiB/s
Receiving objects: 95% (1238135/1302925), 281.52 MiB | 355.00 KiB/s
Receiving objects: 95% (1238135/1302925), 281.89 MiB | 364.00 KiB/s
Receiving objects: 95% (1238135/1302925), 282.20 MiB | 374.00 KiB/s
Receiving objects: 95% (1238135/1302925), 282.53 MiB | 381.00 KiB/s
Receiving objects: 95% (1238135/1302925), 282.91 MiB | 389.00 KiB/s
Receiving objects: 95% (1238135/1302925), 283.31 MiB | 374.00 KiB/s
Receiving objects: 95% (1238135/1302925), 283.72 MiB | 357.00 KiB/s
Receiving objects: 95% (1238135/1302925), 284.11 MiB | 372.00 KiB/s
Receiving objects: 95% (1238135/1302925), 284.60 MiB | 401.00 KiB/s
Receiving objects: 95% (1238135/1302925), 284.86 MiB | 417.00 KiB/s
Receiving objects: 95% (1238135/1302925), 285.52 MiB | 480.00 KiB/s
Receiving objects: 95% (1238135/1302925), 286.04 MiB | 445.00 KiB/s
Receiving objects: 95% (1238135/1302925), 286.35 MiB | 459.00 KiB/s
Receiving objects: 95% (1238135/1302925), 286.71 MiB | 442.00 KiB/s
Receiving objects: 95% (1238354/1302925), 286.88 MiB | 429.00 KiB/s
Receiving objects: 95% (1238646/1302925), 287.47 MiB | 367.00 KiB/s
Receiving objects: 95% (1238646/1302925), 287.67 MiB | 342.00 KiB/s
Receiving objects: 95% (1238649/1302925), 288.10 MiB | 384.00 KiB/s
Receiving objects: 95% (1238734/1302925), 288.43 MiB | 373.00 KiB/s
Receiving objects: 95% (1238790/1302925), 288.68 MiB | 389.00 KiB/s
Receiving objects: 95% (1238795/1302925), 289.32 MiB | 402.00 KiB/s
Receiving objects: 95% (1238796/1302925), 289.52 MiB | 388.00 KiB/s
Receiving objects: 95% (1238797/1302925), 289.72 MiB | 300.00 KiB/s
Receiving objects: 95% (1238834/1302925), 289.77 MiB | 271.00 KiB/s
Receiving objects: 95% (1238885/1302925), 289.82 MiB | 252.00 KiB/s
Receiving objects: 95% (1239231/1302925), 289.92 MiB | 185.00 KiB/s
Receiving objects: 95% (1239406/1302925), 290.04 MiB | 130.00 KiB/s
Receiving objects: 95% (1239880/1302925), 290.18 MiB | 93.00 KiB/s
Receiving objects: 95% (1239950/1302925), 290.32 MiB | 115.00 KiB/s
Receiving objects: 95% (1239951/1302925), 290.49 MiB | 132.00 KiB/s
Receiving objects: 95% (1240023/1302925), 290.57 MiB | 141.00 KiB/s
Receiving objects: 95% (1240049/1302925), 290.82 MiB | 149.00 KiB/s
Receiving objects: 95% (1240066/1302925), 290.86 MiB | 141.00 KiB/s
Receiving objects: 95% (1240103/1302925), 290.89 MiB | 125.00 KiB/s
Receiving objects: 95% (1240107/1302925), 290.95 MiB | 103.00 KiB/s
Receiving objects: 95% (1240108/1302925), 291.05 MiB | 86.00 KiB/s
Receiving objects: 95% (1240109/1302925), 291.18 MiB | 74.00 KiB/s
Receiving objects: 95% (1240110/1302925), 291.32 MiB | 86.00 KiB/s
Receiving objects: 95% (1240112/1302925), 291.41 MiB | 104.00 KiB/s
Receiving objects: 95% (1240340/1302925), 291.79 MiB | 174.00 KiB/s
Receiving objects: 95% (1240931/1302925), 292.39 MiB | 293.00 KiB/s
Receiving objects: 95% (1240967/1302925), 293.12 MiB | 432.00 KiB/s
Receiving objects: 95% (1240968/1302925), 293.61 MiB | 481.00 KiB/s
Receiving objects: 95% (1240968/1302925), 293.77 MiB | 460.00 KiB/s
Receiving objects: 95% (1240969/1302925), 293.92 MiB | 385.00 KiB/s
Receiving objects: 95% (1240971/1302925), 294.10 MiB | 251.00 KiB/s
Receiving objects: 95% (1240973/1302925), 294.19 MiB | 218.00 KiB/s
Receiving objects: 95% (1240975/1302925), 294.40 MiB | 173.00 KiB/s
Receiving objects: 95% (1240976/1302925), 294.64 MiB | 187.00 KiB/s
Receiving objects: 95% (1240977/1302925), 294.93 MiB | 221.00 KiB/s
Receiving objects: 95% (1240977/1302925), 295.43 MiB | 293.00 KiB/s
Receiving objects: 95% (1240978/1302925), 295.98 MiB | 356.00 KiB/s
Receiving objects: 95% (1240978/1302925), 296.22 MiB | 369.00 KiB/s
Receiving objects: 95% (1240979/1302925), 296.36 MiB | 379.00 KiB/s
Receiving objects: 95% (1240981/1302925), 296.71 MiB | 361.00 KiB/s
Receiving objects: 95% (1240983/1302925), 296.83 MiB | 339.00 KiB/s
Receiving objects: 95% (1240986/1302925), 297.10 MiB | 267.00 KiB/s
Receiving objects: 95% (1240989/1302925), 297.38 MiB | 249.00 KiB/s
Receiving objects: 95% (1240990/1302925), 297.77 MiB | 256.00 KiB/s
Receiving objects: 95% (1241037/1302925), 297.92 MiB | 263.00 KiB/s
Receiving objects: 95% (1242059/1302925), 298.23 MiB | 278.00 KiB/s
Receiving objects: 95% (1242170/1302925), 298.59 MiB | 261.00 KiB/s
Receiving objects: 95% (1242190/1302925), 298.69 MiB | 251.00 KiB/s
Receiving objects: 95% (1242192/1302925), 298.74 MiB | 233.00 KiB/s
Receiving objects: 95% (1242429/1302925), 298.86 MiB | 159.00 KiB/s
Receiving objects: 95% (1242430/1302925), 298.96 MiB | 115.00 KiB/s
Receiving objects: 95% (1242431/1302925), 299.09 MiB | 105.00 KiB/s
Receiving objects: 95% (1242432/1302925), 299.25 MiB | 110.00 KiB/s
Receiving objects: 95% (1242432/1302925), 299.45 MiB | 140.00 KiB/s
Receiving objects: 95% (1242469/1302925), 299.61 MiB | 164.00 KiB/s
Receiving objects: 95% (1242484/1302925), 300.08 MiB | 248.00 KiB/s
Receiving objects: 95% (1243412/1302925), 300.79 MiB | 359.00 KiB/s
Receiving objects: 95% (1243413/1302925), 301.18 MiB | 388.00 KiB/s
Receiving objects: 95% (1243414/1302925), 301.36 MiB | 405.00 KiB/s
Receiving objects: 95% (1243418/1302925), 301.73 MiB | 424.00 KiB/s
Receiving objects: 95% (1243422/1302925), 302.14 MiB | 411.00 KiB/s
Receiving objects: 95% (1243427/1302925), 302.34 MiB | 382.00 KiB/s
Receiving objects: 95% (1243436/1302925), 302.71 MiB | 382.00 KiB/s
Receiving objects: 95% (1243438/1302925), 303.29 MiB | 374.00 KiB/s
Receiving objects: 95% (1243440/1302925), 303.73 MiB | 385.00 KiB/s
Receiving objects: 95% (1243440/1302925), 304.18 MiB | 391.00 KiB/s
Receiving objects: 95% (1243440/1302925), 304.32 MiB | 357.00 KiB/s
Receiving objects: 95% (1243440/1302925), 304.52 MiB | 320.00 KiB/s
Receiving objects: 95% (1243440/1302925), 304.55 MiB | 289.00 KiB/s
Receiving objects: 95% (1243440/1302925), 304.64 MiB | 218.00 KiB/s
Receiving objects: 95% (1243440/1302925), 304.75 MiB | 153.00 KiB/s
Receiving objects: 95% (1243440/1302925), 304.89 MiB | 116.00 KiB/s
Receiving objects: 95% (1243440/1302925), 305.07 MiB | 111.00 KiB/s
Receiving objects: 95% (1243440/1302925), 305.31 MiB | 151.00 KiB/s
Receiving objects: 95% (1243440/1302925), 305.75 MiB | 224.00 KiB/s
Receiving objects: 95% (1243441/1302925), 306.07 MiB | 281.00 KiB/s
Receiving objects: 95% (1243442/1302925), 306.82 MiB | 410.00 KiB/s
Receiving objects: 95% (1243442/1302925), 307.24 MiB | 452.00 KiB/s
Receiving objects: 95% (1243442/1302925), 307.53 MiB | 461.00 KiB/s
Receiving objects: 95% (1243442/1302925), 308.00 MiB | 462.00 KiB/s
Receiving objects: 95% (1243442/1302925), 308.21 MiB | 443.00 KiB/s
Receiving objects: 95% (1243444/1302925), 308.68 MiB | 386.00 KiB/s
Receiving objects: 95% (1243445/1302925), 309.12 MiB | 405.00 KiB/s
Receiving objects: 95% (1243445/1302925), 309.65 MiB | 453.00 KiB/s
Receiving objects: 95% (1243445/1302925), 310.25 MiB | 484.00 KiB/s
Receiving objects: 95% (1243445/1302925), 310.97 MiB | 540.00 KiB/s
Receiving objects: 95% (1243449/1302925), 311.39 MiB | 583.00 KiB/s
Receiving objects: 95% (1243450/1302925), 311.96 MiB | 570.00 KiB/s
Receiving objects: 95% (1243530/1302925), 312.25 MiB | 517.00 KiB/s
Receiving objects: 95% (1243532/1302925), 312.41 MiB | 486.00 KiB/s
Receiving objects: 95% (1243537/1302925), 312.71 MiB | 429.00 KiB/s
Receiving objects: 95% (1243538/1302925), 313.03 MiB | 322.00 KiB/s
Receiving objects: 95% (1243541/1302925), 313.32 MiB | 289.00 KiB/s
Receiving objects: 95% (1243579/1302925), 313.61 MiB | 295.00 KiB/s
Receiving objects: 95% (1243581/1302925), 313.97 MiB | 307.00 KiB/s
Receiving objects: 95% (1243583/1302925), 314.34 MiB | 316.00 KiB/s
Receiving objects: 95% (1243597/1302925), 314.67 MiB | 322.00 KiB/s
Receiving objects: 95% (1243606/1302925), 314.78 MiB | 281.00 KiB/s
Receiving objects: 95% (1243606/1302925), 314.90 MiB | 232.00 KiB/s
Receiving objects: 95% (1243606/1302925), 314.93 MiB | 200.00 KiB/s
Receiving objects: 95% (1243610/1302925), 315.03 MiB | 139.00 KiB/s
Receiving objects: 95% (1243610/1302925), 315.14 MiB | 94.00 KiB/s
Receiving objects: 95% (1243613/1302925), 315.21 MiB | 87.00 KiB/s
Receiving objects: 95% (1243617/1302925), 315.37 MiB | 104.00 KiB/s
Receiving objects: 95% (1243619/1302925), 315.63 MiB | 143.00 KiB/s
Receiving objects: 95% (1243641/1302925), 316.07 MiB | 225.00 KiB/s
Receiving objects: 95% (1243641/1302925), 316.82 MiB | 365.00 KiB/s
Receiving objects: 95% (1243643/1302925), 317.31 MiB | 427.00 KiB/s
Receiving objects: 95% (1243645/1302925), 317.39 MiB | 407.00 KiB/s
Receiving objects: 95% (1243646/1302925), 317.67 MiB | 411.00 KiB/s
Receiving objects: 95% (1243647/1302925), 317.96 MiB | 379.00 KiB/s
Receiving objects: 95% (1243655/1302925), 318.26 MiB | 290.00 KiB/s
Receiving objects: 95% (1243656/1302925), 318.57 MiB | 261.00 KiB/s
Receiving objects: 95% (1243658/1302925), 318.76 MiB | 301.00 KiB/s
Receiving objects: 95% (1243660/1302925), 319.12 MiB | 321.00 KiB/s
Receiving objects: 95% (1243676/1302925), 319.57 MiB | 357.00 KiB/s
Receiving objects: 95% (1243733/1302925), 320.53 MiB | 474.00 KiB/s
Receiving objects: 95% (1243733/1302925), 320.66 MiB | 443.00 KiB/s
Receiving objects: 95% (1243733/1302925), 320.98 MiB | 406.00 KiB/s
Receiving objects: 95% (1243733/1302925), 321.19 MiB | 359.00 KiB/s
Receiving objects: 95% (1243733/1302925), 321.31 MiB | 328.00 KiB/s
Receiving objects: 95% (1243733/1302925), 321.53 MiB | 250.00 KiB/s
Receiving objects: 95% (1243733/1302925), 321.76 MiB | 214.00 KiB/s
Receiving objects: 95% (1243733/1302925), 322.00 MiB | 207.00 KiB/s
Receiving objects: 95% (1243733/1302925), 322.29 MiB | 232.00 KiB/s
Receiving objects: 95% (1243733/1302925), 322.72 MiB | 282.00 KiB/s
Receiving objects: 95% (1243733/1302925), 323.29 MiB | 360.00 KiB/s
Receiving objects: 95% (1243742/1302925), 323.35 MiB | 337.00 KiB/s
Receiving objects: 95% (1243759/1302925), 323.71 MiB | 361.00 KiB/s
Receiving objects: 95% (1243759/1302925), 323.89 MiB | 332.00 KiB/s
Receiving objects: 95% (1243759/1302925), 324.04 MiB | 271.00 KiB/s
Receiving objects: 95% (1243759/1302925), 324.22 MiB | 192.00 KiB/s
Receiving objects: 95% (1243759/1302925), 324.39 MiB | 162.00 KiB/s
Receiving objects: 95% (1243759/1302925), 324.49 MiB | 166.00 KiB/s
Receiving objects: 95% (1243902/1302925), 324.59 MiB | 169.00 KiB/s
Receiving objects: 95% (1243919/1302925), 324.82 MiB | 183.00 KiB/s
Receiving objects: 95% (1243935/1302925), 325.06 MiB | 197.00 KiB/s
Receiving objects: 95% (1243936/1302925), 325.32 MiB | 184.00 KiB/s
Receiving objects: 95% (1243937/1302925), 325.36 MiB | 157.00 KiB/s
Receiving objects: 95% (1243937/1302925), 325.40 MiB | 143.00 KiB/s
Receiving objects: 95% (1243938/1302925), 325.45 MiB | 130.00 KiB/s
Receiving objects: 95% (1243938/1302925), 325.54 MiB | 105.00 KiB/s
Receiving objects: 95% (1244184/1302925), 325.59 MiB | 91.00 KiB/s
Receiving objects: 95% (1244986/1302925), 325.72 MiB | 79.00 KiB/s
Receiving objects: 95% (1245777/1302925), 325.89 MiB | 105.00 KiB/s
Receiving objects: 95% (1246654/1302925), 326.13 MiB | 142.00 KiB/s
Receiving objects: 95% (1247344/1302925), 326.57 MiB | 218.00 KiB/s
Receiving objects: 95% (1247660/1302925), 327.00 MiB | 271.00 KiB/s
Receiving objects: 95% (1247744/1302925), 327.32 MiB | 295.00 KiB/s
Receiving objects: 95% (1247744/1302925), 327.39 MiB | 294.00 KiB/s
Receiving objects: 95% (1247744/1302925), 327.54 MiB | 277.00 KiB/s
Receiving objects: 95% (1247925/1302925), 327.71 MiB | 227.00 KiB/s
Receiving objects: 95% (1247925/1302925), 327.89 MiB | 186.00 KiB/s
Receiving objects: 95% (1247967/1302925), 328.11 MiB | 175.00 KiB/s
Receiving objects: 95% (1247998/1302925), 328.39 MiB | 203.00 KiB/s
Receiving objects: 95% (1247998/1302925), 328.79 MiB | 256.00 KiB/s
Receiving objects: 95% (1248063/1302925), 329.09 MiB | 301.00 KiB/s
Receiving objects: 95% (1249662/1302925), 329.75 MiB | 376.00 KiB/s
Receiving objects: 95% (1249676/1302925), 329.91 MiB | 379.00 KiB/s
Receiving objects: 95% (1250101/1302925), 329.98 MiB | 362.00 KiB/s
Receiving objects: 96% (1250808/1302925), 330.18 MiB | 330.00 KiB/s
Receiving objects: 96% (1251135/1302925), 330.18 MiB | 330.00 KiB/s
Receiving objects: 96% (1252084/1302925), 330.36 MiB | 261.00 KiB/s
Receiving objects: 96% (1252743/1302925), 330.54 MiB | 200.00 KiB/s
Receiving objects: 96% (1252810/1302925), 330.78 MiB | 186.00 KiB/s
Receiving objects: 96% (1252817/1302925), 331.04 MiB | 213.00 KiB/s
Receiving objects: 96% (1253693/1302925), 331.59 MiB | 275.00 KiB/s
Receiving objects: 96% (1253901/1302925), 331.86 MiB | 314.00 KiB/s
Receiving objects: 96% (1254095/1302925), 332.39 MiB | 338.00 KiB/s
Receiving objects: 96% (1254095/1302925), 332.60 MiB | 348.00 KiB/s
Receiving objects: 96% (1254095/1302925), 332.84 MiB | 340.00 KiB/s
Receiving objects: 96% (1254095/1302925), 333.07 MiB | 303.00 KiB/s
Receiving objects: 96% (1254095/1302925), 333.32 MiB | 232.00 KiB/s
Receiving objects: 96% (1254095/1302925), 333.42 MiB | 228.00 KiB/s
Receiving objects: 96% (1254147/1302925), 333.64 MiB | 226.00 KiB/s
Receiving objects: 96% (1254218/1302925), 333.91 MiB | 232.00 KiB/s
Receiving objects: 96% (1254218/1302925), 334.18 MiB | 240.00 KiB/s
Receiving objects: 96% (1254218/1302925), 334.46 MiB | 248.00 KiB/s
Receiving objects: 96% (1254218/1302925), 334.69 MiB | 256.00 KiB/s
Receiving objects: 96% (1254218/1302925), 334.80 MiB | 214.00 KiB/s
Receiving objects: 96% (1254218/1302925), 334.89 MiB | 172.00 KiB/s
Receiving objects: 96% (1254218/1302925), 334.93 MiB | 156.00 KiB/s
Receiving objects: 96% (1254568/1302925), 335.07 MiB | 123.00 KiB/s
Receiving objects: 96% (1254568/1302925), 335.21 MiB | 107.00 KiB/s
Receiving objects: 96% (1255786/1302925), 335.31 MiB | 118.00 KiB/s
Receiving objects: 96% (1256003/1302925), 335.53 MiB | 144.00 KiB/s
Receiving objects: 96% (1259479/1302925), 335.89 MiB | 202.00 KiB/s
Receiving objects: 96% (1261848/1302925), 336.51 MiB | 307.00 KiB/s
Receiving objects: 97% (1263838/1302925), 336.93 MiB | 379.00 KiB/s
Receiving objects: 97% (1264741/1302925), 337.21 MiB | 409.00 KiB/s
Receiving objects: 97% (1265753/1302925), 337.60 MiB | 471.00 KiB/s
Receiving objects: 97% (1267750/1302925), 338.07 MiB | 494.00 KiB/s
Receiving objects: 97% (1267897/1302925), 338.21 MiB | 484.00 KiB/s
Receiving objects: 97% (1268500/1302925), 338.55 MiB | 425.00 KiB/s
Receiving objects: 97% (1268931/1302925), 338.96 MiB | 294.00 KiB/s
Receiving objects: 97% (1269098/1302925), 339.12 MiB | 301.00 KiB/s
Receiving objects: 97% (1269803/1302925), 339.46 MiB | 301.00 KiB/s
Receiving objects: 97% (1271185/1302925), 339.82 MiB | 309.00 KiB/s
Receiving objects: 97% (1273186/1302925), 340.18 MiB | 318.00 KiB/s
Receiving objects: 97% (1273186/1302925), 340.44 MiB | 313.00 KiB/s
Receiving objects: 97% (1273187/1302925), 340.59 MiB | 268.00 KiB/s
Receiving objects: 97% (1273187/1302925), 340.64 MiB | 240.00 KiB/s
Receiving objects: 97% (1273187/1302925), 340.76 MiB | 186.00 KiB/s
Receiving objects: 97% (1273360/1302925), 340.89 MiB | 141.00 KiB/s
Receiving objects: 97% (1273362/1302925), 341.05 MiB | 124.00 KiB/s
Receiving objects: 97% (1273388/1302925), 341.25 MiB | 137.00 KiB/s
Receiving objects: 97% (1273388/1302925), 341.50 MiB | 175.00 KiB/s
Receiving objects: 97% (1273388/1302925), 341.99 MiB | 253.00 KiB/s
Receiving objects: 97% (1273920/1302925), 342.34 MiB | 313.00 KiB/s
Receiving objects: 97% (1276186/1302925), 343.21 MiB | 453.00 KiB/s
Receiving objects: 98% (1276867/1302925), 343.43 MiB | 483.00 KiB/s
Receiving objects: 98% (1277244/1302925), 343.43 MiB | 483.00 KiB/s
Receiving objects: 98% (1277902/1302925), 343.86 MiB | 489.00 KiB/s
Receiving objects: 98% (1279217/1302925), 344.00 MiB | 488.00 KiB/s
Receiving objects: 98% (1280539/1302925), 344.34 MiB | 464.00 KiB/s
Receiving objects: 98% (1282030/1302925), 344.66 MiB | 369.00 KiB/s
Receiving objects: 98% (1282720/1302925), 345.01 MiB | 319.00 KiB/s
Receiving objects: 98% (1284540/1302925), 345.39 MiB | 334.00 KiB/s
Receiving objects: 98% (1285402/1302925), 346.07 MiB | 377.00 KiB/s
Receiving objects: 98% (1285402/1302925), 346.69 MiB | 441.00 KiB/s
Receiving objects: 98% (1285948/1302925), 347.20 MiB | 474.00 KiB/s
Receiving objects: 98% (1285968/1302925), 347.47 MiB | 484.00 KiB/s
Receiving objects: 98% (1286272/1302925), 347.67 MiB | 430.00 KiB/s
Receiving objects: 98% (1286277/1302925), 347.79 MiB | 413.00 KiB/s
Receiving objects: 98% (1286297/1302925), 348.18 MiB | 311.00 KiB/s
Receiving objects: 98% (1286297/1302925), 348.44 MiB | 262.00 KiB/s
Receiving objects: 98% (1286297/1302925), 348.76 MiB | 271.00 KiB/s
Receiving objects: 98% (1286297/1302925), 349.10 MiB | 285.00 KiB/s
Receiving objects: 98% (1286297/1302925), 349.49 MiB | 313.00 KiB/s
Receiving objects: 98% (1286297/1302925), 350.06 MiB | 381.00 KiB/s
Receiving objects: 98% (1286297/1302925), 350.34 MiB | 386.00 KiB/s
Receiving objects: 98% (1286297/1302925), 350.60 MiB | 370.00 KiB/s
Receiving objects: 98% (1286297/1302925), 350.69 MiB | 354.00 KiB/s
Receiving objects: 98% (1286297/1302925), 350.92 MiB | 326.00 KiB/s
Receiving objects: 98% (1286297/1302925), 351.14 MiB | 279.00 KiB/s
Receiving objects: 98% (1286297/1302925), 351.39 MiB | 226.00 KiB/s
Receiving objects: 98% (1286297/1302925), 351.68 MiB | 234.00 KiB/s
Receiving objects: 98% (1286297/1302925), 352.00 MiB | 259.00 KiB/s
Receiving objects: 98% (1286297/1302925), 352.38 MiB | 295.00 KiB/s
Receiving objects: 98% (1286297/1302925), 352.93 MiB | 362.00 KiB/s
Receiving objects: 98% (1286297/1302925), 353.61 MiB | 452.00 KiB/s
Receiving objects: 98% (1286297/1302925), 353.76 MiB | 429.00 KiB/s
Receiving objects: 98% (1286297/1302925), 354.29 MiB | 470.00 KiB/s
Receiving objects: 98% (1286297/1302925), 354.67 MiB | 468.00 KiB/s
Receiving objects: 98% (1286297/1302925), 355.07 MiB | 440.00 KiB/s
Receiving objects: 98% (1286297/1302925), 355.50 MiB | 389.00 KiB/s
Receiving objects: 98% (1286297/1302925), 355.93 MiB | 398.00 KiB/s
Receiving objects: 98% (1286302/1302925), 356.42 MiB | 429.00 KiB/s
Receiving objects: 98% (1286302/1302925), 356.97 MiB | 459.00 KiB/s
Receiving objects: 98% (1286302/1302925), 357.68 MiB | 530.00 KiB/s
Receiving objects: 98% (1286302/1302925), 358.54 MiB | 606.00 KiB/s
Receiving objects: 98% (1286302/1302925), 359.05 MiB | 669.00 KiB/s
Receiving objects: 98% (1286302/1302925), 360.04 MiB | 773.00 KiB/s
Receiving objects: 98% (1286302/1302925), 361.14 MiB | 891.00 KiB/s
Receiving objects: 98% (1286302/1302925), 362.32 MiB | 981.00 KiB/s
Receiving objects: 98% (1286302/1302925), 363.44 MiB | 1.04 MiB/s
Receiving objects: 98% (1286303/1302925), 364.05 MiB | 1.06 MiB/s
Receiving objects: 98% (1286698/1302925), 365.22 MiB | 1.10 MiB/s
Receiving objects: 98% (1288032/1302925), 366.45 MiB | 1.13 MiB/s
Receiving objects: 98% (1289385/1302925), 367.75 MiB | 1.16 MiB/s
Receiving objects: 99% (1289896/1302925), 368.43 MiB | 1.19 MiB/s
Receiving objects: 99% (1289972/1302925), 368.43 MiB | 1.19 MiB/s
Receiving objects: 99% (1290168/1302925), 369.72 MiB | 1.04 MiB/s
Receiving objects: 99% (1290168/1302925), 370.36 MiB | 926.00 KiB/s
Receiving objects: 99% (1290168/1302925), 370.79 MiB | 763.00 KiB/s
Receiving objects: 99% (1290168/1302925), 371.24 MiB | 577.00 KiB/s
Receiving objects: 99% (1290168/1302925), 371.44 MiB | 472.00 KiB/s
Receiving objects: 99% (1290168/1302925), 371.90 MiB | 469.00 KiB/s
Receiving objects: 99% (1290168/1302925), 372.39 MiB | 449.00 KiB/s
Receiving objects: 99% (1290168/1302925), 372.92 MiB | 471.00 KiB/s
Receiving objects: 99% (1290168/1302925), 373.55 MiB | 514.00 KiB/s
Receiving objects: 99% (1290209/1302925), 374.36 MiB | 598.00 KiB/s
Receiving objects: 99% (1290209/1302925), 374.62 MiB | 541.00 KiB/s
Receiving objects: 99% (1290209/1302925), 375.05 MiB | 507.00 KiB/s
Receiving objects: 99% (1290210/1302925), 375.23 MiB | 487.00 KiB/s
Receiving objects: 99% (1290327/1302925), 375.54 MiB | 410.00 KiB/s
Receiving objects: 99% (1290480/1302925), 375.83 MiB | 302.00 KiB/s
Receiving objects: 99% (1290480/1302925), 376.19 MiB | 323.00 KiB/s
Receiving objects: 99% (1290480/1302925), 376.57 MiB | 317.00 KiB/s
Receiving objects: 99% (1290480/1302925), 377.00 MiB | 345.00 KiB/s
Receiving objects: 99% (1290480/1302925), 377.50 MiB | 381.00 KiB/s
Receiving objects: 99% (1290482/1302925), 377.87 MiB | 438.00 KiB/s
Receiving objects: 99% (1290483/1302925), 378.30 MiB | 422.00 KiB/s
Receiving objects: 99% (1290483/1302925), 378.82 MiB | 450.00 KiB/s
Receiving objects: 99% (1290483/1302925), 379.20 MiB | 437.00 KiB/s
Receiving objects: 99% (1290483/1302925), 379.54 MiB | 410.00 KiB/s
Receiving objects: 99% (1290483/1302925), 379.71 MiB | 368.00 KiB/s
Receiving objects: 99% (1290483/1302925), 380.10 MiB | 391.00 KiB/s
Receiving objects: 99% (1290501/1302925), 380.54 MiB | 376.00 KiB/s
Receiving objects: 99% (1290501/1302925), 381.02 MiB | 403.00 KiB/s
Receiving objects: 99% (1290501/1302925), 381.61 MiB | 454.00 KiB/s
Receiving objects: 99% (1290501/1302925), 382.43 MiB | 563.00 KiB/s
Receiving objects: 99% (1290502/1302925), 382.75 MiB | 518.00 KiB/s
Receiving objects: 99% (1290502/1302925), 383.30 MiB | 527.00 KiB/s
Receiving objects: 99% (1290502/1302925), 383.50 MiB | 515.00 KiB/s
Receiving objects: 99% (1290523/1302925), 383.96 MiB | 488.00 KiB/s
Receiving objects: 99% (1290523/1302925), 384.34 MiB | 394.00 KiB/s
Receiving objects: 99% (1290523/1302925), 384.70 MiB | 417.00 KiB/s
Receiving objects: 99% (1290523/1302925), 385.15 MiB | 409.00 KiB/s
Receiving objects: 99% (1290523/1302925), 385.57 MiB | 410.00 KiB/s
Receiving objects: 99% (1290523/1302925), 386.05 MiB | 419.00 KiB/s
Receiving objects: 99% (1290528/1302925), 386.27 MiB | 429.00 KiB/s
Receiving objects: 99% (1290530/1302925), 386.78 MiB | 363.00 KiB/s
Receiving objects: 99% (1290530/1302925), 386.90 MiB | 333.00 KiB/s
error: index-pack died of signal 15
fatal: index-pack failed
at org.jenkinsci.plugins.gitclient.CliGitAPIImpl.launchCommandIn(CliGitAPIImpl.java:2842)
at org.jenkinsci.plugins.gitclient.CliGitAPIImpl.launchCommandWithCredentials(CliGitAPIImpl.java:2185)
at org.jenkinsci.plugins.gitclient.CliGitAPIImpl$1.execute(CliGitAPIImpl.java:635)
at org.jenkinsci.plugins.gitclient.CliGitAPIImpl$2.execute(CliGitAPIImpl.java:871)
at org.jenkinsci.plugins.gitclient.RemoteGitImpl$CommandInvocationHandler$GitCommandMasterToSlaveCallable.call(RemoteGitImpl.java:170)
at org.jenkinsci.plugins.gitclient.RemoteGitImpl$CommandInvocationHandler$GitCommandMasterToSlaveCallable.call(RemoteGitImpl.java:161)
at hudson.remoting.UserRequest.perform(UserRequest.java:211)
at hudson.remoting.UserRequest.perform(UserRequest.java:54)
at hudson.remoting.Request$2.run(Request.java:377)
at hudson.remoting.InterceptingExecutorService.lambda$wrap$0(InterceptingExecutorService.java:78)
at java.base/java.util.concurrent.FutureTask.run(FutureTask.java:264)
at java.base/java.util.concurrent.ThreadPoolExecutor.runWorker(ThreadPoolExecutor.java:1128)
at java.base/java.util.concurrent.ThreadPoolExecutor$Worker.run(ThreadPoolExecutor.java:628)
at java.base/java.lang.Thread.run(Thread.java:829)
Suppressed: hudson.remoting.Channel$CallSiteStackTrace: Remote call to lucene-solr-1
at hudson.remoting.Channel.attachCallSiteStackTrace(Channel.java:1787)
at hudson.remoting.UserRequest$ExceptionResponse.retrieve(UserRequest.java:356)
at hudson.remoting.Channel.call(Channel.java:1003)
at org.jenkinsci.plugins.gitclient.RemoteGitImpl$CommandInvocationHandler.execute(RemoteGitImpl.java:153)
at jdk.internal.reflect.GeneratedMethodAccessor876.invoke(Unknown Source)
at java.base/jdk.internal.reflect.DelegatingMethodAccessorImpl.invoke(DelegatingMethodAccessorImpl.java:43)
at java.base/java.lang.reflect.Method.invoke(Method.java:566)
at org.jenkinsci.plugins.gitclient.RemoteGitImpl$CommandInvocationHandler.invoke(RemoteGitImpl.java:138)
at com.sun.proxy.$Proxy223.execute(Unknown Source)
at hudson.plugins.git.GitSCM.retrieveChanges(GitSCM.java:1222)
at hudson.plugins.git.GitSCM.checkout(GitSCM.java:1305)
at hudson.scm.SCM.checkout(SCM.java:540)
at hudson.model.AbstractProject.checkout(AbstractProject.java:1248)
at hudson.model.AbstractBuild$AbstractBuildExecution.defaultCheckout(AbstractBuild.java:649)
at jenkins.scm.SCMCheckoutStrategy.checkout(SCMCheckoutStrategy.java:85)
at hudson.model.AbstractBuild$AbstractBuildExecution.run(AbstractBuild.java:521)
at hudson.model.Run.execute(Run.java:1841)
at hudson.model.FreeStyleBuild.run(FreeStyleBuild.java:44)
at hudson.model.ResourceController.execute(ResourceController.java:101)
at hudson.model.Executor.run(Executor.java:442)
ERROR: Error cloning remote repo 'origin'
Archiving artifacts
Recording test results
ERROR: Step ‘Publish JUnit test result report’ failed: No test report files were found. Configuration error?
Email was triggered for: Failure - Any
Sending email for trigger: Failure - Any