You are viewing a plain text version of this content. The canonical link for it is here.
Posted to user@karaf.apache.org by Paul Spencer <pa...@apache.org> on 2015/08/31 14:45:10 UTC

Getting "error: identifier expected but 'var' found." from http://localhost:8080 after building the Karaf website from the source.

I am getting "error: identifier expected but 'var' found." from http://localhost:8080 after building the Karaf website from the source.  Below are the commands I used to checkout and build the website. What did I not do?


***
* Commands used to checkout and build site
***
svn checkout https://svn.apache.org/repos/asf/karaf/site/trunk
cd trunk
mvn jetty:run -Plive


***
* Output of mvn --version
***
Apache Maven 3.1.1 (0728685237757ffbf44136acec0402957f723d9a; 2013-09-17 11:22:22-0400)
Maven home: /usr/local/apache-maven-3.1.1
Java version: 1.7.0_25, vendor: Oracle Corporation
Java home: /Library/Java/JavaVirtualMachines/jdk1.7.0_25.jdk/Contents/Home/jre
Default locale: en_US, platform encoding: UTF-8
OS name: "mac os x", version: "10.10.5", arch: "x86_64", family: "mac"


Paul Spencer

Re: Getting "error: identifier expected but 'var' found." from http://localhost:8080 after building the Karaf website from the source.

Posted by Paul Spencer <pa...@apache.org>.
JB,
I was able to build on Linux, so there is an issue with building on the Mac. While researching the build issue, It appears the Scalate's website has moved to https://scalate.github.io/scalate/index.html and the version current version is 1.7.0.

Thank you of your help. 

Paul Spencer

> On Sep 1, 2015, at 2:52 PM, Jean-Baptiste Onofré <jb...@nanthrax.net> wrote:
> 
> Hi Paul,
> 
> just built without problem with JDK 1.7 on Linux.
> 
> Regards
> JB
> 
> On 09/01/2015 08:13 PM, Paul Spencer wrote:
>> JB,
>> 1) mnv clean install fails with:
>> [INFO] --- maven-scalate-plugin:1.4.0:sitegen (generate-htmls) @ site ---
>> Processing Configuration for child elements
>> Processing child [project]
>> Processing child [scalateWorkDir]
>> Processing child [warSourceDirectory]
>> Processing child [resourcesSourceDirectory]
>> Processing child [targetDirectory]
>> Processing child [testClassPathElements]
>> [INFO] Generating static website from Scalate Templates and wiki files...
>> [INFO] template properties: null
>> [INFO] No bootstrap class scalate.Boot found on classloader: java.net.URLClassLoader@5f73a2d6
>> [ERROR] Compilation failed:
>> /Users/paul/Documents/svn_apache/karaf-site/trunk/target/sitegen-workdir/src/var/folders/b6/xxpddm852fv1hjzpb010n_km0000gn/T/scalate4942829915725396418.ssp.scala:2: error: identifier expected but 'var' found.
>> package var.folders.b6.xxpddm852fv1hjzpb010n_km0000gn.T
>>         ^
>> one error found
>> 
>> [INFO] ------------------------------------------------------------------------
>> [INFO] BUILD FAILURE
>> [INFO] ------------------------------------------------------------------------
>> 
>> 
>> 2) I am running Java 1.7 on a Mac.
>> sparrow:trunk paul$ mvn --version
>> Apache Maven 3.1.1 (0728685237757ffbf44136acec0402957f723d9a; 2013-09-17 11:22:22-0400)
>> Maven home: /usr/local/apache-maven-3.1.1
>> Java version: 1.7.0_25, vendor: Oracle Corporation
>> Java home: /Library/Java/JavaVirtualMachines/jdk1.7.0_25.jdk/Contents/Home/jre
>> Default locale: en_US, platform encoding: UTF-8
>> OS name: "mac os x", version: "10.10.5", arch: "x86_64", family: "mac"
>> sparrow:trunk paul$ echo $JAVA_HOME
>> /Library/Java/JavaVirtualMachines/jdk1.7.0_25.jdk/Contents/Home
>> sparrow:trunk paul$
>> 
>> 
>> Paul Spencer
>> 
>>> On Aug 31, 2015, at 10:44 AM, Paul Spencer <pa...@apache.org> wrote:
>>> 
>>> JB,
>>> I had already tried "mvn clean", but the result was the same.  Below is more information from the log.
>>> 
>>> 10:39:16.942 [qtp1277017018-22] DEBUG o.f.s.servlet.TemplateEngineFilter - Rendering '/index.html' using template '/index.page'
>>> 10:39:16.962 [qtp1277017018-22] DEBUG o.f.s.servlet.ServletResourceLoader - realPath for: /index.page is: /Users/paul/Documents/svn_apache/karaf-site/trunk/src/main/webapp/index.page
>>> 10:39:16.962 [qtp1277017018-22] DEBUG o.f.s.servlet.ServletResourceLoader - file from realPath for: /index.page is: /Users/paul/Documents/svn_apache/karaf-site/trunk/src/main/webapp/index.page
>>> 10:39:16.963 [qtp1277017018-22] DEBUG o.f.scalate.util.ResourceLoader - found resource: FileResource(/Users/paul/Documents/svn_apache/karaf-site/trunk/src/main/webapp/index.page,/Users/paul/Documents/svn_apache/karaf-site/trunk/src/main/webapp/index.page)
>>> 10:39:16.966 [qtp1277017018-22] DEBUG o.fusesource.scalate.TemplateEngine - Loaded uri: /index.page template: PipelineTemplate(pipeline=List(<function1>))
>>> 10:39:16.967 [qtp1277017018-22] DEBUG o.f.scalate.DefaultRenderContext - rendering template PipelineTemplate(pipeline=List(<function1>))
>>> 10:39:17.156 [qtp1277017018-22] DEBUG o.f.scalate.support.TemplatePackage - Trying to find Scalate Package class: var.folders.b6.xxpddm852fv1hjzpb010n_km0000gn.T.ScalatePackage
>>> 10:39:17.156 [qtp1277017018-22] DEBUG o.f.scalate.support.TemplatePackage - Trying to find Scalate Package class: var.folders.b6.xxpddm852fv1hjzpb010n_km0000gn.ScalatePackage
>>> 10:39:17.157 [qtp1277017018-22] DEBUG o.f.scalate.support.TemplatePackage - Trying to find Scalate Package class: var.folders.b6.ScalatePackage
>>> 10:39:17.158 [qtp1277017018-22] DEBUG o.f.scalate.support.TemplatePackage - Trying to find Scalate Package class: var.folders.ScalatePackage
>>> 10:39:17.158 [qtp1277017018-22] DEBUG o.f.scalate.support.TemplatePackage - Trying to find Scalate Package class: var.ScalatePackage
>>> 10:39:17.159 [qtp1277017018-22] DEBUG o.f.scalate.support.TemplatePackage - Trying to find Scalate Package class: ScalatePackage
>>> 10:39:17.159 [qtp1277017018-22] DEBUG o.f.scalate.support.TemplatePackage - No ScalatePackage class found from templates package: var.folders.b6.xxpddm852fv1hjzpb010n_km0000gn.T on the class loaders: List(WebAppClassLoader=Apache Karaf Documentation@6ed0b159, WebAppClassLoader=Apache Karaf Documentation@6ed0b159)
>>> 10:39:17.163 [qtp1277017018-22] DEBUG o.f.s.support.DefaultTemplatePackage - Could not find a class on the classpath based on the current url: var/folders/b6/xxpddm852fv1hjzpb010n_km0000gn/T/scalate8593583895506610212.ssp
>>> 10:39:17.186 [qtp1277017018-22] DEBUG o.f.scalate.support.ScalaCompiler - using classpath: /Users/paul/Documents/svn_apache/karaf-site/trunk/target/classes:/Users/paul/.m2/repository/org/fusesource/scalate/scalate-wikitext/1.4.0/scalate-wikitext-1.4.0.jar:/Users/paul/.m2/repository/org/fusesource/scalate/scalate-core/1.4.0/scalate-core-1.4.0.jar:/Users/paul/.m2/repository/org/fusesource/scalate/scalate-util/1.4.0/scalate-util-1.4.0.jar:/Users/paul/.m2/repository/org/fusesource/wikitext/textile-core/1.2/textile-core-1.2.jar:/Users/paul/.m2/repository/org/fusesource/wikitext/wikitext-core/1.3/wikitext-core-1.3.jar:/Users/paul/.m2/repository/org/fusesource/wikitext/confluence-core/1.3/confluence-core-1.3.jar:/Users/paul/.m2/repository/org/fusesource/scalate/scalate-page/1.4.0/scalate-page-1.4.0.jar:/Users/paul/.m2/repository/org/yaml/snakeyaml/1.7/snakeyaml-1.7.jar:/Users/paul/.m2/repository/org/fusesource/scalamd/scalamd/1.5/scalamd-1.5.jar:/Users/paul/.m2/repository/ch/qos/logback/l
> ogback-classic/1.0.9/logback-classic-1.0.9.jar:/Users/paul/.m2/repository/ch/qos/logback/logback-core/1.0.9/logback-core-1.0.9.jar:/Users/paul/.m2/repository/org/slf4j/slf4j-api/1.7.2/slf4j-api-1.7.2.jar:/Users/paul/.m2/repository/org/scala-lang/scala-library/2.8.1/scala-library-2.8.1.jar:/Users/paul/.m2/repository/org/scala-lang/scala-compiler/2.8.1/scala-compiler-2.8.1.jar:/usr/local/apache-maven-3.1.1/boot/plexus-classworlds-2.5.1.jar:/Users/paul/Documents/svn_apache/karaf-site/trunk/target/classes:/Users/paul/.m2/repository/org/fusesource/scalate/scalate-wikitext/1.4.0/scalate-wikitext-1.4.0.jar:/Users/paul/.m2/repository/org/fusesource/scalate/scalate-core/1.4.0/scalate-core-1.4.0.jar:/Users/paul/.m2/repository/org/fusesource/scalate/scalate-util/1.4.0/scalate-util-1.4.0.jar:/Users/paul/.m2/repository/org/fusesource/wikitext/textile-core/1.2/textile-core-1.2.jar:/Users/paul/.m2/repository/org/fusesource/wikitext/wikitext-core/1.3/wikitext-core-1.3.jar:/Users/paul/.m2/repository/o
> rg/fusesource/wikitext/confluence-core/1.3/confluence-core-1.3.jar:/Users/paul/.m2/repository/org/fusesource/scalate/scalate-page/1.4.0/scalate-page-1.4.0.jar:/Users/paul/.m2/repository/org/yaml/snakeyaml/1.7/snakeyaml-1.7.jar:/Users/paul/.m2/repository/org/fusesource/scalamd/scalamd/1.5/scalamd-1.5.jar:/Users/paul/.m2/repository/ch/qos/logback/logback-classic/1.0.9/logback-classic-1.0.9.jar:/Users/paul/.m2/repository/ch/qos/logback/logback-core/1.0.9/logback-core-1.0.9.jar:/Users/paul/.m2/repository/org/slf4j/slf4j-api/1.7.2/slf4j-api-1.7.2.jar:/Users/paul/.m2/repository/org/scala-lang/scala-library/2.8.1/scala-library-2.8.1.jar:/Users/paul/.m2/repository/org/scala-lang/scala-compiler/2.8.1/scala-compiler-2.8.1.jar:/Users/paul/.m2/repository/org/mortbay/jetty/jetty-maven-plugin/8.1.4.v20120524/jetty-maven-plugin-8.1.4.v20120524.jar:/Users/paul/.m2/repository/org/eclipse/jetty/jetty-util/8.1.4.v20120524/jetty-util-8.1.4.v20120524.jar:/Users/paul/.m2/repository/org/eclipse/jetty/jetty-
> webapp/8.1.4.v20120524/jetty-webapp-8.1.4.v20120524.jar:/Users/paul/.m2/repository/org/eclipse/jetty/jetty-xml/8.1.4.v20120524/jetty-xml-8.1.4.v20120524.jar:/Users/paul/.m2/repository/org/eclipse/jetty/jetty-servlet/8.1.4.v20120524/jetty-servlet-8.1.4.v20120524.jar:/Users/paul/.m2/repository/org/eclipse/jetty/jetty-security/8.1.4.v20120524/jetty-security-8.1.4.v20120524.jar:/Users/paul/.m2/repository/org/eclipse/jetty/jetty-server/8.1.4.v20120524/jetty-server-8.1.4.v20120524.jar:/Users/paul/.m2/repository/org/eclipse/jetty/jetty-continuation/8.1.4.v20120524/jetty-continuation-8.1.4.v20120524.jar:/Users/paul/.m2/repository/org/sonatype/sisu/sisu-inject-bean/2.1.1/sisu-inject-bean-2.1.1.jar:/Users/paul/.m2/repository/org/sonatype/sisu/sisu-guice/2.9.4/sisu-guice-2.9.4-no_aop.jar:/Users/paul/.m2/repository/org/codehaus/plexus/plexus-utils/2.0.6/plexus-utils-2.0.6.jar:/Users/paul/.m2/repository/org/sonatype/aether/aether-util/1.11/aether-util-1.11.jar:/Users/paul/.m2/repository/org/codeha
> us/plexus/plexus-interpolation/1.14/plexus-interpolation-1.14.jar:/Users/paul/.m2/repository/org/codehaus/plexus/plexus-component-annotations/1.5.5/plexus-component-annotations-1.5.5.jar:/Users/paul/.m2/repository/org/sonatype/plexus/plexus-sec-dispatcher/1.3/plexus-sec-dispatcher-1.3.jar:/Users/paul/.m2/repository/org/sonatype/plexus/plexus-cipher/1.4/plexus-cipher-1.4.jar:/Users/paul/.m2/repository/org/apache/maven/plugin-tools/maven-plugin-tools-api/2.9/maven-plugin-tools-api-2.9.jar:/Users/paul/.m2/repository/org/apache/maven/reporting/maven-reporting-api/2.0.6/maven-reporting-api-2.0.6.jar:/Users/paul/.m2/repository/org/apache/maven/doxia/doxia-sink-api/1.0-alpha-7/doxia-sink-api-1.0-alpha-7.jar:/Users/paul/.m2/repository/junit/junit/3.8.1/junit-3.8.1.jar:/Users/paul/.m2/repository/net/sf/jtidy/jtidy/r938/jtidy-r938.jar:/Users/paul/.m2/repository/org/eclipse/jetty/jetty-plus/8.1.4.v20120524/jetty-plus-8.1.4.v20120524.jar:/Users/paul/.m2/repository/org/eclipse/jetty/orbit/javax.tr
> ansaction/1.1.1.v201105210645/javax.transaction-1.1.1.v201105210645.jar:/Users/paul/.m2/repository/org/eclipse/jetty/jetty-jndi/8.1.4.v20120524/jetty-jndi-8.1.4.v20120524.jar:/Users/paul/.m2/repository/org/eclipse/jetty/orbit/javax.mail.glassfish/1.4.1.v201005082020/javax.mail.glassfish-1.4.1.v201005082020.jar:/Users/paul/.m2/repository/org/eclipse/jetty/orbit/javax.activation/1.1.0.v201105071233/javax.activation-1.1.0.v201105071233.jar:/Users/paul/.m2/repository/org/eclipse/jetty/jetty-jmx/8.1.4.v20120524/jetty-jmx-8.1.4.v20120524.jar:/Users/paul/.m2/repository/org/eclipse/jetty/jetty-annotations/8.1.4.v20120524/jetty-annotations-8.1.4.v20120524.jar:/Users/paul/.m2/repository/org/eclipse/jetty/orbit/javax.annotation/1.1.0.v201108011116/javax.annotation-1.1.0.v201108011116.jar:/Users/paul/.m2/repository/org/eclipse/jetty/orbit/org.objectweb.asm/3.1.0.v200803061910/org.objectweb.asm-3.1.0.v200803061910.jar:/Users/paul/.m2/repository/org/eclipse/jetty/jetty-websocket/8.1.4.v20120524/jet
> ty-websocket-8.1.4.v20120524.jar:/Users/paul/.m2/repository/org/eclipse/jetty/jetty-io/8.1.4.v20120524/jetty-io-8.1.4.v20120524.jar:/Users/paul/.m2/repository/org/eclipse/jetty/jetty-http/8.1.4.v20120524/jetty-http-8.1.4.v20120524.jar:/Users/paul/.m2/repository/org/eclipse/jetty/jetty-jsp/8.1.4.v20120524/jetty-jsp-8.1.4.v20120524.jar:/Users/paul/.m2/repository/org/eclipse/jetty/orbit/javax.servlet.jsp/2.2.0.v201112011158/javax.servlet.jsp-2.2.0.v201112011158.jar:/Users/paul/.m2/repository/org/eclipse/jetty/orbit/javax.servlet/3.0.0.v201112011016/javax.servlet-3.0.0.v201112011016.jar:/Users/paul/.m2/repository/org/eclipse/jetty/orbit/org.apache.jasper.glassfish/2.2.2.v201112011158/org.apache.jasper.glassfish-2.2.2.v201112011158.jar:/Users/paul/.m2/repository/org/eclipse/jetty/orbit/javax.servlet.jsp.jstl/1.2.0.v201105211821/javax.servlet.jsp.jstl-1.2.0.v201105211821.jar:/Users/paul/.m2/repository/org/eclipse/jetty/orbit/org.apache.taglibs.standard.glassfish/1.2.0.v201112081803/org.apac
> he.taglibs.standard.glassfish-1.2.0.v201112081803.jar:/Users/paul/.m2/repository/org/eclipse/jetty/orbit/javax.el/2.2.0.v201108011116/javax.el-2.2.0.v201108011116.jar:/Users/paul/.m2/repository/org/eclipse/jetty/orbit/com.sun.el/2.2.0.v201108011116/com.sun.el-2.2.0.v201108011116.jar:/Users/paul/.m2/repository/org/eclipse/jetty/orbit/org.eclipse.jdt.core/3.7.1/org.eclipse.jdt.core-3.7.1.jar
>>> 10:39:17.187 [qtp1277017018-22] DEBUG o.f.scalate.support.ScalaCompiler - system class loader: sun.misc.Launcher$AppClassLoader@74220711
>>> 10:39:17.187 [qtp1277017018-22] DEBUG o.f.scalate.support.ScalaCompiler - context class loader: WebAppClassLoader=Apache Karaf Documentation@6ed0b159
>>> 10:39:17.188 [qtp1277017018-22] DEBUG o.f.scalate.support.ScalaCompiler - scalate class loader: WebAppClassLoader=Apache Karaf Documentation@6ed0b159
>>> 10:39:18.378 [qtp1277017018-22] DEBUG o.f.scalate.support.TemplatePackage - Trying to find Scalate Package class: var.folders.b6.xxpddm852fv1hjzpb010n_km0000gn.T.ScalatePackage
>>> 10:39:18.379 [qtp1277017018-22] DEBUG o.f.scalate.support.TemplatePackage - Trying to find Scalate Package class: var.folders.b6.xxpddm852fv1hjzpb010n_km0000gn.ScalatePackage
>>> 10:39:18.379 [qtp1277017018-22] DEBUG o.f.scalate.support.TemplatePackage - Trying to find Scalate Package class: var.folders.b6.ScalatePackage
>>> 10:39:18.380 [qtp1277017018-22] DEBUG o.f.scalate.support.TemplatePackage - Trying to find Scalate Package class: var.folders.ScalatePackage
>>> 10:39:18.381 [qtp1277017018-22] DEBUG o.f.scalate.support.TemplatePackage - Trying to find Scalate Package class: var.ScalatePackage
>>> 10:39:18.381 [qtp1277017018-22] DEBUG o.f.scalate.support.TemplatePackage - Trying to find Scalate Package class: ScalatePackage
>>> 10:39:18.382 [qtp1277017018-22] DEBUG o.f.scalate.support.TemplatePackage - No ScalatePackage class found from templates package: var.folders.b6.xxpddm852fv1hjzpb010n_km0000gn.T on the class loaders: List(WebAppClassLoader=Apache Karaf Documentation@6ed0b159, WebAppClassLoader=Apache Karaf Documentation@6ed0b159)
>>> 10:39:18.382 [qtp1277017018-22] DEBUG o.f.s.support.DefaultTemplatePackage - Could not find a class on the classpath based on the current url: var/folders/b6/xxpddm852fv1hjzpb010n_km0000gn/T/scalate8593583895506610212.ssp
>>> 10:39:18.397 [qtp1277017018-22] ERROR o.fusesource.scalate.TemplateEngine - Compilation failed:
>>> /Users/paul/Documents/svn_apache/karaf-site/trunk/target/scalateWorkDir/src/var/folders/b6/xxpddm852fv1hjzpb010n_km0000gn/T/scalate8593583895506610212.ssp.scala:2: error: identifier expected but 'var' found.
>>> package var.folders.b6.xxpddm852fv1hjzpb010n_km0000gn.T
>>>        ^
>>> one error found
>>> 
>>> 10:39:18.402 [qtp1277017018-22] DEBUG o.fusesource.scalate.TemplateEngine - stack trace: 14f84329206
>>> org.fusesource.scalate.CompilerException: Compilation failed:
>>> /Users/paul/Documents/svn_apache/karaf-site/trunk/target/scalateWorkDir/src/var/folders/b6/xxpddm852fv1hjzpb010n_km0000gn/T/scalate8593583895506610212.ssp.scala:2: error: identifier expected but 'var' found.
>>> package var.folders.b6.xxpddm852fv1hjzpb010n_km0000gn.T
>>>        ^
>>> one error found
>>> 
>>> 	at org.fusesource.scalate.support.ScalaCompiler.compile(ScalaCompiler.scala:86) ~[scalate-core-1.4.0.jar:1.4.0]
>>> 	at org.fusesource.scalate.TemplateEngine.compileAndLoad(TemplateEngine.scala:691) [scalate-core-1.4.0.jar:1.4.0]
>>> 	at org.fusesource.scalate.TemplateEngine.compileAndLoad(TemplateEngine.scala:721) [scalate-core-1.4.0.jar:1.4.0]
>>> 	at org.fusesource.scalate.TemplateEngine.compile(TemplateEngine.scala:298) [scalate-core-1.4.0.jar:1.4.0]
>>> 	at org.fusesource.scalate.TemplateEngine.compileText(TemplateEngine.scala:289) [scalate-core-1.4.0.jar:1.4.0]
>>> 	at org.fusesource.scalate.TemplateEngine$$anonfun$filter$1$$anon$2.filter(TemplateEngine.scala:169) ~[scalate-core-1.4.0.jar:1.4.0]
>>> 	at org.fusesource.scalate.page.PageFilter$$anonfun$15.apply(PageFilter.scala:185) ~[scalate-page-1.4.0.jar:1.4.0]
>>> 	at org.fusesource.scalate.page.PageFilter$$anonfun$15.apply(PageFilter.scala:185) ~[scalate-page-1.4.0.jar:1.4.0]
>>> 	at scala.Option.map(Option.scala:129) ~[scala-library-2.8.1.jar:na]
>>> 	at org.fusesource.scalate.page.PageFilter$.meta_data(PageFilter.scala:185) ~[scalate-page-1.4.0.jar:1.4.0]
>>> 	at org.fusesource.scalate.page.PageFilter$.filter(PageFilter.scala:137) ~[scalate-page-1.4.0.jar:1.4.0]
>>> 	at org.fusesource.scalate.support.PipelineTemplate$$anonfun$render$1.apply(PipelineTemplate.scala:31) ~[scalate-core-1.4.0.jar:1.4.0]
>>> 	at org.fusesource.scalate.support.PipelineTemplate$$anonfun$render$1.apply(PipelineTemplate.scala:30) ~[scalate-core-1.4.0.jar:1.4.0]
>>> 	at scala.collection.LinearSeqOptimized$class.foreach(LinearSeqOptimized.scala:61) ~[scala-library-2.8.1.jar:na]
>>> 	at scala.collection.immutable.List.foreach(List.scala:45) ~[scala-library-2.8.1.jar:na]
>>> 	at org.fusesource.scalate.support.PipelineTemplate.render(PipelineTemplate.scala:30) ~[scalate-core-1.4.0.jar:1.4.0]
>>> 	at org.fusesource.scalate.DefaultRenderContext.capture(DefaultRenderContext.scala:92) ~[scalate-core-1.4.0.jar:1.4.0]
>>> 	at org.fusesource.scalate.layout.DefaultLayoutStrategy.layout(DefaultLayoutStrategy.scala:45) ~[scalate-core-1.4.0.jar:1.4.0]
>>> 	at org.fusesource.scalate.TemplateEngine$$anonfun$layout$1.apply(TemplateEngine.scala:503) ~[scalate-core-1.4.0.jar:1.4.0]
>>> 	at org.fusesource.scalate.TemplateEngine$$anonfun$layout$1.apply(TemplateEngine.scala:503) ~[scalate-core-1.4.0.jar:1.4.0]
>>> 	at org.fusesource.scalate.RenderContext$.using(RenderContext.scala:49) ~[scalate-core-1.4.0.jar:1.4.0]
>>> 	at org.fusesource.scalate.TemplateEngine.layout(TemplateEngine.scala:503) [scalate-core-1.4.0.jar:1.4.0]
>>> 	at org.fusesource.scalate.RenderContext$$anonfun$include$1.apply(RenderContext.scala:267) ~[scalate-core-1.4.0.jar:1.4.0]
>>> 	at org.fusesource.scalate.RenderContext$$anonfun$include$1.apply(RenderContext.scala:267) ~[scalate-core-1.4.0.jar:1.4.0]
>>> 	at org.fusesource.scalate.RenderContext$class.withUri(RenderContext.scala:423) ~[scalate-core-1.4.0.jar:1.4.0]
>>> 	at org.fusesource.scalate.DefaultRenderContext.withUri(DefaultRenderContext.scala:30) ~[scalate-core-1.4.0.jar:1.4.0]
>>> 	at org.fusesource.scalate.RenderContext$class.include(RenderContext.scala:267) ~[scalate-core-1.4.0.jar:1.4.0]
>>> 	at org.fusesource.scalate.DefaultRenderContext.include(DefaultRenderContext.scala:30) ~[scalate-core-1.4.0.jar:1.4.0]
>>> 	at org.fusesource.scalate.RenderContext$class.include(RenderContext.scala:257) ~[scalate-core-1.4.0.jar:1.4.0]
>>> 	at org.fusesource.scalate.DefaultRenderContext.include(DefaultRenderContext.scala:30) ~[scalate-core-1.4.0.jar:1.4.0]
>>> 	at org.fusesource.scalate.servlet.TemplateEngineFilter.doFilter(TemplateEngineFilter.scala:81) ~[scalate-core-1.4.0.jar:1.4.0]
>>> 	at org.eclipse.jetty.servlet.ServletHandler$CachedChain.doFilter(ServletHandler.java:1338) ~[na:na]
>>> 	at org.eclipse.jetty.servlet.ServletHandler.doHandle(ServletHandler.java:484) ~[na:na]
>>> 	at org.eclipse.jetty.server.handler.ScopedHandler.handle(ScopedHandler.java:119) ~[na:na]
>>> 	at org.eclipse.jetty.security.SecurityHandler.handle(SecurityHandler.java:524) ~[na:na]
>>> 	at org.eclipse.jetty.server.session.SessionHandler.doHandle(SessionHandler.java:231) ~[na:na]
>>> 	at org.eclipse.jetty.server.handler.ContextHandler.doHandle(ContextHandler.java:1065) ~[na:na]
>>> 	at org.eclipse.jetty.servlet.ServletHandler.doScope(ServletHandler.java:413) ~[na:na]
>>> 	at org.eclipse.jetty.server.session.SessionHandler.doScope(SessionHandler.java:192) ~[na:na]
>>> 	at org.eclipse.jetty.server.handler.ContextHandler.doScope(ContextHandler.java:999) ~[na:na]
>>> 	at org.eclipse.jetty.server.handler.ScopedHandler.handle(ScopedHandler.java:117) ~[na:na]
>>> 	at org.eclipse.jetty.server.handler.ContextHandlerCollection.handle(ContextHandlerCollection.java:250) ~[na:na]
>>> 	at org.eclipse.jetty.server.handler.HandlerCollection.handle(HandlerCollection.java:149) ~[na:na]
>>> 	at org.eclipse.jetty.server.handler.HandlerWrapper.handle(HandlerWrapper.java:111) ~[na:na]
>>> 	at org.eclipse.jetty.server.Server.handle(Server.java:350) ~[na:na]
>>> 	at org.eclipse.jetty.server.AbstractHttpConnection.handleRequest(AbstractHttpConnection.java:454) ~[na:na]
>>> 	at org.eclipse.jetty.server.AbstractHttpConnection.headerComplete(AbstractHttpConnection.java:890) ~[na:na]
>>> 	at org.eclipse.jetty.server.AbstractHttpConnection$RequestHandler.headerComplete(AbstractHttpConnection.java:944) ~[na:na]
>>> 	at org.eclipse.jetty.http.HttpParser.parseNext(HttpParser.java:630) ~[na:na]
>>> 	at org.eclipse.jetty.http.HttpParser.parseAvailable(HttpParser.java:230) ~[na:na]
>>> 	at org.eclipse.jetty.server.AsyncHttpConnection.handle(AsyncHttpConnection.java:77) ~[na:na]
>>> 	at org.eclipse.jetty.io.nio.SelectChannelEndPoint.handle(SelectChannelEndPoint.java:620) ~[na:na]
>>> 	at org.eclipse.jetty.io.nio.SelectChannelEndPoint$1.run(SelectChannelEndPoint.java:46) ~[na:na]
>>> 	at org.eclipse.jetty.util.thread.QueuedThreadPool.runJob(QueuedThreadPool.java:603) ~[na:na]
>>> 	at org.eclipse.jetty.util.thread.QueuedThreadPool$3.run(QueuedThreadPool.java:538) ~[na:na]
>>> 	at java.lang.Thread.run(Thread.java:724) ~[na:1.7.0_25]
>>> 10:39:18.404 [qtp1277017018-22] INFO  o.f.s.servlet.TemplateEngineFilter - failure: org.fusesource.scalate.CompilerException: Compilation failed:
>>> :2.9 error: identifier expected but 'var' found.
>>> package var.folders.b6.xxpddm852fv1hjzpb010n_km0000gn.T
>>> 
>>>        ^
>>> 
>>> 10:39:18.405 [qtp1277017018-22] DEBUG o.f.s.servlet.TemplateEngineFilter - stack trace: 14f84329207
>>> org.fusesource.scalate.CompilerException: Compilation failed:
>>> :2.9 error: identifier expected but 'var' found.
>>> package var.folders.b6.xxpddm852fv1hjzpb010n_km0000gn.T
>>> 
>>>        ^
>>> 
>>> 	at org.fusesource.scalate.TemplateEngine.compileAndLoad(TemplateEngine.scala:767) ~[scalate-core-1.4.0.jar:1.4.0]
>>> 	at org.fusesource.scalate.TemplateEngine.compileAndLoad(TemplateEngine.scala:721) ~[scalate-core-1.4.0.jar:1.4.0]
>>> 	at org.fusesource.scalate.TemplateEngine.compile(TemplateEngine.scala:298) ~[scalate-core-1.4.0.jar:1.4.0]
>>> 	at org.fusesource.scalate.TemplateEngine.compileText(TemplateEngine.scala:289) ~[scalate-core-1.4.0.jar:1.4.0]
>>> 	at org.fusesource.scalate.TemplateEngine$$anonfun$filter$1$$anon$2.filter(TemplateEngine.scala:169) ~[scalate-core-1.4.0.jar:1.4.0]
>>> 	at org.fusesource.scalate.page.PageFilter$$anonfun$15.apply(PageFilter.scala:185) ~[scalate-page-1.4.0.jar:1.4.0]
>>> 	at org.fusesource.scalate.page.PageFilter$$anonfun$15.apply(PageFilter.scala:185) ~[scalate-page-1.4.0.jar:1.4.0]
>>> 	at scala.Option.map(Option.scala:129) ~[scala-library-2.8.1.jar:na]
>>> 	at org.fusesource.scalate.page.PageFilter$.meta_data(PageFilter.scala:185) ~[scalate-page-1.4.0.jar:1.4.0]
>>> 	at org.fusesource.scalate.page.PageFilter$.filter(PageFilter.scala:137) ~[scalate-page-1.4.0.jar:1.4.0]
>>> 	at org.fusesource.scalate.support.PipelineTemplate$$anonfun$render$1.apply(PipelineTemplate.scala:31) ~[scalate-core-1.4.0.jar:1.4.0]
>>> 	at org.fusesource.scalate.support.PipelineTemplate$$anonfun$render$1.apply(PipelineTemplate.scala:30) ~[scalate-core-1.4.0.jar:1.4.0]
>>> 	at scala.collection.LinearSeqOptimized$class.foreach(LinearSeqOptimized.scala:61) ~[scala-library-2.8.1.jar:na]
>>> 	at scala.collection.immutable.List.foreach(List.scala:45) ~[scala-library-2.8.1.jar:na]
>>> 	at org.fusesource.scalate.support.PipelineTemplate.render(PipelineTemplate.scala:30) ~[scalate-core-1.4.0.jar:1.4.0]
>>> 	at org.fusesource.scalate.DefaultRenderContext.capture(DefaultRenderContext.scala:92) ~[scalate-core-1.4.0.jar:1.4.0]
>>> 	at org.fusesource.scalate.layout.DefaultLayoutStrategy.layout(DefaultLayoutStrategy.scala:45) ~[scalate-core-1.4.0.jar:1.4.0]
>>> 	at org.fusesource.scalate.TemplateEngine$$anonfun$layout$1.apply(TemplateEngine.scala:503) ~[scalate-core-1.4.0.jar:1.4.0]
>>> 	at org.fusesource.scalate.TemplateEngine$$anonfun$layout$1.apply(TemplateEngine.scala:503) ~[scalate-core-1.4.0.jar:1.4.0]
>>> 	at org.fusesource.scalate.RenderContext$.using(RenderContext.scala:49) ~[scalate-core-1.4.0.jar:1.4.0]
>>> 	at org.fusesource.scalate.TemplateEngine.layout(TemplateEngine.scala:503) ~[scalate-core-1.4.0.jar:1.4.0]
>>> 	at org.fusesource.scalate.RenderContext$$anonfun$include$1.apply(RenderContext.scala:267) ~[scalate-core-1.4.0.jar:1.4.0]
>>> 	at org.fusesource.scalate.RenderContext$$anonfun$include$1.apply(RenderContext.scala:267) ~[scalate-core-1.4.0.jar:1.4.0]
>>> 	at org.fusesource.scalate.RenderContext$class.withUri(RenderContext.scala:423) ~[scalate-core-1.4.0.jar:1.4.0]
>>> 	at org.fusesource.scalate.DefaultRenderContext.withUri(DefaultRenderContext.scala:30) ~[scalate-core-1.4.0.jar:1.4.0]
>>> 	at org.fusesource.scalate.RenderContext$class.include(RenderContext.scala:267) ~[scalate-core-1.4.0.jar:1.4.0]
>>> 	at org.fusesource.scalate.DefaultRenderContext.include(DefaultRenderContext.scala:30) ~[scalate-core-1.4.0.jar:1.4.0]
>>> 	at org.fusesource.scalate.RenderContext$class.include(RenderContext.scala:257) ~[scalate-core-1.4.0.jar:1.4.0]
>>> 	at org.fusesource.scalate.DefaultRenderContext.include(DefaultRenderContext.scala:30) ~[scalate-core-1.4.0.jar:1.4.0]
>>> 	at org.fusesource.scalate.servlet.TemplateEngineFilter.doFilter(TemplateEngineFilter.scala:81) ~[scalate-core-1.4.0.jar:1.4.0]
>>> 	at org.eclipse.jetty.servlet.ServletHandler$CachedChain.doFilter(ServletHandler.java:1338) ~[na:na]
>>> 	at org.eclipse.jetty.servlet.ServletHandler.doHandle(ServletHandler.java:484) ~[na:na]
>>> 	at org.eclipse.jetty.server.handler.ScopedHandler.handle(ScopedHandler.java:119) ~[na:na]
>>> 	at org.eclipse.jetty.security.SecurityHandler.handle(SecurityHandler.java:524) ~[na:na]
>>> 	at org.eclipse.jetty.server.session.SessionHandler.doHandle(SessionHandler.java:231) ~[na:na]
>>> 	at org.eclipse.jetty.server.handler.ContextHandler.doHandle(ContextHandler.java:1065) ~[na:na]
>>> 	at org.eclipse.jetty.servlet.ServletHandler.doScope(ServletHandler.java:413) ~[na:na]
>>> 	at org.eclipse.jetty.server.session.SessionHandler.doScope(SessionHandler.java:192) ~[na:na]
>>> 	at org.eclipse.jetty.server.handler.ContextHandler.doScope(ContextHandler.java:999) ~[na:na]
>>> 	at org.eclipse.jetty.server.handler.ScopedHandler.handle(ScopedHandler.java:117) ~[na:na]
>>> 	at org.eclipse.jetty.server.handler.ContextHandlerCollection.handle(ContextHandlerCollection.java:250) ~[na:na]
>>> 	at org.eclipse.jetty.server.handler.HandlerCollection.handle(HandlerCollection.java:149) ~[na:na]
>>> 	at org.eclipse.jetty.server.handler.HandlerWrapper.handle(HandlerWrapper.java:111) ~[na:na]
>>> 	at org.eclipse.jetty.server.Server.handle(Server.java:350) ~[na:na]
>>> 	at org.eclipse.jetty.server.AbstractHttpConnection.handleRequest(AbstractHttpConnection.java:454) ~[na:na]
>>> 	at org.eclipse.jetty.server.AbstractHttpConnection.headerComplete(AbstractHttpConnection.java:890) ~[na:na]
>>> 	at org.eclipse.jetty.server.AbstractHttpConnection$RequestHandler.headerComplete(AbstractHttpConnection.java:944) ~[na:na]
>>> 	at org.eclipse.jetty.http.HttpParser.parseNext(HttpParser.java:630) ~[na:na]
>>> 	at org.eclipse.jetty.http.HttpParser.parseAvailable(HttpParser.java:230) ~[na:na]
>>> 	at org.eclipse.jetty.server.AsyncHttpConnection.handle(AsyncHttpConnection.java:77) ~[na:na]
>>> 	at org.eclipse.jetty.io.nio.SelectChannelEndPoint.handle(SelectChannelEndPoint.java:620) ~[na:na]
>>> 	at org.eclipse.jetty.io.nio.SelectChannelEndPoint$1.run(SelectChannelEndPoint.java:46) ~[na:na]
>>> 	at org.eclipse.jetty.util.thread.QueuedThreadPool.runJob(QueuedThreadPool.java:603) ~[na:na]
>>> 	at org.eclipse.jetty.util.thread.QueuedThreadPool$3.run(QueuedThreadPool.java:538) ~[na:na]
>>> 	at java.lang.Thread.run(Thread.java:724) ~[na:1.7.0_25]
>>> 10:39:18.407 [qtp1277017018-22] DEBUG o.f.s.servlet.ServletResourceLoader - realPath for: /WEB-INF/WEB-INF/scalate/errors/500.mustache is: /Users/paul/Documents/svn_apache/karaf-site/trunk/src/main/webapp/WEB-INF/WEB-INF/scalate/errors/500.mustache
>>> 10:39:18.407 [qtp1277017018-22] DEBUG o.f.s.servlet.ServletResourceLoader - file from realPath for: /WEB-INF/WEB-INF/scalate/errors/500.mustache is: /Users/paul/Documents/svn_apache/karaf-site/trunk/src/main/webapp/WEB-INF/WEB-INF/scalate/errors/500.mustache
>>> 10:39:18.407 [qtp1277017018-22] DEBUG o.f.scalate.util.ResourceLoader - Trying to load uri: /WEB-INF/WEB-INF/scalate/errors/500.mustache
>>> 10:39:18.407 [qtp1277017018-22] DEBUG o.f.s.servlet.ServletResourceLoader - realPath for: /WEB-INF/scalate/errors/500.mustache is: /Users/paul/Documents/svn_apache/karaf-site/trunk/src/main/webapp/WEB-INF/scalate/errors/500.mustache
>>> 
>>> 
>>> Paul Spencer
>>> 
>>>> On Aug 31, 2015, at 9:20 AM, Jean-Baptiste Onofré <jb...@nanthrax.net> wrote:
>>>> 
>>>> You have to do mvn clean install before jetty:run.
>>>> 
>>>> Regards
>>>> JB
>>>> 
>>>> On 08/31/2015 02:45 PM, Paul Spencer wrote:
>>>>> I am getting "error: identifier expected but 'var' found." from http://localhost:8080 after building the Karaf website from the source.  Below are the commands I used to checkout and build the website. What did I not do?
>>>>> 
>>>>> 
>>>>> ***
>>>>> * Commands used to checkout and build site
>>>>> ***
>>>>> svn checkout https://svn.apache.org/repos/asf/karaf/site/trunk
>>>>> cd trunk
>>>>> mvn jetty:run -Plive
>>>>> 
>>>>> 
>>>>> ***
>>>>> * Output of mvn --version
>>>>> ***
>>>>> Apache Maven 3.1.1 (0728685237757ffbf44136acec0402957f723d9a; 2013-09-17 11:22:22-0400)
>>>>> Maven home: /usr/local/apache-maven-3.1.1
>>>>> Java version: 1.7.0_25, vendor: Oracle Corporation
>>>>> Java home: /Library/Java/JavaVirtualMachines/jdk1.7.0_25.jdk/Contents/Home/jre
>>>>> Default locale: en_US, platform encoding: UTF-8
>>>>> OS name: "mac os x", version: "10.10.5", arch: "x86_64", family: "mac"
>>>>> 
>>>>> 
>>>>> Paul Spencer
>>>>> 
>>>> 
>>>> --
>>>> Jean-Baptiste Onofré
>>>> jbonofre@apache.org
>>>> http://blog.nanthrax.net
>>>> Talend - http://www.talend.com
>>> 
>> 
> 
> -- 
> Jean-Baptiste Onofré
> jbonofre@apache.org
> http://blog.nanthrax.net
> Talend - http://www.talend.com


Re: Getting "error: identifier expected but 'var' found." from http://localhost:8080 after building the Karaf website from the source.

Posted by Jean-Baptiste Onofré <jb...@nanthrax.net>.
Hi Paul,

just built without problem with JDK 1.7 on Linux.

Regards
JB

On 09/01/2015 08:13 PM, Paul Spencer wrote:
> JB,
> 1) mnv clean install fails with:
> [INFO] --- maven-scalate-plugin:1.4.0:sitegen (generate-htmls) @ site ---
> Processing Configuration for child elements
> Processing child [project]
> Processing child [scalateWorkDir]
> Processing child [warSourceDirectory]
> Processing child [resourcesSourceDirectory]
> Processing child [targetDirectory]
> Processing child [testClassPathElements]
> [INFO] Generating static website from Scalate Templates and wiki files...
> [INFO] template properties: null
> [INFO] No bootstrap class scalate.Boot found on classloader: java.net.URLClassLoader@5f73a2d6
> [ERROR] Compilation failed:
> /Users/paul/Documents/svn_apache/karaf-site/trunk/target/sitegen-workdir/src/var/folders/b6/xxpddm852fv1hjzpb010n_km0000gn/T/scalate4942829915725396418.ssp.scala:2: error: identifier expected but 'var' found.
> package var.folders.b6.xxpddm852fv1hjzpb010n_km0000gn.T
>          ^
> one error found
>
> [INFO] ------------------------------------------------------------------------
> [INFO] BUILD FAILURE
> [INFO] ------------------------------------------------------------------------
>
>
> 2) I am running Java 1.7 on a Mac.
> sparrow:trunk paul$ mvn --version
> Apache Maven 3.1.1 (0728685237757ffbf44136acec0402957f723d9a; 2013-09-17 11:22:22-0400)
> Maven home: /usr/local/apache-maven-3.1.1
> Java version: 1.7.0_25, vendor: Oracle Corporation
> Java home: /Library/Java/JavaVirtualMachines/jdk1.7.0_25.jdk/Contents/Home/jre
> Default locale: en_US, platform encoding: UTF-8
> OS name: "mac os x", version: "10.10.5", arch: "x86_64", family: "mac"
> sparrow:trunk paul$ echo $JAVA_HOME
> /Library/Java/JavaVirtualMachines/jdk1.7.0_25.jdk/Contents/Home
> sparrow:trunk paul$
>
>
> Paul Spencer
>
>> On Aug 31, 2015, at 10:44 AM, Paul Spencer <pa...@apache.org> wrote:
>>
>> JB,
>> I had already tried "mvn clean", but the result was the same.  Below is more information from the log.
>>
>> 10:39:16.942 [qtp1277017018-22] DEBUG o.f.s.servlet.TemplateEngineFilter - Rendering '/index.html' using template '/index.page'
>> 10:39:16.962 [qtp1277017018-22] DEBUG o.f.s.servlet.ServletResourceLoader - realPath for: /index.page is: /Users/paul/Documents/svn_apache/karaf-site/trunk/src/main/webapp/index.page
>> 10:39:16.962 [qtp1277017018-22] DEBUG o.f.s.servlet.ServletResourceLoader - file from realPath for: /index.page is: /Users/paul/Documents/svn_apache/karaf-site/trunk/src/main/webapp/index.page
>> 10:39:16.963 [qtp1277017018-22] DEBUG o.f.scalate.util.ResourceLoader - found resource: FileResource(/Users/paul/Documents/svn_apache/karaf-site/trunk/src/main/webapp/index.page,/Users/paul/Documents/svn_apache/karaf-site/trunk/src/main/webapp/index.page)
>> 10:39:16.966 [qtp1277017018-22] DEBUG o.fusesource.scalate.TemplateEngine - Loaded uri: /index.page template: PipelineTemplate(pipeline=List(<function1>))
>> 10:39:16.967 [qtp1277017018-22] DEBUG o.f.scalate.DefaultRenderContext - rendering template PipelineTemplate(pipeline=List(<function1>))
>> 10:39:17.156 [qtp1277017018-22] DEBUG o.f.scalate.support.TemplatePackage - Trying to find Scalate Package class: var.folders.b6.xxpddm852fv1hjzpb010n_km0000gn.T.ScalatePackage
>> 10:39:17.156 [qtp1277017018-22] DEBUG o.f.scalate.support.TemplatePackage - Trying to find Scalate Package class: var.folders.b6.xxpddm852fv1hjzpb010n_km0000gn.ScalatePackage
>> 10:39:17.157 [qtp1277017018-22] DEBUG o.f.scalate.support.TemplatePackage - Trying to find Scalate Package class: var.folders.b6.ScalatePackage
>> 10:39:17.158 [qtp1277017018-22] DEBUG o.f.scalate.support.TemplatePackage - Trying to find Scalate Package class: var.folders.ScalatePackage
>> 10:39:17.158 [qtp1277017018-22] DEBUG o.f.scalate.support.TemplatePackage - Trying to find Scalate Package class: var.ScalatePackage
>> 10:39:17.159 [qtp1277017018-22] DEBUG o.f.scalate.support.TemplatePackage - Trying to find Scalate Package class: ScalatePackage
>> 10:39:17.159 [qtp1277017018-22] DEBUG o.f.scalate.support.TemplatePackage - No ScalatePackage class found from templates package: var.folders.b6.xxpddm852fv1hjzpb010n_km0000gn.T on the class loaders: List(WebAppClassLoader=Apache Karaf Documentation@6ed0b159, WebAppClassLoader=Apache Karaf Documentation@6ed0b159)
>> 10:39:17.163 [qtp1277017018-22] DEBUG o.f.s.support.DefaultTemplatePackage - Could not find a class on the classpath based on the current url: var/folders/b6/xxpddm852fv1hjzpb010n_km0000gn/T/scalate8593583895506610212.ssp
>> 10:39:17.186 [qtp1277017018-22] DEBUG o.f.scalate.support.ScalaCompiler - using classpath: /Users/paul/Documents/svn_apache/karaf-site/trunk/target/classes:/Users/paul/.m2/repository/org/fusesource/scalate/scalate-wikitext/1.4.0/scalate-wikitext-1.4.0.jar:/Users/paul/.m2/repository/org/fusesource/scalate/scalate-core/1.4.0/scalate-core-1.4.0.jar:/Users/paul/.m2/repository/org/fusesource/scalate/scalate-util/1.4.0/scalate-util-1.4.0.jar:/Users/paul/.m2/repository/org/fusesource/wikitext/textile-core/1.2/textile-core-1.2.jar:/Users/paul/.m2/repository/org/fusesource/wikitext/wikitext-core/1.3/wikitext-core-1.3.jar:/Users/paul/.m2/repository/org/fusesource/wikitext/confluence-core/1.3/confluence-core-1.3.jar:/Users/paul/.m2/repository/org/fusesource/scalate/scalate-page/1.4.0/scalate-page-1.4.0.jar:/Users/paul/.m2/repository/org/yaml/snakeyaml/1.7/snakeyaml-1.7.jar:/Users/paul/.m2/repository/org/fusesource/scalamd/scalamd/1.5/scalamd-1.5.jar:/Users/paul/.m2/repository/ch/qos/logback/l
ogback-classic/1.0.9/logback-classic-1.0.9.jar:/Users/paul/.m2/repository/ch/qos/logback/logback-core/1.0.9/logback-core-1.0.9.jar:/Users/paul/.m2/repository/org/slf4j/slf4j-api/1.7.2/slf4j-api-1.7.2.jar:/Users/paul/.m2/repository/org/scala-lang/scala-library/2.8.1/scala-library-2.8.1.jar:/Users/paul/.m2/repository/org/scala-lang/scala-compiler/2.8.1/scala-compiler-2.8.1.jar:/usr/local/apache-maven-3.1.1/boot/plexus-classworlds-2.5.1.jar:/Users/paul/Documents/svn_apache/karaf-site/trunk/target/classes:/Users/paul/.m2/repository/org/fusesource/scalate/scalate-wikitext/1.4.0/scalate-wikitext-1.4.0.jar:/Users/paul/.m2/repository/org/fusesource/scalate/scalate-core/1.4.0/scalate-core-1.4.0.jar:/Users/paul/.m2/repository/org/fusesource/scalate/scalate-util/1.4.0/scalate-util-1.4.0.jar:/Users/paul/.m2/repository/org/fusesource/wikitext/textile-core/1.2/textile-core-1.2.jar:/Users/paul/.m2/repository/org/fusesource/wikitext/wikitext-core/1.3/wikitext-core-1.3.jar:/Users/paul/.m2/repository/o
rg/fusesource/wikitext/confluence-core/1.3/confluence-core-1.3.jar:/Users/paul/.m2/repository/org/fusesource/scalate/scalate-page/1.4.0/scalate-page-1.4.0.jar:/Users/paul/.m2/repository/org/yaml/snakeyaml/1.7/snakeyaml-1.7.jar:/Users/paul/.m2/repository/org/fusesource/scalamd/scalamd/1.5/scalamd-1.5.jar:/Users/paul/.m2/repository/ch/qos/logback/logback-classic/1.0.9/logback-classic-1.0.9.jar:/Users/paul/.m2/repository/ch/qos/logback/logback-core/1.0.9/logback-core-1.0.9.jar:/Users/paul/.m2/repository/org/slf4j/slf4j-api/1.7.2/slf4j-api-1.7.2.jar:/Users/paul/.m2/repository/org/scala-lang/scala-library/2.8.1/scala-library-2.8.1.jar:/Users/paul/.m2/repository/org/scala-lang/scala-compiler/2.8.1/scala-compiler-2.8.1.jar:/Users/paul/.m2/repository/org/mortbay/jetty/jetty-maven-plugin/8.1.4.v20120524/jetty-maven-plugin-8.1.4.v20120524.jar:/Users/paul/.m2/repository/org/eclipse/jetty/jetty-util/8.1.4.v20120524/jetty-util-8.1.4.v20120524.jar:/Users/paul/.m2/repository/org/eclipse/jetty/jetty-
webapp/8.1.4.v20120524/jetty-webapp-8.1.4.v20120524.jar:/Users/paul/.m2/repository/org/eclipse/jetty/jetty-xml/8.1.4.v20120524/jetty-xml-8.1.4.v20120524.jar:/Users/paul/.m2/repository/org/eclipse/jetty/jetty-servlet/8.1.4.v20120524/jetty-servlet-8.1.4.v20120524.jar:/Users/paul/.m2/repository/org/eclipse/jetty/jetty-security/8.1.4.v20120524/jetty-security-8.1.4.v20120524.jar:/Users/paul/.m2/repository/org/eclipse/jetty/jetty-server/8.1.4.v20120524/jetty-server-8.1.4.v20120524.jar:/Users/paul/.m2/repository/org/eclipse/jetty/jetty-continuation/8.1.4.v20120524/jetty-continuation-8.1.4.v20120524.jar:/Users/paul/.m2/repository/org/sonatype/sisu/sisu-inject-bean/2.1.1/sisu-inject-bean-2.1.1.jar:/Users/paul/.m2/repository/org/sonatype/sisu/sisu-guice/2.9.4/sisu-guice-2.9.4-no_aop.jar:/Users/paul/.m2/repository/org/codehaus/plexus/plexus-utils/2.0.6/plexus-utils-2.0.6.jar:/Users/paul/.m2/repository/org/sonatype/aether/aether-util/1.11/aether-util-1.11.jar:/Users/paul/.m2/repository/org/codeha
us/plexus/plexus-interpolation/1.14/plexus-interpolation-1.14.jar:/Users/paul/.m2/repository/org/codehaus/plexus/plexus-component-annotations/1.5.5/plexus-component-annotations-1.5.5.jar:/Users/paul/.m2/repository/org/sonatype/plexus/plexus-sec-dispatcher/1.3/plexus-sec-dispatcher-1.3.jar:/Users/paul/.m2/repository/org/sonatype/plexus/plexus-cipher/1.4/plexus-cipher-1.4.jar:/Users/paul/.m2/repository/org/apache/maven/plugin-tools/maven-plugin-tools-api/2.9/maven-plugin-tools-api-2.9.jar:/Users/paul/.m2/repository/org/apache/maven/reporting/maven-reporting-api/2.0.6/maven-reporting-api-2.0.6.jar:/Users/paul/.m2/repository/org/apache/maven/doxia/doxia-sink-api/1.0-alpha-7/doxia-sink-api-1.0-alpha-7.jar:/Users/paul/.m2/repository/junit/junit/3.8.1/junit-3.8.1.jar:/Users/paul/.m2/repository/net/sf/jtidy/jtidy/r938/jtidy-r938.jar:/Users/paul/.m2/repository/org/eclipse/jetty/jetty-plus/8.1.4.v20120524/jetty-plus-8.1.4.v20120524.jar:/Users/paul/.m2/repository/org/eclipse/jetty/orbit/javax.tr
ansaction/1.1.1.v201105210645/javax.transaction-1.1.1.v201105210645.jar:/Users/paul/.m2/repository/org/eclipse/jetty/jetty-jndi/8.1.4.v20120524/jetty-jndi-8.1.4.v20120524.jar:/Users/paul/.m2/repository/org/eclipse/jetty/orbit/javax.mail.glassfish/1.4.1.v201005082020/javax.mail.glassfish-1.4.1.v201005082020.jar:/Users/paul/.m2/repository/org/eclipse/jetty/orbit/javax.activation/1.1.0.v201105071233/javax.activation-1.1.0.v201105071233.jar:/Users/paul/.m2/repository/org/eclipse/jetty/jetty-jmx/8.1.4.v20120524/jetty-jmx-8.1.4.v20120524.jar:/Users/paul/.m2/repository/org/eclipse/jetty/jetty-annotations/8.1.4.v20120524/jetty-annotations-8.1.4.v20120524.jar:/Users/paul/.m2/repository/org/eclipse/jetty/orbit/javax.annotation/1.1.0.v201108011116/javax.annotation-1.1.0.v201108011116.jar:/Users/paul/.m2/repository/org/eclipse/jetty/orbit/org.objectweb.asm/3.1.0.v200803061910/org.objectweb.asm-3.1.0.v200803061910.jar:/Users/paul/.m2/repository/org/eclipse/jetty/jetty-websocket/8.1.4.v20120524/jet
ty-websocket-8.1.4.v20120524.jar:/Users/paul/.m2/repository/org/eclipse/jetty/jetty-io/8.1.4.v20120524/jetty-io-8.1.4.v20120524.jar:/Users/paul/.m2/repository/org/eclipse/jetty/jetty-http/8.1.4.v20120524/jetty-http-8.1.4.v20120524.jar:/Users/paul/.m2/repository/org/eclipse/jetty/jetty-jsp/8.1.4.v20120524/jetty-jsp-8.1.4.v20120524.jar:/Users/paul/.m2/repository/org/eclipse/jetty/orbit/javax.servlet.jsp/2.2.0.v201112011158/javax.servlet.jsp-2.2.0.v201112011158.jar:/Users/paul/.m2/repository/org/eclipse/jetty/orbit/javax.servlet/3.0.0.v201112011016/javax.servlet-3.0.0.v201112011016.jar:/Users/paul/.m2/repository/org/eclipse/jetty/orbit/org.apache.jasper.glassfish/2.2.2.v201112011158/org.apache.jasper.glassfish-2.2.2.v201112011158.jar:/Users/paul/.m2/repository/org/eclipse/jetty/orbit/javax.servlet.jsp.jstl/1.2.0.v201105211821/javax.servlet.jsp.jstl-1.2.0.v201105211821.jar:/Users/paul/.m2/repository/org/eclipse/jetty/orbit/org.apache.taglibs.standard.glassfish/1.2.0.v201112081803/org.apac
he.taglibs.standard.glassfish-1.2.0.v201112081803.jar:/Users/paul/.m2/repository/org/eclipse/jetty/orbit/javax.el/2.2.0.v201108011116/javax.el-2.2.0.v201108011116.jar:/Users/paul/.m2/repository/org/eclipse/jetty/orbit/com.sun.el/2.2.0.v201108011116/com.sun.el-2.2.0.v201108011116.jar:/Users/paul/.m2/repository/org/eclipse/jetty/orbit/org.eclipse.jdt.core/3.7.1/org.eclipse.jdt.core-3.7.1.jar
>> 10:39:17.187 [qtp1277017018-22] DEBUG o.f.scalate.support.ScalaCompiler - system class loader: sun.misc.Launcher$AppClassLoader@74220711
>> 10:39:17.187 [qtp1277017018-22] DEBUG o.f.scalate.support.ScalaCompiler - context class loader: WebAppClassLoader=Apache Karaf Documentation@6ed0b159
>> 10:39:17.188 [qtp1277017018-22] DEBUG o.f.scalate.support.ScalaCompiler - scalate class loader: WebAppClassLoader=Apache Karaf Documentation@6ed0b159
>> 10:39:18.378 [qtp1277017018-22] DEBUG o.f.scalate.support.TemplatePackage - Trying to find Scalate Package class: var.folders.b6.xxpddm852fv1hjzpb010n_km0000gn.T.ScalatePackage
>> 10:39:18.379 [qtp1277017018-22] DEBUG o.f.scalate.support.TemplatePackage - Trying to find Scalate Package class: var.folders.b6.xxpddm852fv1hjzpb010n_km0000gn.ScalatePackage
>> 10:39:18.379 [qtp1277017018-22] DEBUG o.f.scalate.support.TemplatePackage - Trying to find Scalate Package class: var.folders.b6.ScalatePackage
>> 10:39:18.380 [qtp1277017018-22] DEBUG o.f.scalate.support.TemplatePackage - Trying to find Scalate Package class: var.folders.ScalatePackage
>> 10:39:18.381 [qtp1277017018-22] DEBUG o.f.scalate.support.TemplatePackage - Trying to find Scalate Package class: var.ScalatePackage
>> 10:39:18.381 [qtp1277017018-22] DEBUG o.f.scalate.support.TemplatePackage - Trying to find Scalate Package class: ScalatePackage
>> 10:39:18.382 [qtp1277017018-22] DEBUG o.f.scalate.support.TemplatePackage - No ScalatePackage class found from templates package: var.folders.b6.xxpddm852fv1hjzpb010n_km0000gn.T on the class loaders: List(WebAppClassLoader=Apache Karaf Documentation@6ed0b159, WebAppClassLoader=Apache Karaf Documentation@6ed0b159)
>> 10:39:18.382 [qtp1277017018-22] DEBUG o.f.s.support.DefaultTemplatePackage - Could not find a class on the classpath based on the current url: var/folders/b6/xxpddm852fv1hjzpb010n_km0000gn/T/scalate8593583895506610212.ssp
>> 10:39:18.397 [qtp1277017018-22] ERROR o.fusesource.scalate.TemplateEngine - Compilation failed:
>> /Users/paul/Documents/svn_apache/karaf-site/trunk/target/scalateWorkDir/src/var/folders/b6/xxpddm852fv1hjzpb010n_km0000gn/T/scalate8593583895506610212.ssp.scala:2: error: identifier expected but 'var' found.
>> package var.folders.b6.xxpddm852fv1hjzpb010n_km0000gn.T
>>         ^
>> one error found
>>
>> 10:39:18.402 [qtp1277017018-22] DEBUG o.fusesource.scalate.TemplateEngine - stack trace: 14f84329206
>> org.fusesource.scalate.CompilerException: Compilation failed:
>> /Users/paul/Documents/svn_apache/karaf-site/trunk/target/scalateWorkDir/src/var/folders/b6/xxpddm852fv1hjzpb010n_km0000gn/T/scalate8593583895506610212.ssp.scala:2: error: identifier expected but 'var' found.
>> package var.folders.b6.xxpddm852fv1hjzpb010n_km0000gn.T
>>         ^
>> one error found
>>
>> 	at org.fusesource.scalate.support.ScalaCompiler.compile(ScalaCompiler.scala:86) ~[scalate-core-1.4.0.jar:1.4.0]
>> 	at org.fusesource.scalate.TemplateEngine.compileAndLoad(TemplateEngine.scala:691) [scalate-core-1.4.0.jar:1.4.0]
>> 	at org.fusesource.scalate.TemplateEngine.compileAndLoad(TemplateEngine.scala:721) [scalate-core-1.4.0.jar:1.4.0]
>> 	at org.fusesource.scalate.TemplateEngine.compile(TemplateEngine.scala:298) [scalate-core-1.4.0.jar:1.4.0]
>> 	at org.fusesource.scalate.TemplateEngine.compileText(TemplateEngine.scala:289) [scalate-core-1.4.0.jar:1.4.0]
>> 	at org.fusesource.scalate.TemplateEngine$$anonfun$filter$1$$anon$2.filter(TemplateEngine.scala:169) ~[scalate-core-1.4.0.jar:1.4.0]
>> 	at org.fusesource.scalate.page.PageFilter$$anonfun$15.apply(PageFilter.scala:185) ~[scalate-page-1.4.0.jar:1.4.0]
>> 	at org.fusesource.scalate.page.PageFilter$$anonfun$15.apply(PageFilter.scala:185) ~[scalate-page-1.4.0.jar:1.4.0]
>> 	at scala.Option.map(Option.scala:129) ~[scala-library-2.8.1.jar:na]
>> 	at org.fusesource.scalate.page.PageFilter$.meta_data(PageFilter.scala:185) ~[scalate-page-1.4.0.jar:1.4.0]
>> 	at org.fusesource.scalate.page.PageFilter$.filter(PageFilter.scala:137) ~[scalate-page-1.4.0.jar:1.4.0]
>> 	at org.fusesource.scalate.support.PipelineTemplate$$anonfun$render$1.apply(PipelineTemplate.scala:31) ~[scalate-core-1.4.0.jar:1.4.0]
>> 	at org.fusesource.scalate.support.PipelineTemplate$$anonfun$render$1.apply(PipelineTemplate.scala:30) ~[scalate-core-1.4.0.jar:1.4.0]
>> 	at scala.collection.LinearSeqOptimized$class.foreach(LinearSeqOptimized.scala:61) ~[scala-library-2.8.1.jar:na]
>> 	at scala.collection.immutable.List.foreach(List.scala:45) ~[scala-library-2.8.1.jar:na]
>> 	at org.fusesource.scalate.support.PipelineTemplate.render(PipelineTemplate.scala:30) ~[scalate-core-1.4.0.jar:1.4.0]
>> 	at org.fusesource.scalate.DefaultRenderContext.capture(DefaultRenderContext.scala:92) ~[scalate-core-1.4.0.jar:1.4.0]
>> 	at org.fusesource.scalate.layout.DefaultLayoutStrategy.layout(DefaultLayoutStrategy.scala:45) ~[scalate-core-1.4.0.jar:1.4.0]
>> 	at org.fusesource.scalate.TemplateEngine$$anonfun$layout$1.apply(TemplateEngine.scala:503) ~[scalate-core-1.4.0.jar:1.4.0]
>> 	at org.fusesource.scalate.TemplateEngine$$anonfun$layout$1.apply(TemplateEngine.scala:503) ~[scalate-core-1.4.0.jar:1.4.0]
>> 	at org.fusesource.scalate.RenderContext$.using(RenderContext.scala:49) ~[scalate-core-1.4.0.jar:1.4.0]
>> 	at org.fusesource.scalate.TemplateEngine.layout(TemplateEngine.scala:503) [scalate-core-1.4.0.jar:1.4.0]
>> 	at org.fusesource.scalate.RenderContext$$anonfun$include$1.apply(RenderContext.scala:267) ~[scalate-core-1.4.0.jar:1.4.0]
>> 	at org.fusesource.scalate.RenderContext$$anonfun$include$1.apply(RenderContext.scala:267) ~[scalate-core-1.4.0.jar:1.4.0]
>> 	at org.fusesource.scalate.RenderContext$class.withUri(RenderContext.scala:423) ~[scalate-core-1.4.0.jar:1.4.0]
>> 	at org.fusesource.scalate.DefaultRenderContext.withUri(DefaultRenderContext.scala:30) ~[scalate-core-1.4.0.jar:1.4.0]
>> 	at org.fusesource.scalate.RenderContext$class.include(RenderContext.scala:267) ~[scalate-core-1.4.0.jar:1.4.0]
>> 	at org.fusesource.scalate.DefaultRenderContext.include(DefaultRenderContext.scala:30) ~[scalate-core-1.4.0.jar:1.4.0]
>> 	at org.fusesource.scalate.RenderContext$class.include(RenderContext.scala:257) ~[scalate-core-1.4.0.jar:1.4.0]
>> 	at org.fusesource.scalate.DefaultRenderContext.include(DefaultRenderContext.scala:30) ~[scalate-core-1.4.0.jar:1.4.0]
>> 	at org.fusesource.scalate.servlet.TemplateEngineFilter.doFilter(TemplateEngineFilter.scala:81) ~[scalate-core-1.4.0.jar:1.4.0]
>> 	at org.eclipse.jetty.servlet.ServletHandler$CachedChain.doFilter(ServletHandler.java:1338) ~[na:na]
>> 	at org.eclipse.jetty.servlet.ServletHandler.doHandle(ServletHandler.java:484) ~[na:na]
>> 	at org.eclipse.jetty.server.handler.ScopedHandler.handle(ScopedHandler.java:119) ~[na:na]
>> 	at org.eclipse.jetty.security.SecurityHandler.handle(SecurityHandler.java:524) ~[na:na]
>> 	at org.eclipse.jetty.server.session.SessionHandler.doHandle(SessionHandler.java:231) ~[na:na]
>> 	at org.eclipse.jetty.server.handler.ContextHandler.doHandle(ContextHandler.java:1065) ~[na:na]
>> 	at org.eclipse.jetty.servlet.ServletHandler.doScope(ServletHandler.java:413) ~[na:na]
>> 	at org.eclipse.jetty.server.session.SessionHandler.doScope(SessionHandler.java:192) ~[na:na]
>> 	at org.eclipse.jetty.server.handler.ContextHandler.doScope(ContextHandler.java:999) ~[na:na]
>> 	at org.eclipse.jetty.server.handler.ScopedHandler.handle(ScopedHandler.java:117) ~[na:na]
>> 	at org.eclipse.jetty.server.handler.ContextHandlerCollection.handle(ContextHandlerCollection.java:250) ~[na:na]
>> 	at org.eclipse.jetty.server.handler.HandlerCollection.handle(HandlerCollection.java:149) ~[na:na]
>> 	at org.eclipse.jetty.server.handler.HandlerWrapper.handle(HandlerWrapper.java:111) ~[na:na]
>> 	at org.eclipse.jetty.server.Server.handle(Server.java:350) ~[na:na]
>> 	at org.eclipse.jetty.server.AbstractHttpConnection.handleRequest(AbstractHttpConnection.java:454) ~[na:na]
>> 	at org.eclipse.jetty.server.AbstractHttpConnection.headerComplete(AbstractHttpConnection.java:890) ~[na:na]
>> 	at org.eclipse.jetty.server.AbstractHttpConnection$RequestHandler.headerComplete(AbstractHttpConnection.java:944) ~[na:na]
>> 	at org.eclipse.jetty.http.HttpParser.parseNext(HttpParser.java:630) ~[na:na]
>> 	at org.eclipse.jetty.http.HttpParser.parseAvailable(HttpParser.java:230) ~[na:na]
>> 	at org.eclipse.jetty.server.AsyncHttpConnection.handle(AsyncHttpConnection.java:77) ~[na:na]
>> 	at org.eclipse.jetty.io.nio.SelectChannelEndPoint.handle(SelectChannelEndPoint.java:620) ~[na:na]
>> 	at org.eclipse.jetty.io.nio.SelectChannelEndPoint$1.run(SelectChannelEndPoint.java:46) ~[na:na]
>> 	at org.eclipse.jetty.util.thread.QueuedThreadPool.runJob(QueuedThreadPool.java:603) ~[na:na]
>> 	at org.eclipse.jetty.util.thread.QueuedThreadPool$3.run(QueuedThreadPool.java:538) ~[na:na]
>> 	at java.lang.Thread.run(Thread.java:724) ~[na:1.7.0_25]
>> 10:39:18.404 [qtp1277017018-22] INFO  o.f.s.servlet.TemplateEngineFilter - failure: org.fusesource.scalate.CompilerException: Compilation failed:
>> :2.9 error: identifier expected but 'var' found.
>> package var.folders.b6.xxpddm852fv1hjzpb010n_km0000gn.T
>>
>>         ^
>>
>> 10:39:18.405 [qtp1277017018-22] DEBUG o.f.s.servlet.TemplateEngineFilter - stack trace: 14f84329207
>> org.fusesource.scalate.CompilerException: Compilation failed:
>> :2.9 error: identifier expected but 'var' found.
>> package var.folders.b6.xxpddm852fv1hjzpb010n_km0000gn.T
>>
>>         ^
>>
>> 	at org.fusesource.scalate.TemplateEngine.compileAndLoad(TemplateEngine.scala:767) ~[scalate-core-1.4.0.jar:1.4.0]
>> 	at org.fusesource.scalate.TemplateEngine.compileAndLoad(TemplateEngine.scala:721) ~[scalate-core-1.4.0.jar:1.4.0]
>> 	at org.fusesource.scalate.TemplateEngine.compile(TemplateEngine.scala:298) ~[scalate-core-1.4.0.jar:1.4.0]
>> 	at org.fusesource.scalate.TemplateEngine.compileText(TemplateEngine.scala:289) ~[scalate-core-1.4.0.jar:1.4.0]
>> 	at org.fusesource.scalate.TemplateEngine$$anonfun$filter$1$$anon$2.filter(TemplateEngine.scala:169) ~[scalate-core-1.4.0.jar:1.4.0]
>> 	at org.fusesource.scalate.page.PageFilter$$anonfun$15.apply(PageFilter.scala:185) ~[scalate-page-1.4.0.jar:1.4.0]
>> 	at org.fusesource.scalate.page.PageFilter$$anonfun$15.apply(PageFilter.scala:185) ~[scalate-page-1.4.0.jar:1.4.0]
>> 	at scala.Option.map(Option.scala:129) ~[scala-library-2.8.1.jar:na]
>> 	at org.fusesource.scalate.page.PageFilter$.meta_data(PageFilter.scala:185) ~[scalate-page-1.4.0.jar:1.4.0]
>> 	at org.fusesource.scalate.page.PageFilter$.filter(PageFilter.scala:137) ~[scalate-page-1.4.0.jar:1.4.0]
>> 	at org.fusesource.scalate.support.PipelineTemplate$$anonfun$render$1.apply(PipelineTemplate.scala:31) ~[scalate-core-1.4.0.jar:1.4.0]
>> 	at org.fusesource.scalate.support.PipelineTemplate$$anonfun$render$1.apply(PipelineTemplate.scala:30) ~[scalate-core-1.4.0.jar:1.4.0]
>> 	at scala.collection.LinearSeqOptimized$class.foreach(LinearSeqOptimized.scala:61) ~[scala-library-2.8.1.jar:na]
>> 	at scala.collection.immutable.List.foreach(List.scala:45) ~[scala-library-2.8.1.jar:na]
>> 	at org.fusesource.scalate.support.PipelineTemplate.render(PipelineTemplate.scala:30) ~[scalate-core-1.4.0.jar:1.4.0]
>> 	at org.fusesource.scalate.DefaultRenderContext.capture(DefaultRenderContext.scala:92) ~[scalate-core-1.4.0.jar:1.4.0]
>> 	at org.fusesource.scalate.layout.DefaultLayoutStrategy.layout(DefaultLayoutStrategy.scala:45) ~[scalate-core-1.4.0.jar:1.4.0]
>> 	at org.fusesource.scalate.TemplateEngine$$anonfun$layout$1.apply(TemplateEngine.scala:503) ~[scalate-core-1.4.0.jar:1.4.0]
>> 	at org.fusesource.scalate.TemplateEngine$$anonfun$layout$1.apply(TemplateEngine.scala:503) ~[scalate-core-1.4.0.jar:1.4.0]
>> 	at org.fusesource.scalate.RenderContext$.using(RenderContext.scala:49) ~[scalate-core-1.4.0.jar:1.4.0]
>> 	at org.fusesource.scalate.TemplateEngine.layout(TemplateEngine.scala:503) ~[scalate-core-1.4.0.jar:1.4.0]
>> 	at org.fusesource.scalate.RenderContext$$anonfun$include$1.apply(RenderContext.scala:267) ~[scalate-core-1.4.0.jar:1.4.0]
>> 	at org.fusesource.scalate.RenderContext$$anonfun$include$1.apply(RenderContext.scala:267) ~[scalate-core-1.4.0.jar:1.4.0]
>> 	at org.fusesource.scalate.RenderContext$class.withUri(RenderContext.scala:423) ~[scalate-core-1.4.0.jar:1.4.0]
>> 	at org.fusesource.scalate.DefaultRenderContext.withUri(DefaultRenderContext.scala:30) ~[scalate-core-1.4.0.jar:1.4.0]
>> 	at org.fusesource.scalate.RenderContext$class.include(RenderContext.scala:267) ~[scalate-core-1.4.0.jar:1.4.0]
>> 	at org.fusesource.scalate.DefaultRenderContext.include(DefaultRenderContext.scala:30) ~[scalate-core-1.4.0.jar:1.4.0]
>> 	at org.fusesource.scalate.RenderContext$class.include(RenderContext.scala:257) ~[scalate-core-1.4.0.jar:1.4.0]
>> 	at org.fusesource.scalate.DefaultRenderContext.include(DefaultRenderContext.scala:30) ~[scalate-core-1.4.0.jar:1.4.0]
>> 	at org.fusesource.scalate.servlet.TemplateEngineFilter.doFilter(TemplateEngineFilter.scala:81) ~[scalate-core-1.4.0.jar:1.4.0]
>> 	at org.eclipse.jetty.servlet.ServletHandler$CachedChain.doFilter(ServletHandler.java:1338) ~[na:na]
>> 	at org.eclipse.jetty.servlet.ServletHandler.doHandle(ServletHandler.java:484) ~[na:na]
>> 	at org.eclipse.jetty.server.handler.ScopedHandler.handle(ScopedHandler.java:119) ~[na:na]
>> 	at org.eclipse.jetty.security.SecurityHandler.handle(SecurityHandler.java:524) ~[na:na]
>> 	at org.eclipse.jetty.server.session.SessionHandler.doHandle(SessionHandler.java:231) ~[na:na]
>> 	at org.eclipse.jetty.server.handler.ContextHandler.doHandle(ContextHandler.java:1065) ~[na:na]
>> 	at org.eclipse.jetty.servlet.ServletHandler.doScope(ServletHandler.java:413) ~[na:na]
>> 	at org.eclipse.jetty.server.session.SessionHandler.doScope(SessionHandler.java:192) ~[na:na]
>> 	at org.eclipse.jetty.server.handler.ContextHandler.doScope(ContextHandler.java:999) ~[na:na]
>> 	at org.eclipse.jetty.server.handler.ScopedHandler.handle(ScopedHandler.java:117) ~[na:na]
>> 	at org.eclipse.jetty.server.handler.ContextHandlerCollection.handle(ContextHandlerCollection.java:250) ~[na:na]
>> 	at org.eclipse.jetty.server.handler.HandlerCollection.handle(HandlerCollection.java:149) ~[na:na]
>> 	at org.eclipse.jetty.server.handler.HandlerWrapper.handle(HandlerWrapper.java:111) ~[na:na]
>> 	at org.eclipse.jetty.server.Server.handle(Server.java:350) ~[na:na]
>> 	at org.eclipse.jetty.server.AbstractHttpConnection.handleRequest(AbstractHttpConnection.java:454) ~[na:na]
>> 	at org.eclipse.jetty.server.AbstractHttpConnection.headerComplete(AbstractHttpConnection.java:890) ~[na:na]
>> 	at org.eclipse.jetty.server.AbstractHttpConnection$RequestHandler.headerComplete(AbstractHttpConnection.java:944) ~[na:na]
>> 	at org.eclipse.jetty.http.HttpParser.parseNext(HttpParser.java:630) ~[na:na]
>> 	at org.eclipse.jetty.http.HttpParser.parseAvailable(HttpParser.java:230) ~[na:na]
>> 	at org.eclipse.jetty.server.AsyncHttpConnection.handle(AsyncHttpConnection.java:77) ~[na:na]
>> 	at org.eclipse.jetty.io.nio.SelectChannelEndPoint.handle(SelectChannelEndPoint.java:620) ~[na:na]
>> 	at org.eclipse.jetty.io.nio.SelectChannelEndPoint$1.run(SelectChannelEndPoint.java:46) ~[na:na]
>> 	at org.eclipse.jetty.util.thread.QueuedThreadPool.runJob(QueuedThreadPool.java:603) ~[na:na]
>> 	at org.eclipse.jetty.util.thread.QueuedThreadPool$3.run(QueuedThreadPool.java:538) ~[na:na]
>> 	at java.lang.Thread.run(Thread.java:724) ~[na:1.7.0_25]
>> 10:39:18.407 [qtp1277017018-22] DEBUG o.f.s.servlet.ServletResourceLoader - realPath for: /WEB-INF/WEB-INF/scalate/errors/500.mustache is: /Users/paul/Documents/svn_apache/karaf-site/trunk/src/main/webapp/WEB-INF/WEB-INF/scalate/errors/500.mustache
>> 10:39:18.407 [qtp1277017018-22] DEBUG o.f.s.servlet.ServletResourceLoader - file from realPath for: /WEB-INF/WEB-INF/scalate/errors/500.mustache is: /Users/paul/Documents/svn_apache/karaf-site/trunk/src/main/webapp/WEB-INF/WEB-INF/scalate/errors/500.mustache
>> 10:39:18.407 [qtp1277017018-22] DEBUG o.f.scalate.util.ResourceLoader - Trying to load uri: /WEB-INF/WEB-INF/scalate/errors/500.mustache
>> 10:39:18.407 [qtp1277017018-22] DEBUG o.f.s.servlet.ServletResourceLoader - realPath for: /WEB-INF/scalate/errors/500.mustache is: /Users/paul/Documents/svn_apache/karaf-site/trunk/src/main/webapp/WEB-INF/scalate/errors/500.mustache
>>
>>
>> Paul Spencer
>>
>>> On Aug 31, 2015, at 9:20 AM, Jean-Baptiste Onofré <jb...@nanthrax.net> wrote:
>>>
>>> You have to do mvn clean install before jetty:run.
>>>
>>> Regards
>>> JB
>>>
>>> On 08/31/2015 02:45 PM, Paul Spencer wrote:
>>>> I am getting "error: identifier expected but 'var' found." from http://localhost:8080 after building the Karaf website from the source.  Below are the commands I used to checkout and build the website. What did I not do?
>>>>
>>>>
>>>> ***
>>>> * Commands used to checkout and build site
>>>> ***
>>>> svn checkout https://svn.apache.org/repos/asf/karaf/site/trunk
>>>> cd trunk
>>>> mvn jetty:run -Plive
>>>>
>>>>
>>>> ***
>>>> * Output of mvn --version
>>>> ***
>>>> Apache Maven 3.1.1 (0728685237757ffbf44136acec0402957f723d9a; 2013-09-17 11:22:22-0400)
>>>> Maven home: /usr/local/apache-maven-3.1.1
>>>> Java version: 1.7.0_25, vendor: Oracle Corporation
>>>> Java home: /Library/Java/JavaVirtualMachines/jdk1.7.0_25.jdk/Contents/Home/jre
>>>> Default locale: en_US, platform encoding: UTF-8
>>>> OS name: "mac os x", version: "10.10.5", arch: "x86_64", family: "mac"
>>>>
>>>>
>>>> Paul Spencer
>>>>
>>>
>>> --
>>> Jean-Baptiste Onofré
>>> jbonofre@apache.org
>>> http://blog.nanthrax.net
>>> Talend - http://www.talend.com
>>
>

-- 
Jean-Baptiste Onofré
jbonofre@apache.org
http://blog.nanthrax.net
Talend - http://www.talend.com

Re: Getting "error: identifier expected but 'var' found." from http://localhost:8080 after building the Karaf website from the source.

Posted by Paul Spencer <pa...@apache.org>.
JB,
1) mnv clean install fails with:
[INFO] --- maven-scalate-plugin:1.4.0:sitegen (generate-htmls) @ site ---
Processing Configuration for child elements
Processing child [project]
Processing child [scalateWorkDir]
Processing child [warSourceDirectory]
Processing child [resourcesSourceDirectory]
Processing child [targetDirectory]
Processing child [testClassPathElements]
[INFO] Generating static website from Scalate Templates and wiki files...
[INFO] template properties: null
[INFO] No bootstrap class scalate.Boot found on classloader: java.net.URLClassLoader@5f73a2d6
[ERROR] Compilation failed:
/Users/paul/Documents/svn_apache/karaf-site/trunk/target/sitegen-workdir/src/var/folders/b6/xxpddm852fv1hjzpb010n_km0000gn/T/scalate4942829915725396418.ssp.scala:2: error: identifier expected but 'var' found.
package var.folders.b6.xxpddm852fv1hjzpb010n_km0000gn.T
        ^
one error found

[INFO] ------------------------------------------------------------------------
[INFO] BUILD FAILURE
[INFO] ------------------------------------------------------------------------


2) I am running Java 1.7 on a Mac.
sparrow:trunk paul$ mvn --version
Apache Maven 3.1.1 (0728685237757ffbf44136acec0402957f723d9a; 2013-09-17 11:22:22-0400)
Maven home: /usr/local/apache-maven-3.1.1
Java version: 1.7.0_25, vendor: Oracle Corporation
Java home: /Library/Java/JavaVirtualMachines/jdk1.7.0_25.jdk/Contents/Home/jre
Default locale: en_US, platform encoding: UTF-8
OS name: "mac os x", version: "10.10.5", arch: "x86_64", family: "mac"
sparrow:trunk paul$ echo $JAVA_HOME
/Library/Java/JavaVirtualMachines/jdk1.7.0_25.jdk/Contents/Home
sparrow:trunk paul$ 


Paul Spencer

> On Aug 31, 2015, at 10:44 AM, Paul Spencer <pa...@apache.org> wrote:
> 
> JB,
> I had already tried "mvn clean", but the result was the same.  Below is more information from the log.
> 
> 10:39:16.942 [qtp1277017018-22] DEBUG o.f.s.servlet.TemplateEngineFilter - Rendering '/index.html' using template '/index.page'
> 10:39:16.962 [qtp1277017018-22] DEBUG o.f.s.servlet.ServletResourceLoader - realPath for: /index.page is: /Users/paul/Documents/svn_apache/karaf-site/trunk/src/main/webapp/index.page
> 10:39:16.962 [qtp1277017018-22] DEBUG o.f.s.servlet.ServletResourceLoader - file from realPath for: /index.page is: /Users/paul/Documents/svn_apache/karaf-site/trunk/src/main/webapp/index.page
> 10:39:16.963 [qtp1277017018-22] DEBUG o.f.scalate.util.ResourceLoader - found resource: FileResource(/Users/paul/Documents/svn_apache/karaf-site/trunk/src/main/webapp/index.page,/Users/paul/Documents/svn_apache/karaf-site/trunk/src/main/webapp/index.page)
> 10:39:16.966 [qtp1277017018-22] DEBUG o.fusesource.scalate.TemplateEngine - Loaded uri: /index.page template: PipelineTemplate(pipeline=List(<function1>))
> 10:39:16.967 [qtp1277017018-22] DEBUG o.f.scalate.DefaultRenderContext - rendering template PipelineTemplate(pipeline=List(<function1>))
> 10:39:17.156 [qtp1277017018-22] DEBUG o.f.scalate.support.TemplatePackage - Trying to find Scalate Package class: var.folders.b6.xxpddm852fv1hjzpb010n_km0000gn.T.ScalatePackage
> 10:39:17.156 [qtp1277017018-22] DEBUG o.f.scalate.support.TemplatePackage - Trying to find Scalate Package class: var.folders.b6.xxpddm852fv1hjzpb010n_km0000gn.ScalatePackage
> 10:39:17.157 [qtp1277017018-22] DEBUG o.f.scalate.support.TemplatePackage - Trying to find Scalate Package class: var.folders.b6.ScalatePackage
> 10:39:17.158 [qtp1277017018-22] DEBUG o.f.scalate.support.TemplatePackage - Trying to find Scalate Package class: var.folders.ScalatePackage
> 10:39:17.158 [qtp1277017018-22] DEBUG o.f.scalate.support.TemplatePackage - Trying to find Scalate Package class: var.ScalatePackage
> 10:39:17.159 [qtp1277017018-22] DEBUG o.f.scalate.support.TemplatePackage - Trying to find Scalate Package class: ScalatePackage
> 10:39:17.159 [qtp1277017018-22] DEBUG o.f.scalate.support.TemplatePackage - No ScalatePackage class found from templates package: var.folders.b6.xxpddm852fv1hjzpb010n_km0000gn.T on the class loaders: List(WebAppClassLoader=Apache Karaf Documentation@6ed0b159, WebAppClassLoader=Apache Karaf Documentation@6ed0b159)
> 10:39:17.163 [qtp1277017018-22] DEBUG o.f.s.support.DefaultTemplatePackage - Could not find a class on the classpath based on the current url: var/folders/b6/xxpddm852fv1hjzpb010n_km0000gn/T/scalate8593583895506610212.ssp
> 10:39:17.186 [qtp1277017018-22] DEBUG o.f.scalate.support.ScalaCompiler - using classpath: /Users/paul/Documents/svn_apache/karaf-site/trunk/target/classes:/Users/paul/.m2/repository/org/fusesource/scalate/scalate-wikitext/1.4.0/scalate-wikitext-1.4.0.jar:/Users/paul/.m2/repository/org/fusesource/scalate/scalate-core/1.4.0/scalate-core-1.4.0.jar:/Users/paul/.m2/repository/org/fusesource/scalate/scalate-util/1.4.0/scalate-util-1.4.0.jar:/Users/paul/.m2/repository/org/fusesource/wikitext/textile-core/1.2/textile-core-1.2.jar:/Users/paul/.m2/repository/org/fusesource/wikitext/wikitext-core/1.3/wikitext-core-1.3.jar:/Users/paul/.m2/repository/org/fusesource/wikitext/confluence-core/1.3/confluence-core-1.3.jar:/Users/paul/.m2/repository/org/fusesource/scalate/scalate-page/1.4.0/scalate-page-1.4.0.jar:/Users/paul/.m2/repository/org/yaml/snakeyaml/1.7/snakeyaml-1.7.jar:/Users/paul/.m2/repository/org/fusesource/scalamd/scalamd/1.5/scalamd-1.5.jar:/Users/paul/.m2/repository/ch/qos/logback/logback-classic/1.0.9/logback-classic-1.0.9.jar:/Users/paul/.m2/repository/ch/qos/logback/logback-core/1.0.9/logback-core-1.0.9.jar:/Users/paul/.m2/repository/org/slf4j/slf4j-api/1.7.2/slf4j-api-1.7.2.jar:/Users/paul/.m2/repository/org/scala-lang/scala-library/2.8.1/scala-library-2.8.1.jar:/Users/paul/.m2/repository/org/scala-lang/scala-compiler/2.8.1/scala-compiler-2.8.1.jar:/usr/local/apache-maven-3.1.1/boot/plexus-classworlds-2.5.1.jar:/Users/paul/Documents/svn_apache/karaf-site/trunk/target/classes:/Users/paul/.m2/repository/org/fusesource/scalate/scalate-wikitext/1.4.0/scalate-wikitext-1.4.0.jar:/Users/paul/.m2/repository/org/fusesource/scalate/scalate-core/1.4.0/scalate-core-1.4.0.jar:/Users/paul/.m2/repository/org/fusesource/scalate/scalate-util/1.4.0/scalate-util-1.4.0.jar:/Users/paul/.m2/repository/org/fusesource/wikitext/textile-core/1.2/textile-core-1.2.jar:/Users/paul/.m2/repository/org/fusesource/wikitext/wikitext-core/1.3/wikitext-core-1.3.jar:/Users/paul/.m2/repository/org/fusesource/wikitext/confluence-core/1.3/confluence-core-1.3.jar:/Users/paul/.m2/repository/org/fusesource/scalate/scalate-page/1.4.0/scalate-page-1.4.0.jar:/Users/paul/.m2/repository/org/yaml/snakeyaml/1.7/snakeyaml-1.7.jar:/Users/paul/.m2/repository/org/fusesource/scalamd/scalamd/1.5/scalamd-1.5.jar:/Users/paul/.m2/repository/ch/qos/logback/logback-classic/1.0.9/logback-classic-1.0.9.jar:/Users/paul/.m2/repository/ch/qos/logback/logback-core/1.0.9/logback-core-1.0.9.jar:/Users/paul/.m2/repository/org/slf4j/slf4j-api/1.7.2/slf4j-api-1.7.2.jar:/Users/paul/.m2/repository/org/scala-lang/scala-library/2.8.1/scala-library-2.8.1.jar:/Users/paul/.m2/repository/org/scala-lang/scala-compiler/2.8.1/scala-compiler-2.8.1.jar:/Users/paul/.m2/repository/org/mortbay/jetty/jetty-maven-plugin/8.1.4.v20120524/jetty-maven-plugin-8.1.4.v20120524.jar:/Users/paul/.m2/repository/org/eclipse/jetty/jetty-util/8.1.4.v20120524/jetty-util-8.1.4.v20120524.jar:/Users/paul/.m2/repository/org/eclipse/jetty/jetty-webapp/8.1.4.v20120524/jetty-webapp-8.1.4.v20120524.jar:/Users/paul/.m2/repository/org/eclipse/jetty/jetty-xml/8.1.4.v20120524/jetty-xml-8.1.4.v20120524.jar:/Users/paul/.m2/repository/org/eclipse/jetty/jetty-servlet/8.1.4.v20120524/jetty-servlet-8.1.4.v20120524.jar:/Users/paul/.m2/repository/org/eclipse/jetty/jetty-security/8.1.4.v20120524/jetty-security-8.1.4.v20120524.jar:/Users/paul/.m2/repository/org/eclipse/jetty/jetty-server/8.1.4.v20120524/jetty-server-8.1.4.v20120524.jar:/Users/paul/.m2/repository/org/eclipse/jetty/jetty-continuation/8.1.4.v20120524/jetty-continuation-8.1.4.v20120524.jar:/Users/paul/.m2/repository/org/sonatype/sisu/sisu-inject-bean/2.1.1/sisu-inject-bean-2.1.1.jar:/Users/paul/.m2/repository/org/sonatype/sisu/sisu-guice/2.9.4/sisu-guice-2.9.4-no_aop.jar:/Users/paul/.m2/repository/org/codehaus/plexus/plexus-utils/2.0.6/plexus-utils-2.0.6.jar:/Users/paul/.m2/repository/org/sonatype/aether/aether-util/1.11/aether-util-1.11.jar:/Users/paul/.m2/repository/org/codehaus/plexus/plexus-interpolation/1.14/plexus-interpolation-1.14.jar:/Users/paul/.m2/repository/org/codehaus/plexus/plexus-component-annotations/1.5.5/plexus-component-annotations-1.5.5.jar:/Users/paul/.m2/repository/org/sonatype/plexus/plexus-sec-dispatcher/1.3/plexus-sec-dispatcher-1.3.jar:/Users/paul/.m2/repository/org/sonatype/plexus/plexus-cipher/1.4/plexus-cipher-1.4.jar:/Users/paul/.m2/repository/org/apache/maven/plugin-tools/maven-plugin-tools-api/2.9/maven-plugin-tools-api-2.9.jar:/Users/paul/.m2/repository/org/apache/maven/reporting/maven-reporting-api/2.0.6/maven-reporting-api-2.0.6.jar:/Users/paul/.m2/repository/org/apache/maven/doxia/doxia-sink-api/1.0-alpha-7/doxia-sink-api-1.0-alpha-7.jar:/Users/paul/.m2/repository/junit/junit/3.8.1/junit-3.8.1.jar:/Users/paul/.m2/repository/net/sf/jtidy/jtidy/r938/jtidy-r938.jar:/Users/paul/.m2/repository/org/eclipse/jetty/jetty-plus/8.1.4.v20120524/jetty-plus-8.1.4.v20120524.jar:/Users/paul/.m2/repository/org/eclipse/jetty/orbit/javax.transaction/1.1.1.v201105210645/javax.transaction-1.1.1.v201105210645.jar:/Users/paul/.m2/repository/org/eclipse/jetty/jetty-jndi/8.1.4.v20120524/jetty-jndi-8.1.4.v20120524.jar:/Users/paul/.m2/repository/org/eclipse/jetty/orbit/javax.mail.glassfish/1.4.1.v201005082020/javax.mail.glassfish-1.4.1.v201005082020.jar:/Users/paul/.m2/repository/org/eclipse/jetty/orbit/javax.activation/1.1.0.v201105071233/javax.activation-1.1.0.v201105071233.jar:/Users/paul/.m2/repository/org/eclipse/jetty/jetty-jmx/8.1.4.v20120524/jetty-jmx-8.1.4.v20120524.jar:/Users/paul/.m2/repository/org/eclipse/jetty/jetty-annotations/8.1.4.v20120524/jetty-annotations-8.1.4.v20120524.jar:/Users/paul/.m2/repository/org/eclipse/jetty/orbit/javax.annotation/1.1.0.v201108011116/javax.annotation-1.1.0.v201108011116.jar:/Users/paul/.m2/repository/org/eclipse/jetty/orbit/org.objectweb.asm/3.1.0.v200803061910/org.objectweb.asm-3.1.0.v200803061910.jar:/Users/paul/.m2/repository/org/eclipse/jetty/jetty-websocket/8.1.4.v20120524/jetty-websocket-8.1.4.v20120524.jar:/Users/paul/.m2/repository/org/eclipse/jetty/jetty-io/8.1.4.v20120524/jetty-io-8.1.4.v20120524.jar:/Users/paul/.m2/repository/org/eclipse/jetty/jetty-http/8.1.4.v20120524/jetty-http-8.1.4.v20120524.jar:/Users/paul/.m2/repository/org/eclipse/jetty/jetty-jsp/8.1.4.v20120524/jetty-jsp-8.1.4.v20120524.jar:/Users/paul/.m2/repository/org/eclipse/jetty/orbit/javax.servlet.jsp/2.2.0.v201112011158/javax.servlet.jsp-2.2.0.v201112011158.jar:/Users/paul/.m2/repository/org/eclipse/jetty/orbit/javax.servlet/3.0.0.v201112011016/javax.servlet-3.0.0.v201112011016.jar:/Users/paul/.m2/repository/org/eclipse/jetty/orbit/org.apache.jasper.glassfish/2.2.2.v201112011158/org.apache.jasper.glassfish-2.2.2.v201112011158.jar:/Users/paul/.m2/repository/org/eclipse/jetty/orbit/javax.servlet.jsp.jstl/1.2.0.v201105211821/javax.servlet.jsp.jstl-1.2.0.v201105211821.jar:/Users/paul/.m2/repository/org/eclipse/jetty/orbit/org.apache.taglibs.standard.glassfish/1.2.0.v201112081803/org.apache.taglibs.standard.glassfish-1.2.0.v201112081803.jar:/Users/paul/.m2/repository/org/eclipse/jetty/orbit/javax.el/2.2.0.v201108011116/javax.el-2.2.0.v201108011116.jar:/Users/paul/.m2/repository/org/eclipse/jetty/orbit/com.sun.el/2.2.0.v201108011116/com.sun.el-2.2.0.v201108011116.jar:/Users/paul/.m2/repository/org/eclipse/jetty/orbit/org.eclipse.jdt.core/3.7.1/org.eclipse.jdt.core-3.7.1.jar
> 10:39:17.187 [qtp1277017018-22] DEBUG o.f.scalate.support.ScalaCompiler - system class loader: sun.misc.Launcher$AppClassLoader@74220711
> 10:39:17.187 [qtp1277017018-22] DEBUG o.f.scalate.support.ScalaCompiler - context class loader: WebAppClassLoader=Apache Karaf Documentation@6ed0b159
> 10:39:17.188 [qtp1277017018-22] DEBUG o.f.scalate.support.ScalaCompiler - scalate class loader: WebAppClassLoader=Apache Karaf Documentation@6ed0b159
> 10:39:18.378 [qtp1277017018-22] DEBUG o.f.scalate.support.TemplatePackage - Trying to find Scalate Package class: var.folders.b6.xxpddm852fv1hjzpb010n_km0000gn.T.ScalatePackage
> 10:39:18.379 [qtp1277017018-22] DEBUG o.f.scalate.support.TemplatePackage - Trying to find Scalate Package class: var.folders.b6.xxpddm852fv1hjzpb010n_km0000gn.ScalatePackage
> 10:39:18.379 [qtp1277017018-22] DEBUG o.f.scalate.support.TemplatePackage - Trying to find Scalate Package class: var.folders.b6.ScalatePackage
> 10:39:18.380 [qtp1277017018-22] DEBUG o.f.scalate.support.TemplatePackage - Trying to find Scalate Package class: var.folders.ScalatePackage
> 10:39:18.381 [qtp1277017018-22] DEBUG o.f.scalate.support.TemplatePackage - Trying to find Scalate Package class: var.ScalatePackage
> 10:39:18.381 [qtp1277017018-22] DEBUG o.f.scalate.support.TemplatePackage - Trying to find Scalate Package class: ScalatePackage
> 10:39:18.382 [qtp1277017018-22] DEBUG o.f.scalate.support.TemplatePackage - No ScalatePackage class found from templates package: var.folders.b6.xxpddm852fv1hjzpb010n_km0000gn.T on the class loaders: List(WebAppClassLoader=Apache Karaf Documentation@6ed0b159, WebAppClassLoader=Apache Karaf Documentation@6ed0b159)
> 10:39:18.382 [qtp1277017018-22] DEBUG o.f.s.support.DefaultTemplatePackage - Could not find a class on the classpath based on the current url: var/folders/b6/xxpddm852fv1hjzpb010n_km0000gn/T/scalate8593583895506610212.ssp
> 10:39:18.397 [qtp1277017018-22] ERROR o.fusesource.scalate.TemplateEngine - Compilation failed:
> /Users/paul/Documents/svn_apache/karaf-site/trunk/target/scalateWorkDir/src/var/folders/b6/xxpddm852fv1hjzpb010n_km0000gn/T/scalate8593583895506610212.ssp.scala:2: error: identifier expected but 'var' found.
> package var.folders.b6.xxpddm852fv1hjzpb010n_km0000gn.T
>        ^
> one error found
> 
> 10:39:18.402 [qtp1277017018-22] DEBUG o.fusesource.scalate.TemplateEngine - stack trace: 14f84329206
> org.fusesource.scalate.CompilerException: Compilation failed:
> /Users/paul/Documents/svn_apache/karaf-site/trunk/target/scalateWorkDir/src/var/folders/b6/xxpddm852fv1hjzpb010n_km0000gn/T/scalate8593583895506610212.ssp.scala:2: error: identifier expected but 'var' found.
> package var.folders.b6.xxpddm852fv1hjzpb010n_km0000gn.T
>        ^
> one error found
> 
> 	at org.fusesource.scalate.support.ScalaCompiler.compile(ScalaCompiler.scala:86) ~[scalate-core-1.4.0.jar:1.4.0]
> 	at org.fusesource.scalate.TemplateEngine.compileAndLoad(TemplateEngine.scala:691) [scalate-core-1.4.0.jar:1.4.0]
> 	at org.fusesource.scalate.TemplateEngine.compileAndLoad(TemplateEngine.scala:721) [scalate-core-1.4.0.jar:1.4.0]
> 	at org.fusesource.scalate.TemplateEngine.compile(TemplateEngine.scala:298) [scalate-core-1.4.0.jar:1.4.0]
> 	at org.fusesource.scalate.TemplateEngine.compileText(TemplateEngine.scala:289) [scalate-core-1.4.0.jar:1.4.0]
> 	at org.fusesource.scalate.TemplateEngine$$anonfun$filter$1$$anon$2.filter(TemplateEngine.scala:169) ~[scalate-core-1.4.0.jar:1.4.0]
> 	at org.fusesource.scalate.page.PageFilter$$anonfun$15.apply(PageFilter.scala:185) ~[scalate-page-1.4.0.jar:1.4.0]
> 	at org.fusesource.scalate.page.PageFilter$$anonfun$15.apply(PageFilter.scala:185) ~[scalate-page-1.4.0.jar:1.4.0]
> 	at scala.Option.map(Option.scala:129) ~[scala-library-2.8.1.jar:na]
> 	at org.fusesource.scalate.page.PageFilter$.meta_data(PageFilter.scala:185) ~[scalate-page-1.4.0.jar:1.4.0]
> 	at org.fusesource.scalate.page.PageFilter$.filter(PageFilter.scala:137) ~[scalate-page-1.4.0.jar:1.4.0]
> 	at org.fusesource.scalate.support.PipelineTemplate$$anonfun$render$1.apply(PipelineTemplate.scala:31) ~[scalate-core-1.4.0.jar:1.4.0]
> 	at org.fusesource.scalate.support.PipelineTemplate$$anonfun$render$1.apply(PipelineTemplate.scala:30) ~[scalate-core-1.4.0.jar:1.4.0]
> 	at scala.collection.LinearSeqOptimized$class.foreach(LinearSeqOptimized.scala:61) ~[scala-library-2.8.1.jar:na]
> 	at scala.collection.immutable.List.foreach(List.scala:45) ~[scala-library-2.8.1.jar:na]
> 	at org.fusesource.scalate.support.PipelineTemplate.render(PipelineTemplate.scala:30) ~[scalate-core-1.4.0.jar:1.4.0]
> 	at org.fusesource.scalate.DefaultRenderContext.capture(DefaultRenderContext.scala:92) ~[scalate-core-1.4.0.jar:1.4.0]
> 	at org.fusesource.scalate.layout.DefaultLayoutStrategy.layout(DefaultLayoutStrategy.scala:45) ~[scalate-core-1.4.0.jar:1.4.0]
> 	at org.fusesource.scalate.TemplateEngine$$anonfun$layout$1.apply(TemplateEngine.scala:503) ~[scalate-core-1.4.0.jar:1.4.0]
> 	at org.fusesource.scalate.TemplateEngine$$anonfun$layout$1.apply(TemplateEngine.scala:503) ~[scalate-core-1.4.0.jar:1.4.0]
> 	at org.fusesource.scalate.RenderContext$.using(RenderContext.scala:49) ~[scalate-core-1.4.0.jar:1.4.0]
> 	at org.fusesource.scalate.TemplateEngine.layout(TemplateEngine.scala:503) [scalate-core-1.4.0.jar:1.4.0]
> 	at org.fusesource.scalate.RenderContext$$anonfun$include$1.apply(RenderContext.scala:267) ~[scalate-core-1.4.0.jar:1.4.0]
> 	at org.fusesource.scalate.RenderContext$$anonfun$include$1.apply(RenderContext.scala:267) ~[scalate-core-1.4.0.jar:1.4.0]
> 	at org.fusesource.scalate.RenderContext$class.withUri(RenderContext.scala:423) ~[scalate-core-1.4.0.jar:1.4.0]
> 	at org.fusesource.scalate.DefaultRenderContext.withUri(DefaultRenderContext.scala:30) ~[scalate-core-1.4.0.jar:1.4.0]
> 	at org.fusesource.scalate.RenderContext$class.include(RenderContext.scala:267) ~[scalate-core-1.4.0.jar:1.4.0]
> 	at org.fusesource.scalate.DefaultRenderContext.include(DefaultRenderContext.scala:30) ~[scalate-core-1.4.0.jar:1.4.0]
> 	at org.fusesource.scalate.RenderContext$class.include(RenderContext.scala:257) ~[scalate-core-1.4.0.jar:1.4.0]
> 	at org.fusesource.scalate.DefaultRenderContext.include(DefaultRenderContext.scala:30) ~[scalate-core-1.4.0.jar:1.4.0]
> 	at org.fusesource.scalate.servlet.TemplateEngineFilter.doFilter(TemplateEngineFilter.scala:81) ~[scalate-core-1.4.0.jar:1.4.0]
> 	at org.eclipse.jetty.servlet.ServletHandler$CachedChain.doFilter(ServletHandler.java:1338) ~[na:na]
> 	at org.eclipse.jetty.servlet.ServletHandler.doHandle(ServletHandler.java:484) ~[na:na]
> 	at org.eclipse.jetty.server.handler.ScopedHandler.handle(ScopedHandler.java:119) ~[na:na]
> 	at org.eclipse.jetty.security.SecurityHandler.handle(SecurityHandler.java:524) ~[na:na]
> 	at org.eclipse.jetty.server.session.SessionHandler.doHandle(SessionHandler.java:231) ~[na:na]
> 	at org.eclipse.jetty.server.handler.ContextHandler.doHandle(ContextHandler.java:1065) ~[na:na]
> 	at org.eclipse.jetty.servlet.ServletHandler.doScope(ServletHandler.java:413) ~[na:na]
> 	at org.eclipse.jetty.server.session.SessionHandler.doScope(SessionHandler.java:192) ~[na:na]
> 	at org.eclipse.jetty.server.handler.ContextHandler.doScope(ContextHandler.java:999) ~[na:na]
> 	at org.eclipse.jetty.server.handler.ScopedHandler.handle(ScopedHandler.java:117) ~[na:na]
> 	at org.eclipse.jetty.server.handler.ContextHandlerCollection.handle(ContextHandlerCollection.java:250) ~[na:na]
> 	at org.eclipse.jetty.server.handler.HandlerCollection.handle(HandlerCollection.java:149) ~[na:na]
> 	at org.eclipse.jetty.server.handler.HandlerWrapper.handle(HandlerWrapper.java:111) ~[na:na]
> 	at org.eclipse.jetty.server.Server.handle(Server.java:350) ~[na:na]
> 	at org.eclipse.jetty.server.AbstractHttpConnection.handleRequest(AbstractHttpConnection.java:454) ~[na:na]
> 	at org.eclipse.jetty.server.AbstractHttpConnection.headerComplete(AbstractHttpConnection.java:890) ~[na:na]
> 	at org.eclipse.jetty.server.AbstractHttpConnection$RequestHandler.headerComplete(AbstractHttpConnection.java:944) ~[na:na]
> 	at org.eclipse.jetty.http.HttpParser.parseNext(HttpParser.java:630) ~[na:na]
> 	at org.eclipse.jetty.http.HttpParser.parseAvailable(HttpParser.java:230) ~[na:na]
> 	at org.eclipse.jetty.server.AsyncHttpConnection.handle(AsyncHttpConnection.java:77) ~[na:na]
> 	at org.eclipse.jetty.io.nio.SelectChannelEndPoint.handle(SelectChannelEndPoint.java:620) ~[na:na]
> 	at org.eclipse.jetty.io.nio.SelectChannelEndPoint$1.run(SelectChannelEndPoint.java:46) ~[na:na]
> 	at org.eclipse.jetty.util.thread.QueuedThreadPool.runJob(QueuedThreadPool.java:603) ~[na:na]
> 	at org.eclipse.jetty.util.thread.QueuedThreadPool$3.run(QueuedThreadPool.java:538) ~[na:na]
> 	at java.lang.Thread.run(Thread.java:724) ~[na:1.7.0_25]
> 10:39:18.404 [qtp1277017018-22] INFO  o.f.s.servlet.TemplateEngineFilter - failure: org.fusesource.scalate.CompilerException: Compilation failed:
> :2.9 error: identifier expected but 'var' found.
> package var.folders.b6.xxpddm852fv1hjzpb010n_km0000gn.T
> 
>        ^
> 
> 10:39:18.405 [qtp1277017018-22] DEBUG o.f.s.servlet.TemplateEngineFilter - stack trace: 14f84329207
> org.fusesource.scalate.CompilerException: Compilation failed:
> :2.9 error: identifier expected but 'var' found.
> package var.folders.b6.xxpddm852fv1hjzpb010n_km0000gn.T
> 
>        ^
> 
> 	at org.fusesource.scalate.TemplateEngine.compileAndLoad(TemplateEngine.scala:767) ~[scalate-core-1.4.0.jar:1.4.0]
> 	at org.fusesource.scalate.TemplateEngine.compileAndLoad(TemplateEngine.scala:721) ~[scalate-core-1.4.0.jar:1.4.0]
> 	at org.fusesource.scalate.TemplateEngine.compile(TemplateEngine.scala:298) ~[scalate-core-1.4.0.jar:1.4.0]
> 	at org.fusesource.scalate.TemplateEngine.compileText(TemplateEngine.scala:289) ~[scalate-core-1.4.0.jar:1.4.0]
> 	at org.fusesource.scalate.TemplateEngine$$anonfun$filter$1$$anon$2.filter(TemplateEngine.scala:169) ~[scalate-core-1.4.0.jar:1.4.0]
> 	at org.fusesource.scalate.page.PageFilter$$anonfun$15.apply(PageFilter.scala:185) ~[scalate-page-1.4.0.jar:1.4.0]
> 	at org.fusesource.scalate.page.PageFilter$$anonfun$15.apply(PageFilter.scala:185) ~[scalate-page-1.4.0.jar:1.4.0]
> 	at scala.Option.map(Option.scala:129) ~[scala-library-2.8.1.jar:na]
> 	at org.fusesource.scalate.page.PageFilter$.meta_data(PageFilter.scala:185) ~[scalate-page-1.4.0.jar:1.4.0]
> 	at org.fusesource.scalate.page.PageFilter$.filter(PageFilter.scala:137) ~[scalate-page-1.4.0.jar:1.4.0]
> 	at org.fusesource.scalate.support.PipelineTemplate$$anonfun$render$1.apply(PipelineTemplate.scala:31) ~[scalate-core-1.4.0.jar:1.4.0]
> 	at org.fusesource.scalate.support.PipelineTemplate$$anonfun$render$1.apply(PipelineTemplate.scala:30) ~[scalate-core-1.4.0.jar:1.4.0]
> 	at scala.collection.LinearSeqOptimized$class.foreach(LinearSeqOptimized.scala:61) ~[scala-library-2.8.1.jar:na]
> 	at scala.collection.immutable.List.foreach(List.scala:45) ~[scala-library-2.8.1.jar:na]
> 	at org.fusesource.scalate.support.PipelineTemplate.render(PipelineTemplate.scala:30) ~[scalate-core-1.4.0.jar:1.4.0]
> 	at org.fusesource.scalate.DefaultRenderContext.capture(DefaultRenderContext.scala:92) ~[scalate-core-1.4.0.jar:1.4.0]
> 	at org.fusesource.scalate.layout.DefaultLayoutStrategy.layout(DefaultLayoutStrategy.scala:45) ~[scalate-core-1.4.0.jar:1.4.0]
> 	at org.fusesource.scalate.TemplateEngine$$anonfun$layout$1.apply(TemplateEngine.scala:503) ~[scalate-core-1.4.0.jar:1.4.0]
> 	at org.fusesource.scalate.TemplateEngine$$anonfun$layout$1.apply(TemplateEngine.scala:503) ~[scalate-core-1.4.0.jar:1.4.0]
> 	at org.fusesource.scalate.RenderContext$.using(RenderContext.scala:49) ~[scalate-core-1.4.0.jar:1.4.0]
> 	at org.fusesource.scalate.TemplateEngine.layout(TemplateEngine.scala:503) ~[scalate-core-1.4.0.jar:1.4.0]
> 	at org.fusesource.scalate.RenderContext$$anonfun$include$1.apply(RenderContext.scala:267) ~[scalate-core-1.4.0.jar:1.4.0]
> 	at org.fusesource.scalate.RenderContext$$anonfun$include$1.apply(RenderContext.scala:267) ~[scalate-core-1.4.0.jar:1.4.0]
> 	at org.fusesource.scalate.RenderContext$class.withUri(RenderContext.scala:423) ~[scalate-core-1.4.0.jar:1.4.0]
> 	at org.fusesource.scalate.DefaultRenderContext.withUri(DefaultRenderContext.scala:30) ~[scalate-core-1.4.0.jar:1.4.0]
> 	at org.fusesource.scalate.RenderContext$class.include(RenderContext.scala:267) ~[scalate-core-1.4.0.jar:1.4.0]
> 	at org.fusesource.scalate.DefaultRenderContext.include(DefaultRenderContext.scala:30) ~[scalate-core-1.4.0.jar:1.4.0]
> 	at org.fusesource.scalate.RenderContext$class.include(RenderContext.scala:257) ~[scalate-core-1.4.0.jar:1.4.0]
> 	at org.fusesource.scalate.DefaultRenderContext.include(DefaultRenderContext.scala:30) ~[scalate-core-1.4.0.jar:1.4.0]
> 	at org.fusesource.scalate.servlet.TemplateEngineFilter.doFilter(TemplateEngineFilter.scala:81) ~[scalate-core-1.4.0.jar:1.4.0]
> 	at org.eclipse.jetty.servlet.ServletHandler$CachedChain.doFilter(ServletHandler.java:1338) ~[na:na]
> 	at org.eclipse.jetty.servlet.ServletHandler.doHandle(ServletHandler.java:484) ~[na:na]
> 	at org.eclipse.jetty.server.handler.ScopedHandler.handle(ScopedHandler.java:119) ~[na:na]
> 	at org.eclipse.jetty.security.SecurityHandler.handle(SecurityHandler.java:524) ~[na:na]
> 	at org.eclipse.jetty.server.session.SessionHandler.doHandle(SessionHandler.java:231) ~[na:na]
> 	at org.eclipse.jetty.server.handler.ContextHandler.doHandle(ContextHandler.java:1065) ~[na:na]
> 	at org.eclipse.jetty.servlet.ServletHandler.doScope(ServletHandler.java:413) ~[na:na]
> 	at org.eclipse.jetty.server.session.SessionHandler.doScope(SessionHandler.java:192) ~[na:na]
> 	at org.eclipse.jetty.server.handler.ContextHandler.doScope(ContextHandler.java:999) ~[na:na]
> 	at org.eclipse.jetty.server.handler.ScopedHandler.handle(ScopedHandler.java:117) ~[na:na]
> 	at org.eclipse.jetty.server.handler.ContextHandlerCollection.handle(ContextHandlerCollection.java:250) ~[na:na]
> 	at org.eclipse.jetty.server.handler.HandlerCollection.handle(HandlerCollection.java:149) ~[na:na]
> 	at org.eclipse.jetty.server.handler.HandlerWrapper.handle(HandlerWrapper.java:111) ~[na:na]
> 	at org.eclipse.jetty.server.Server.handle(Server.java:350) ~[na:na]
> 	at org.eclipse.jetty.server.AbstractHttpConnection.handleRequest(AbstractHttpConnection.java:454) ~[na:na]
> 	at org.eclipse.jetty.server.AbstractHttpConnection.headerComplete(AbstractHttpConnection.java:890) ~[na:na]
> 	at org.eclipse.jetty.server.AbstractHttpConnection$RequestHandler.headerComplete(AbstractHttpConnection.java:944) ~[na:na]
> 	at org.eclipse.jetty.http.HttpParser.parseNext(HttpParser.java:630) ~[na:na]
> 	at org.eclipse.jetty.http.HttpParser.parseAvailable(HttpParser.java:230) ~[na:na]
> 	at org.eclipse.jetty.server.AsyncHttpConnection.handle(AsyncHttpConnection.java:77) ~[na:na]
> 	at org.eclipse.jetty.io.nio.SelectChannelEndPoint.handle(SelectChannelEndPoint.java:620) ~[na:na]
> 	at org.eclipse.jetty.io.nio.SelectChannelEndPoint$1.run(SelectChannelEndPoint.java:46) ~[na:na]
> 	at org.eclipse.jetty.util.thread.QueuedThreadPool.runJob(QueuedThreadPool.java:603) ~[na:na]
> 	at org.eclipse.jetty.util.thread.QueuedThreadPool$3.run(QueuedThreadPool.java:538) ~[na:na]
> 	at java.lang.Thread.run(Thread.java:724) ~[na:1.7.0_25]
> 10:39:18.407 [qtp1277017018-22] DEBUG o.f.s.servlet.ServletResourceLoader - realPath for: /WEB-INF/WEB-INF/scalate/errors/500.mustache is: /Users/paul/Documents/svn_apache/karaf-site/trunk/src/main/webapp/WEB-INF/WEB-INF/scalate/errors/500.mustache
> 10:39:18.407 [qtp1277017018-22] DEBUG o.f.s.servlet.ServletResourceLoader - file from realPath for: /WEB-INF/WEB-INF/scalate/errors/500.mustache is: /Users/paul/Documents/svn_apache/karaf-site/trunk/src/main/webapp/WEB-INF/WEB-INF/scalate/errors/500.mustache
> 10:39:18.407 [qtp1277017018-22] DEBUG o.f.scalate.util.ResourceLoader - Trying to load uri: /WEB-INF/WEB-INF/scalate/errors/500.mustache
> 10:39:18.407 [qtp1277017018-22] DEBUG o.f.s.servlet.ServletResourceLoader - realPath for: /WEB-INF/scalate/errors/500.mustache is: /Users/paul/Documents/svn_apache/karaf-site/trunk/src/main/webapp/WEB-INF/scalate/errors/500.mustache
> 
> 
> Paul Spencer
> 
>> On Aug 31, 2015, at 9:20 AM, Jean-Baptiste Onofré <jb...@nanthrax.net> wrote:
>> 
>> You have to do mvn clean install before jetty:run.
>> 
>> Regards
>> JB
>> 
>> On 08/31/2015 02:45 PM, Paul Spencer wrote:
>>> I am getting "error: identifier expected but 'var' found." from http://localhost:8080 after building the Karaf website from the source.  Below are the commands I used to checkout and build the website. What did I not do?
>>> 
>>> 
>>> ***
>>> * Commands used to checkout and build site
>>> ***
>>> svn checkout https://svn.apache.org/repos/asf/karaf/site/trunk
>>> cd trunk
>>> mvn jetty:run -Plive
>>> 
>>> 
>>> ***
>>> * Output of mvn --version
>>> ***
>>> Apache Maven 3.1.1 (0728685237757ffbf44136acec0402957f723d9a; 2013-09-17 11:22:22-0400)
>>> Maven home: /usr/local/apache-maven-3.1.1
>>> Java version: 1.7.0_25, vendor: Oracle Corporation
>>> Java home: /Library/Java/JavaVirtualMachines/jdk1.7.0_25.jdk/Contents/Home/jre
>>> Default locale: en_US, platform encoding: UTF-8
>>> OS name: "mac os x", version: "10.10.5", arch: "x86_64", family: "mac"
>>> 
>>> 
>>> Paul Spencer
>>> 
>> 
>> -- 
>> Jean-Baptiste Onofré
>> jbonofre@apache.org
>> http://blog.nanthrax.net
>> Talend - http://www.talend.com
> 


Re: Getting "error: identifier expected but 'var' found." from http://localhost:8080 after building the Karaf website from the source.

Posted by Paul Spencer <pa...@apache.org>.
JB,
I had already tried "mvn clean", but the result was the same.  Below is more information from the log.

10:39:16.942 [qtp1277017018-22] DEBUG o.f.s.servlet.TemplateEngineFilter - Rendering '/index.html' using template '/index.page'
10:39:16.962 [qtp1277017018-22] DEBUG o.f.s.servlet.ServletResourceLoader - realPath for: /index.page is: /Users/paul/Documents/svn_apache/karaf-site/trunk/src/main/webapp/index.page
10:39:16.962 [qtp1277017018-22] DEBUG o.f.s.servlet.ServletResourceLoader - file from realPath for: /index.page is: /Users/paul/Documents/svn_apache/karaf-site/trunk/src/main/webapp/index.page
10:39:16.963 [qtp1277017018-22] DEBUG o.f.scalate.util.ResourceLoader - found resource: FileResource(/Users/paul/Documents/svn_apache/karaf-site/trunk/src/main/webapp/index.page,/Users/paul/Documents/svn_apache/karaf-site/trunk/src/main/webapp/index.page)
10:39:16.966 [qtp1277017018-22] DEBUG o.fusesource.scalate.TemplateEngine - Loaded uri: /index.page template: PipelineTemplate(pipeline=List(<function1>))
10:39:16.967 [qtp1277017018-22] DEBUG o.f.scalate.DefaultRenderContext - rendering template PipelineTemplate(pipeline=List(<function1>))
10:39:17.156 [qtp1277017018-22] DEBUG o.f.scalate.support.TemplatePackage - Trying to find Scalate Package class: var.folders.b6.xxpddm852fv1hjzpb010n_km0000gn.T.ScalatePackage
10:39:17.156 [qtp1277017018-22] DEBUG o.f.scalate.support.TemplatePackage - Trying to find Scalate Package class: var.folders.b6.xxpddm852fv1hjzpb010n_km0000gn.ScalatePackage
10:39:17.157 [qtp1277017018-22] DEBUG o.f.scalate.support.TemplatePackage - Trying to find Scalate Package class: var.folders.b6.ScalatePackage
10:39:17.158 [qtp1277017018-22] DEBUG o.f.scalate.support.TemplatePackage - Trying to find Scalate Package class: var.folders.ScalatePackage
10:39:17.158 [qtp1277017018-22] DEBUG o.f.scalate.support.TemplatePackage - Trying to find Scalate Package class: var.ScalatePackage
10:39:17.159 [qtp1277017018-22] DEBUG o.f.scalate.support.TemplatePackage - Trying to find Scalate Package class: ScalatePackage
10:39:17.159 [qtp1277017018-22] DEBUG o.f.scalate.support.TemplatePackage - No ScalatePackage class found from templates package: var.folders.b6.xxpddm852fv1hjzpb010n_km0000gn.T on the class loaders: List(WebAppClassLoader=Apache Karaf Documentation@6ed0b159, WebAppClassLoader=Apache Karaf Documentation@6ed0b159)
10:39:17.163 [qtp1277017018-22] DEBUG o.f.s.support.DefaultTemplatePackage - Could not find a class on the classpath based on the current url: var/folders/b6/xxpddm852fv1hjzpb010n_km0000gn/T/scalate8593583895506610212.ssp
10:39:17.186 [qtp1277017018-22] DEBUG o.f.scalate.support.ScalaCompiler - using classpath: /Users/paul/Documents/svn_apache/karaf-site/trunk/target/classes:/Users/paul/.m2/repository/org/fusesource/scalate/scalate-wikitext/1.4.0/scalate-wikitext-1.4.0.jar:/Users/paul/.m2/repository/org/fusesource/scalate/scalate-core/1.4.0/scalate-core-1.4.0.jar:/Users/paul/.m2/repository/org/fusesource/scalate/scalate-util/1.4.0/scalate-util-1.4.0.jar:/Users/paul/.m2/repository/org/fusesource/wikitext/textile-core/1.2/textile-core-1.2.jar:/Users/paul/.m2/repository/org/fusesource/wikitext/wikitext-core/1.3/wikitext-core-1.3.jar:/Users/paul/.m2/repository/org/fusesource/wikitext/confluence-core/1.3/confluence-core-1.3.jar:/Users/paul/.m2/repository/org/fusesource/scalate/scalate-page/1.4.0/scalate-page-1.4.0.jar:/Users/paul/.m2/repository/org/yaml/snakeyaml/1.7/snakeyaml-1.7.jar:/Users/paul/.m2/repository/org/fusesource/scalamd/scalamd/1.5/scalamd-1.5.jar:/Users/paul/.m2/repository/ch/qos/logback/logback-classic/1.0.9/logback-classic-1.0.9.jar:/Users/paul/.m2/repository/ch/qos/logback/logback-core/1.0.9/logback-core-1.0.9.jar:/Users/paul/.m2/repository/org/slf4j/slf4j-api/1.7.2/slf4j-api-1.7.2.jar:/Users/paul/.m2/repository/org/scala-lang/scala-library/2.8.1/scala-library-2.8.1.jar:/Users/paul/.m2/repository/org/scala-lang/scala-compiler/2.8.1/scala-compiler-2.8.1.jar:/usr/local/apache-maven-3.1.1/boot/plexus-classworlds-2.5.1.jar:/Users/paul/Documents/svn_apache/karaf-site/trunk/target/classes:/Users/paul/.m2/repository/org/fusesource/scalate/scalate-wikitext/1.4.0/scalate-wikitext-1.4.0.jar:/Users/paul/.m2/repository/org/fusesource/scalate/scalate-core/1.4.0/scalate-core-1.4.0.jar:/Users/paul/.m2/repository/org/fusesource/scalate/scalate-util/1.4.0/scalate-util-1.4.0.jar:/Users/paul/.m2/repository/org/fusesource/wikitext/textile-core/1.2/textile-core-1.2.jar:/Users/paul/.m2/repository/org/fusesource/wikitext/wikitext-core/1.3/wikitext-core-1.3.jar:/Users/paul/.m2/repository/org/fusesource/wikitext/confluence-core/1.3/confluence-core-1.3.jar:/Users/paul/.m2/repository/org/fusesource/scalate/scalate-page/1.4.0/scalate-page-1.4.0.jar:/Users/paul/.m2/repository/org/yaml/snakeyaml/1.7/snakeyaml-1.7.jar:/Users/paul/.m2/repository/org/fusesource/scalamd/scalamd/1.5/scalamd-1.5.jar:/Users/paul/.m2/repository/ch/qos/logback/logback-classic/1.0.9/logback-classic-1.0.9.jar:/Users/paul/.m2/repository/ch/qos/logback/logback-core/1.0.9/logback-core-1.0.9.jar:/Users/paul/.m2/repository/org/slf4j/slf4j-api/1.7.2/slf4j-api-1.7.2.jar:/Users/paul/.m2/repository/org/scala-lang/scala-library/2.8.1/scala-library-2.8.1.jar:/Users/paul/.m2/repository/org/scala-lang/scala-compiler/2.8.1/scala-compiler-2.8.1.jar:/Users/paul/.m2/repository/org/mortbay/jetty/jetty-maven-plugin/8.1.4.v20120524/jetty-maven-plugin-8.1.4.v20120524.jar:/Users/paul/.m2/repository/org/eclipse/jetty/jetty-util/8.1.4.v20120524/jetty-util-8.1.4.v20120524.jar:/Users/paul/.m2/repository/org/eclipse/jetty/jetty-webapp/8.1.4.v20120524/jetty-webapp-8.1.4.v20120524.jar:/Users/paul/.m2/repository/org/eclipse/jetty/jetty-xml/8.1.4.v20120524/jetty-xml-8.1.4.v20120524.jar:/Users/paul/.m2/repository/org/eclipse/jetty/jetty-servlet/8.1.4.v20120524/jetty-servlet-8.1.4.v20120524.jar:/Users/paul/.m2/repository/org/eclipse/jetty/jetty-security/8.1.4.v20120524/jetty-security-8.1.4.v20120524.jar:/Users/paul/.m2/repository/org/eclipse/jetty/jetty-server/8.1.4.v20120524/jetty-server-8.1.4.v20120524.jar:/Users/paul/.m2/repository/org/eclipse/jetty/jetty-continuation/8.1.4.v20120524/jetty-continuation-8.1.4.v20120524.jar:/Users/paul/.m2/repository/org/sonatype/sisu/sisu-inject-bean/2.1.1/sisu-inject-bean-2.1.1.jar:/Users/paul/.m2/repository/org/sonatype/sisu/sisu-guice/2.9.4/sisu-guice-2.9.4-no_aop.jar:/Users/paul/.m2/repository/org/codehaus/plexus/plexus-utils/2.0.6/plexus-utils-2.0.6.jar:/Users/paul/.m2/repository/org/sonatype/aether/aether-util/1.11/aether-util-1.11.jar:/Users/paul/.m2/repository/org/codehaus/plexus/plexus-interpolation/1.14/plexus-interpolation-1.14.jar:/Users/paul/.m2/repository/org/codehaus/plexus/plexus-component-annotations/1.5.5/plexus-component-annotations-1.5.5.jar:/Users/paul/.m2/repository/org/sonatype/plexus/plexus-sec-dispatcher/1.3/plexus-sec-dispatcher-1.3.jar:/Users/paul/.m2/repository/org/sonatype/plexus/plexus-cipher/1.4/plexus-cipher-1.4.jar:/Users/paul/.m2/repository/org/apache/maven/plugin-tools/maven-plugin-tools-api/2.9/maven-plugin-tools-api-2.9.jar:/Users/paul/.m2/repository/org/apache/maven/reporting/maven-reporting-api/2.0.6/maven-reporting-api-2.0.6.jar:/Users/paul/.m2/repository/org/apache/maven/doxia/doxia-sink-api/1.0-alpha-7/doxia-sink-api-1.0-alpha-7.jar:/Users/paul/.m2/repository/junit/junit/3.8.1/junit-3.8.1.jar:/Users/paul/.m2/repository/net/sf/jtidy/jtidy/r938/jtidy-r938.jar:/Users/paul/.m2/repository/org/eclipse/jetty/jetty-plus/8.1.4.v20120524/jetty-plus-8.1.4.v20120524.jar:/Users/paul/.m2/repository/org/eclipse/jetty/orbit/javax.transaction/1.1.1.v201105210645/javax.transaction-1.1.1.v201105210645.jar:/Users/paul/.m2/repository/org/eclipse/jetty/jetty-jndi/8.1.4.v20120524/jetty-jndi-8.1.4.v20120524.jar:/Users/paul/.m2/repository/org/eclipse/jetty/orbit/javax.mail.glassfish/1.4.1.v201005082020/javax.mail.glassfish-1.4.1.v201005082020.jar:/Users/paul/.m2/repository/org/eclipse/jetty/orbit/javax.activation/1.1.0.v201105071233/javax.activation-1.1.0.v201105071233.jar:/Users/paul/.m2/repository/org/eclipse/jetty/jetty-jmx/8.1.4.v20120524/jetty-jmx-8.1.4.v20120524.jar:/Users/paul/.m2/repository/org/eclipse/jetty/jetty-annotations/8.1.4.v20120524/jetty-annotations-8.1.4.v20120524.jar:/Users/paul/.m2/repository/org/eclipse/jetty/orbit/javax.annotation/1.1.0.v201108011116/javax.annotation-1.1.0.v201108011116.jar:/Users/paul/.m2/repository/org/eclipse/jetty/orbit/org.objectweb.asm/3.1.0.v200803061910/org.objectweb.asm-3.1.0.v200803061910.jar:/Users/paul/.m2/repository/org/eclipse/jetty/jetty-websocket/8.1.4.v20120524/jetty-websocket-8.1.4.v20120524.jar:/Users/paul/.m2/repository/org/eclipse/jetty/jetty-io/8.1.4.v20120524/jetty-io-8.1.4.v20120524.jar:/Users/paul/.m2/repository/org/eclipse/jetty/jetty-http/8.1.4.v20120524/jetty-http-8.1.4.v20120524.jar:/Users/paul/.m2/repository/org/eclipse/jetty/jetty-jsp/8.1.4.v20120524/jetty-jsp-8.1.4.v20120524.jar:/Users/paul/.m2/repository/org/eclipse/jetty/orbit/javax.servlet.jsp/2.2.0.v201112011158/javax.servlet.jsp-2.2.0.v201112011158.jar:/Users/paul/.m2/repository/org/eclipse/jetty/orbit/javax.servlet/3.0.0.v201112011016/javax.servlet-3.0.0.v201112011016.jar:/Users/paul/.m2/repository/org/eclipse/jetty/orbit/org.apache.jasper.glassfish/2.2.2.v201112011158/org.apache.jasper.glassfish-2.2.2.v201112011158.jar:/Users/paul/.m2/repository/org/eclipse/jetty/orbit/javax.servlet.jsp.jstl/1.2.0.v201105211821/javax.servlet.jsp.jstl-1.2.0.v201105211821.jar:/Users/paul/.m2/repository/org/eclipse/jetty/orbit/org.apache.taglibs.standard.glassfish/1.2.0.v201112081803/org.apache.taglibs.standard.glassfish-1.2.0.v201112081803.jar:/Users/paul/.m2/repository/org/eclipse/jetty/orbit/javax.el/2.2.0.v201108011116/javax.el-2.2.0.v201108011116.jar:/Users/paul/.m2/repository/org/eclipse/jetty/orbit/com.sun.el/2.2.0.v201108011116/com.sun.el-2.2.0.v201108011116.jar:/Users/paul/.m2/repository/org/eclipse/jetty/orbit/org.eclipse.jdt.core/3.7.1/org.eclipse.jdt.core-3.7.1.jar
10:39:17.187 [qtp1277017018-22] DEBUG o.f.scalate.support.ScalaCompiler - system class loader: sun.misc.Launcher$AppClassLoader@74220711
10:39:17.187 [qtp1277017018-22] DEBUG o.f.scalate.support.ScalaCompiler - context class loader: WebAppClassLoader=Apache Karaf Documentation@6ed0b159
10:39:17.188 [qtp1277017018-22] DEBUG o.f.scalate.support.ScalaCompiler - scalate class loader: WebAppClassLoader=Apache Karaf Documentation@6ed0b159
10:39:18.378 [qtp1277017018-22] DEBUG o.f.scalate.support.TemplatePackage - Trying to find Scalate Package class: var.folders.b6.xxpddm852fv1hjzpb010n_km0000gn.T.ScalatePackage
10:39:18.379 [qtp1277017018-22] DEBUG o.f.scalate.support.TemplatePackage - Trying to find Scalate Package class: var.folders.b6.xxpddm852fv1hjzpb010n_km0000gn.ScalatePackage
10:39:18.379 [qtp1277017018-22] DEBUG o.f.scalate.support.TemplatePackage - Trying to find Scalate Package class: var.folders.b6.ScalatePackage
10:39:18.380 [qtp1277017018-22] DEBUG o.f.scalate.support.TemplatePackage - Trying to find Scalate Package class: var.folders.ScalatePackage
10:39:18.381 [qtp1277017018-22] DEBUG o.f.scalate.support.TemplatePackage - Trying to find Scalate Package class: var.ScalatePackage
10:39:18.381 [qtp1277017018-22] DEBUG o.f.scalate.support.TemplatePackage - Trying to find Scalate Package class: ScalatePackage
10:39:18.382 [qtp1277017018-22] DEBUG o.f.scalate.support.TemplatePackage - No ScalatePackage class found from templates package: var.folders.b6.xxpddm852fv1hjzpb010n_km0000gn.T on the class loaders: List(WebAppClassLoader=Apache Karaf Documentation@6ed0b159, WebAppClassLoader=Apache Karaf Documentation@6ed0b159)
10:39:18.382 [qtp1277017018-22] DEBUG o.f.s.support.DefaultTemplatePackage - Could not find a class on the classpath based on the current url: var/folders/b6/xxpddm852fv1hjzpb010n_km0000gn/T/scalate8593583895506610212.ssp
10:39:18.397 [qtp1277017018-22] ERROR o.fusesource.scalate.TemplateEngine - Compilation failed:
/Users/paul/Documents/svn_apache/karaf-site/trunk/target/scalateWorkDir/src/var/folders/b6/xxpddm852fv1hjzpb010n_km0000gn/T/scalate8593583895506610212.ssp.scala:2: error: identifier expected but 'var' found.
package var.folders.b6.xxpddm852fv1hjzpb010n_km0000gn.T
        ^
one error found

10:39:18.402 [qtp1277017018-22] DEBUG o.fusesource.scalate.TemplateEngine - stack trace: 14f84329206
org.fusesource.scalate.CompilerException: Compilation failed:
/Users/paul/Documents/svn_apache/karaf-site/trunk/target/scalateWorkDir/src/var/folders/b6/xxpddm852fv1hjzpb010n_km0000gn/T/scalate8593583895506610212.ssp.scala:2: error: identifier expected but 'var' found.
package var.folders.b6.xxpddm852fv1hjzpb010n_km0000gn.T
        ^
one error found

	at org.fusesource.scalate.support.ScalaCompiler.compile(ScalaCompiler.scala:86) ~[scalate-core-1.4.0.jar:1.4.0]
	at org.fusesource.scalate.TemplateEngine.compileAndLoad(TemplateEngine.scala:691) [scalate-core-1.4.0.jar:1.4.0]
	at org.fusesource.scalate.TemplateEngine.compileAndLoad(TemplateEngine.scala:721) [scalate-core-1.4.0.jar:1.4.0]
	at org.fusesource.scalate.TemplateEngine.compile(TemplateEngine.scala:298) [scalate-core-1.4.0.jar:1.4.0]
	at org.fusesource.scalate.TemplateEngine.compileText(TemplateEngine.scala:289) [scalate-core-1.4.0.jar:1.4.0]
	at org.fusesource.scalate.TemplateEngine$$anonfun$filter$1$$anon$2.filter(TemplateEngine.scala:169) ~[scalate-core-1.4.0.jar:1.4.0]
	at org.fusesource.scalate.page.PageFilter$$anonfun$15.apply(PageFilter.scala:185) ~[scalate-page-1.4.0.jar:1.4.0]
	at org.fusesource.scalate.page.PageFilter$$anonfun$15.apply(PageFilter.scala:185) ~[scalate-page-1.4.0.jar:1.4.0]
	at scala.Option.map(Option.scala:129) ~[scala-library-2.8.1.jar:na]
	at org.fusesource.scalate.page.PageFilter$.meta_data(PageFilter.scala:185) ~[scalate-page-1.4.0.jar:1.4.0]
	at org.fusesource.scalate.page.PageFilter$.filter(PageFilter.scala:137) ~[scalate-page-1.4.0.jar:1.4.0]
	at org.fusesource.scalate.support.PipelineTemplate$$anonfun$render$1.apply(PipelineTemplate.scala:31) ~[scalate-core-1.4.0.jar:1.4.0]
	at org.fusesource.scalate.support.PipelineTemplate$$anonfun$render$1.apply(PipelineTemplate.scala:30) ~[scalate-core-1.4.0.jar:1.4.0]
	at scala.collection.LinearSeqOptimized$class.foreach(LinearSeqOptimized.scala:61) ~[scala-library-2.8.1.jar:na]
	at scala.collection.immutable.List.foreach(List.scala:45) ~[scala-library-2.8.1.jar:na]
	at org.fusesource.scalate.support.PipelineTemplate.render(PipelineTemplate.scala:30) ~[scalate-core-1.4.0.jar:1.4.0]
	at org.fusesource.scalate.DefaultRenderContext.capture(DefaultRenderContext.scala:92) ~[scalate-core-1.4.0.jar:1.4.0]
	at org.fusesource.scalate.layout.DefaultLayoutStrategy.layout(DefaultLayoutStrategy.scala:45) ~[scalate-core-1.4.0.jar:1.4.0]
	at org.fusesource.scalate.TemplateEngine$$anonfun$layout$1.apply(TemplateEngine.scala:503) ~[scalate-core-1.4.0.jar:1.4.0]
	at org.fusesource.scalate.TemplateEngine$$anonfun$layout$1.apply(TemplateEngine.scala:503) ~[scalate-core-1.4.0.jar:1.4.0]
	at org.fusesource.scalate.RenderContext$.using(RenderContext.scala:49) ~[scalate-core-1.4.0.jar:1.4.0]
	at org.fusesource.scalate.TemplateEngine.layout(TemplateEngine.scala:503) [scalate-core-1.4.0.jar:1.4.0]
	at org.fusesource.scalate.RenderContext$$anonfun$include$1.apply(RenderContext.scala:267) ~[scalate-core-1.4.0.jar:1.4.0]
	at org.fusesource.scalate.RenderContext$$anonfun$include$1.apply(RenderContext.scala:267) ~[scalate-core-1.4.0.jar:1.4.0]
	at org.fusesource.scalate.RenderContext$class.withUri(RenderContext.scala:423) ~[scalate-core-1.4.0.jar:1.4.0]
	at org.fusesource.scalate.DefaultRenderContext.withUri(DefaultRenderContext.scala:30) ~[scalate-core-1.4.0.jar:1.4.0]
	at org.fusesource.scalate.RenderContext$class.include(RenderContext.scala:267) ~[scalate-core-1.4.0.jar:1.4.0]
	at org.fusesource.scalate.DefaultRenderContext.include(DefaultRenderContext.scala:30) ~[scalate-core-1.4.0.jar:1.4.0]
	at org.fusesource.scalate.RenderContext$class.include(RenderContext.scala:257) ~[scalate-core-1.4.0.jar:1.4.0]
	at org.fusesource.scalate.DefaultRenderContext.include(DefaultRenderContext.scala:30) ~[scalate-core-1.4.0.jar:1.4.0]
	at org.fusesource.scalate.servlet.TemplateEngineFilter.doFilter(TemplateEngineFilter.scala:81) ~[scalate-core-1.4.0.jar:1.4.0]
	at org.eclipse.jetty.servlet.ServletHandler$CachedChain.doFilter(ServletHandler.java:1338) ~[na:na]
	at org.eclipse.jetty.servlet.ServletHandler.doHandle(ServletHandler.java:484) ~[na:na]
	at org.eclipse.jetty.server.handler.ScopedHandler.handle(ScopedHandler.java:119) ~[na:na]
	at org.eclipse.jetty.security.SecurityHandler.handle(SecurityHandler.java:524) ~[na:na]
	at org.eclipse.jetty.server.session.SessionHandler.doHandle(SessionHandler.java:231) ~[na:na]
	at org.eclipse.jetty.server.handler.ContextHandler.doHandle(ContextHandler.java:1065) ~[na:na]
	at org.eclipse.jetty.servlet.ServletHandler.doScope(ServletHandler.java:413) ~[na:na]
	at org.eclipse.jetty.server.session.SessionHandler.doScope(SessionHandler.java:192) ~[na:na]
	at org.eclipse.jetty.server.handler.ContextHandler.doScope(ContextHandler.java:999) ~[na:na]
	at org.eclipse.jetty.server.handler.ScopedHandler.handle(ScopedHandler.java:117) ~[na:na]
	at org.eclipse.jetty.server.handler.ContextHandlerCollection.handle(ContextHandlerCollection.java:250) ~[na:na]
	at org.eclipse.jetty.server.handler.HandlerCollection.handle(HandlerCollection.java:149) ~[na:na]
	at org.eclipse.jetty.server.handler.HandlerWrapper.handle(HandlerWrapper.java:111) ~[na:na]
	at org.eclipse.jetty.server.Server.handle(Server.java:350) ~[na:na]
	at org.eclipse.jetty.server.AbstractHttpConnection.handleRequest(AbstractHttpConnection.java:454) ~[na:na]
	at org.eclipse.jetty.server.AbstractHttpConnection.headerComplete(AbstractHttpConnection.java:890) ~[na:na]
	at org.eclipse.jetty.server.AbstractHttpConnection$RequestHandler.headerComplete(AbstractHttpConnection.java:944) ~[na:na]
	at org.eclipse.jetty.http.HttpParser.parseNext(HttpParser.java:630) ~[na:na]
	at org.eclipse.jetty.http.HttpParser.parseAvailable(HttpParser.java:230) ~[na:na]
	at org.eclipse.jetty.server.AsyncHttpConnection.handle(AsyncHttpConnection.java:77) ~[na:na]
	at org.eclipse.jetty.io.nio.SelectChannelEndPoint.handle(SelectChannelEndPoint.java:620) ~[na:na]
	at org.eclipse.jetty.io.nio.SelectChannelEndPoint$1.run(SelectChannelEndPoint.java:46) ~[na:na]
	at org.eclipse.jetty.util.thread.QueuedThreadPool.runJob(QueuedThreadPool.java:603) ~[na:na]
	at org.eclipse.jetty.util.thread.QueuedThreadPool$3.run(QueuedThreadPool.java:538) ~[na:na]
	at java.lang.Thread.run(Thread.java:724) ~[na:1.7.0_25]
10:39:18.404 [qtp1277017018-22] INFO  o.f.s.servlet.TemplateEngineFilter - failure: org.fusesource.scalate.CompilerException: Compilation failed:
:2.9 error: identifier expected but 'var' found.
package var.folders.b6.xxpddm852fv1hjzpb010n_km0000gn.T

        ^

10:39:18.405 [qtp1277017018-22] DEBUG o.f.s.servlet.TemplateEngineFilter - stack trace: 14f84329207
org.fusesource.scalate.CompilerException: Compilation failed:
:2.9 error: identifier expected but 'var' found.
package var.folders.b6.xxpddm852fv1hjzpb010n_km0000gn.T

        ^

	at org.fusesource.scalate.TemplateEngine.compileAndLoad(TemplateEngine.scala:767) ~[scalate-core-1.4.0.jar:1.4.0]
	at org.fusesource.scalate.TemplateEngine.compileAndLoad(TemplateEngine.scala:721) ~[scalate-core-1.4.0.jar:1.4.0]
	at org.fusesource.scalate.TemplateEngine.compile(TemplateEngine.scala:298) ~[scalate-core-1.4.0.jar:1.4.0]
	at org.fusesource.scalate.TemplateEngine.compileText(TemplateEngine.scala:289) ~[scalate-core-1.4.0.jar:1.4.0]
	at org.fusesource.scalate.TemplateEngine$$anonfun$filter$1$$anon$2.filter(TemplateEngine.scala:169) ~[scalate-core-1.4.0.jar:1.4.0]
	at org.fusesource.scalate.page.PageFilter$$anonfun$15.apply(PageFilter.scala:185) ~[scalate-page-1.4.0.jar:1.4.0]
	at org.fusesource.scalate.page.PageFilter$$anonfun$15.apply(PageFilter.scala:185) ~[scalate-page-1.4.0.jar:1.4.0]
	at scala.Option.map(Option.scala:129) ~[scala-library-2.8.1.jar:na]
	at org.fusesource.scalate.page.PageFilter$.meta_data(PageFilter.scala:185) ~[scalate-page-1.4.0.jar:1.4.0]
	at org.fusesource.scalate.page.PageFilter$.filter(PageFilter.scala:137) ~[scalate-page-1.4.0.jar:1.4.0]
	at org.fusesource.scalate.support.PipelineTemplate$$anonfun$render$1.apply(PipelineTemplate.scala:31) ~[scalate-core-1.4.0.jar:1.4.0]
	at org.fusesource.scalate.support.PipelineTemplate$$anonfun$render$1.apply(PipelineTemplate.scala:30) ~[scalate-core-1.4.0.jar:1.4.0]
	at scala.collection.LinearSeqOptimized$class.foreach(LinearSeqOptimized.scala:61) ~[scala-library-2.8.1.jar:na]
	at scala.collection.immutable.List.foreach(List.scala:45) ~[scala-library-2.8.1.jar:na]
	at org.fusesource.scalate.support.PipelineTemplate.render(PipelineTemplate.scala:30) ~[scalate-core-1.4.0.jar:1.4.0]
	at org.fusesource.scalate.DefaultRenderContext.capture(DefaultRenderContext.scala:92) ~[scalate-core-1.4.0.jar:1.4.0]
	at org.fusesource.scalate.layout.DefaultLayoutStrategy.layout(DefaultLayoutStrategy.scala:45) ~[scalate-core-1.4.0.jar:1.4.0]
	at org.fusesource.scalate.TemplateEngine$$anonfun$layout$1.apply(TemplateEngine.scala:503) ~[scalate-core-1.4.0.jar:1.4.0]
	at org.fusesource.scalate.TemplateEngine$$anonfun$layout$1.apply(TemplateEngine.scala:503) ~[scalate-core-1.4.0.jar:1.4.0]
	at org.fusesource.scalate.RenderContext$.using(RenderContext.scala:49) ~[scalate-core-1.4.0.jar:1.4.0]
	at org.fusesource.scalate.TemplateEngine.layout(TemplateEngine.scala:503) ~[scalate-core-1.4.0.jar:1.4.0]
	at org.fusesource.scalate.RenderContext$$anonfun$include$1.apply(RenderContext.scala:267) ~[scalate-core-1.4.0.jar:1.4.0]
	at org.fusesource.scalate.RenderContext$$anonfun$include$1.apply(RenderContext.scala:267) ~[scalate-core-1.4.0.jar:1.4.0]
	at org.fusesource.scalate.RenderContext$class.withUri(RenderContext.scala:423) ~[scalate-core-1.4.0.jar:1.4.0]
	at org.fusesource.scalate.DefaultRenderContext.withUri(DefaultRenderContext.scala:30) ~[scalate-core-1.4.0.jar:1.4.0]
	at org.fusesource.scalate.RenderContext$class.include(RenderContext.scala:267) ~[scalate-core-1.4.0.jar:1.4.0]
	at org.fusesource.scalate.DefaultRenderContext.include(DefaultRenderContext.scala:30) ~[scalate-core-1.4.0.jar:1.4.0]
	at org.fusesource.scalate.RenderContext$class.include(RenderContext.scala:257) ~[scalate-core-1.4.0.jar:1.4.0]
	at org.fusesource.scalate.DefaultRenderContext.include(DefaultRenderContext.scala:30) ~[scalate-core-1.4.0.jar:1.4.0]
	at org.fusesource.scalate.servlet.TemplateEngineFilter.doFilter(TemplateEngineFilter.scala:81) ~[scalate-core-1.4.0.jar:1.4.0]
	at org.eclipse.jetty.servlet.ServletHandler$CachedChain.doFilter(ServletHandler.java:1338) ~[na:na]
	at org.eclipse.jetty.servlet.ServletHandler.doHandle(ServletHandler.java:484) ~[na:na]
	at org.eclipse.jetty.server.handler.ScopedHandler.handle(ScopedHandler.java:119) ~[na:na]
	at org.eclipse.jetty.security.SecurityHandler.handle(SecurityHandler.java:524) ~[na:na]
	at org.eclipse.jetty.server.session.SessionHandler.doHandle(SessionHandler.java:231) ~[na:na]
	at org.eclipse.jetty.server.handler.ContextHandler.doHandle(ContextHandler.java:1065) ~[na:na]
	at org.eclipse.jetty.servlet.ServletHandler.doScope(ServletHandler.java:413) ~[na:na]
	at org.eclipse.jetty.server.session.SessionHandler.doScope(SessionHandler.java:192) ~[na:na]
	at org.eclipse.jetty.server.handler.ContextHandler.doScope(ContextHandler.java:999) ~[na:na]
	at org.eclipse.jetty.server.handler.ScopedHandler.handle(ScopedHandler.java:117) ~[na:na]
	at org.eclipse.jetty.server.handler.ContextHandlerCollection.handle(ContextHandlerCollection.java:250) ~[na:na]
	at org.eclipse.jetty.server.handler.HandlerCollection.handle(HandlerCollection.java:149) ~[na:na]
	at org.eclipse.jetty.server.handler.HandlerWrapper.handle(HandlerWrapper.java:111) ~[na:na]
	at org.eclipse.jetty.server.Server.handle(Server.java:350) ~[na:na]
	at org.eclipse.jetty.server.AbstractHttpConnection.handleRequest(AbstractHttpConnection.java:454) ~[na:na]
	at org.eclipse.jetty.server.AbstractHttpConnection.headerComplete(AbstractHttpConnection.java:890) ~[na:na]
	at org.eclipse.jetty.server.AbstractHttpConnection$RequestHandler.headerComplete(AbstractHttpConnection.java:944) ~[na:na]
	at org.eclipse.jetty.http.HttpParser.parseNext(HttpParser.java:630) ~[na:na]
	at org.eclipse.jetty.http.HttpParser.parseAvailable(HttpParser.java:230) ~[na:na]
	at org.eclipse.jetty.server.AsyncHttpConnection.handle(AsyncHttpConnection.java:77) ~[na:na]
	at org.eclipse.jetty.io.nio.SelectChannelEndPoint.handle(SelectChannelEndPoint.java:620) ~[na:na]
	at org.eclipse.jetty.io.nio.SelectChannelEndPoint$1.run(SelectChannelEndPoint.java:46) ~[na:na]
	at org.eclipse.jetty.util.thread.QueuedThreadPool.runJob(QueuedThreadPool.java:603) ~[na:na]
	at org.eclipse.jetty.util.thread.QueuedThreadPool$3.run(QueuedThreadPool.java:538) ~[na:na]
	at java.lang.Thread.run(Thread.java:724) ~[na:1.7.0_25]
10:39:18.407 [qtp1277017018-22] DEBUG o.f.s.servlet.ServletResourceLoader - realPath for: /WEB-INF/WEB-INF/scalate/errors/500.mustache is: /Users/paul/Documents/svn_apache/karaf-site/trunk/src/main/webapp/WEB-INF/WEB-INF/scalate/errors/500.mustache
10:39:18.407 [qtp1277017018-22] DEBUG o.f.s.servlet.ServletResourceLoader - file from realPath for: /WEB-INF/WEB-INF/scalate/errors/500.mustache is: /Users/paul/Documents/svn_apache/karaf-site/trunk/src/main/webapp/WEB-INF/WEB-INF/scalate/errors/500.mustache
10:39:18.407 [qtp1277017018-22] DEBUG o.f.scalate.util.ResourceLoader - Trying to load uri: /WEB-INF/WEB-INF/scalate/errors/500.mustache
10:39:18.407 [qtp1277017018-22] DEBUG o.f.s.servlet.ServletResourceLoader - realPath for: /WEB-INF/scalate/errors/500.mustache is: /Users/paul/Documents/svn_apache/karaf-site/trunk/src/main/webapp/WEB-INF/scalate/errors/500.mustache


Paul Spencer

> On Aug 31, 2015, at 9:20 AM, Jean-Baptiste Onofré <jb...@nanthrax.net> wrote:
> 
> You have to do mvn clean install before jetty:run.
> 
> Regards
> JB
> 
> On 08/31/2015 02:45 PM, Paul Spencer wrote:
>> I am getting "error: identifier expected but 'var' found." from http://localhost:8080 after building the Karaf website from the source.  Below are the commands I used to checkout and build the website. What did I not do?
>> 
>> 
>> ***
>> * Commands used to checkout and build site
>> ***
>> svn checkout https://svn.apache.org/repos/asf/karaf/site/trunk
>> cd trunk
>> mvn jetty:run -Plive
>> 
>> 
>> ***
>> * Output of mvn --version
>> ***
>> Apache Maven 3.1.1 (0728685237757ffbf44136acec0402957f723d9a; 2013-09-17 11:22:22-0400)
>> Maven home: /usr/local/apache-maven-3.1.1
>> Java version: 1.7.0_25, vendor: Oracle Corporation
>> Java home: /Library/Java/JavaVirtualMachines/jdk1.7.0_25.jdk/Contents/Home/jre
>> Default locale: en_US, platform encoding: UTF-8
>> OS name: "mac os x", version: "10.10.5", arch: "x86_64", family: "mac"
>> 
>> 
>> Paul Spencer
>> 
> 
> -- 
> Jean-Baptiste Onofré
> jbonofre@apache.org
> http://blog.nanthrax.net
> Talend - http://www.talend.com


Re: Getting "error: identifier expected but 'var' found." from http://localhost:8080 after building the Karaf website from the source.

Posted by Jean-Baptiste Onofré <jb...@nanthrax.net>.
You have to do mvn clean install before jetty:run.

Regards
JB

On 08/31/2015 02:45 PM, Paul Spencer wrote:
> I am getting "error: identifier expected but 'var' found." from http://localhost:8080 after building the Karaf website from the source.  Below are the commands I used to checkout and build the website. What did I not do?
>
>
> ***
> * Commands used to checkout and build site
> ***
> svn checkout https://svn.apache.org/repos/asf/karaf/site/trunk
> cd trunk
> mvn jetty:run -Plive
>
>
> ***
> * Output of mvn --version
> ***
> Apache Maven 3.1.1 (0728685237757ffbf44136acec0402957f723d9a; 2013-09-17 11:22:22-0400)
> Maven home: /usr/local/apache-maven-3.1.1
> Java version: 1.7.0_25, vendor: Oracle Corporation
> Java home: /Library/Java/JavaVirtualMachines/jdk1.7.0_25.jdk/Contents/Home/jre
> Default locale: en_US, platform encoding: UTF-8
> OS name: "mac os x", version: "10.10.5", arch: "x86_64", family: "mac"
>
>
> Paul Spencer
>

-- 
Jean-Baptiste Onofré
jbonofre@apache.org
http://blog.nanthrax.net
Talend - http://www.talend.com