You are viewing a plain text version of this content. The canonical link for it is here.
Posted to ci@bigtop.apache.org by Apache Jenkins Server <je...@builds.apache.org> on 2020/04/27 09:53:41 UTC
Failed: BIGTOP- RAT Check #748
Build: https://builds.apache.org/job/PreCommit-BIGTOP-github-pr-build/748/
###################################################################################
########################## LAST 60 LINES OF THE CONSOLE ###########################
[...truncated 1.89 KB...]
> git rev-parse master^{commit} # timeout=10
Checking out Revision 4680805c9037d7141b7b5eb4f1e4f97124843e5f (master)
> git config core.sparsecheckout # timeout=10
> git checkout -f 4680805c9037d7141b7b5eb4f1e4f97124843e5f
Commit message: "BIGTOP-3347. Fix test failures of Hive ProxyFileSystem against Hadoop 2.10.0."
> git rev-parse origin/master^{commit} # timeout=10
> git rev-list --no-walk 2fedbd625a351248a5e78a81c777ebf62c827ff4 # timeout=10
No emails were triggered.
Setting JDK_1_8_LATEST__HOME=/home/jenkins/tools/java/latest1.8
[PreCommit-BIGTOP-github-pr-build] $ /bin/bash /tmp/jenkins7146964242288761424.sh
% Total % Received % Xferd Average Speed Time Time Time Current
Dload Upload Total Spent Left Speed
0 0 0 0 0 0 0 0 --:--:-- --:--:-- --:--:-- 0 0 0 0 0 0 0 0 0 --:--:-- --:--:-- --:--:-- 0
69 74.7M 69 51.6M 0 0 68.6M 0 0:00:01 --:--:-- 0:00:01 68.6M100 74.7M 100 74.7M 0 0 77.5M 0 --:--:-- --:--:-- --:--:-- 109M
~/.gradle/wrapper/dists/gradle-4.10.3-bin/016e637c7ef47db2d3e632a3936ca351 ~/jenkins-slave/workspace/PreCommit-BIGTOP-github-pr-build
~/jenkins-slave/workspace/PreCommit-BIGTOP-github-pr-build
Welcome to Gradle 4.10.3!
Here are the highlights of this release:
- Incremental Java compilation by default
- Periodic Gradle caches cleanup
- Gradle Kotlin DSL 1.0-RC6
- Nested included builds
- SNAPSHOT plugin versions in the `plugins {}` block
For more details see https://docs.gradle.org/4.10.3/release-notes.html
> Task :rat FAILED
FAILURE: Build failed with an exception.
* What went wrong:
Execution failed for task ':rat'.
> Found 1 files with unapproved/unknown licenses. See file:/home/jenkins/jenkins-slave/workspace/PreCommit-BIGTOP-github-pr-build/build/reports/rat/index.html
* Try:
Run with --stacktrace option to get the stack trace. Run with --info or --debug option to get more log output. Run with --scan to get full insights.
* Get more help at https://help.gradle.org
BUILD FAILED in 25s
1 actionable task: 1 executed
Build step 'Execute shell' marked build as failure
[htmlpublisher] Archiving HTML reports...
Setting JDK_1_8_LATEST__HOME=/home/jenkins/tools/java/latest1.8
[htmlpublisher] Archiving at PROJECT level /home/jenkins/jenkins-slave/workspace/PreCommit-BIGTOP-github-pr-build/build/reports/rat to /x1/jenkins/jenkins-home/jobs/PreCommit-BIGTOP-github-pr-build/htmlreports/HTML_20Report
Setting JDK_1_8_LATEST__HOME=/home/jenkins/tools/java/latest1.8
[description-setter] Could not determine description.
Putting comment on the pull request
Setting JDK_1_8_LATEST__HOME=/home/jenkins/tools/java/latest1.8
Setting JDK_1_8_LATEST__HOME=/home/jenkins/tools/java/latest1.8
Email was triggered for: Failure - Any
Sending email for trigger: Failure - Any
Setting JDK_1_8_LATEST__HOME=/home/jenkins/tools/java/latest1.8
Setting JDK_1_8_LATEST__HOME=/home/jenkins/tools/java/latest1.8
Setting JDK_1_8_LATEST__HOME=/home/jenkins/tools/java/latest1.8
Setting JDK_1_8_LATEST__HOME=/home/jenkins/tools/java/latest1.8
Setting JDK_1_8_LATEST__HOME=/home/jenkins/tools/java/latest1.8
###################################################################################
############################## FAILED TESTS (if any) ##############################
No tests ran.
Success: BIGTOP- RAT Check #749
Posted by Apache Jenkins Server <je...@builds.apache.org>.
Build: https://builds.apache.org/job/PreCommit-BIGTOP-github-pr-build/749/
###################################################################################
########################## LAST 60 LINES OF THE CONSOLE ###########################
[...truncated 1.64 KB...]
Done: 14
Getting sizes
Done: 7
Compressing objects
Done: 3224
Writing objects
Done: 14
remote: Resolving deltas
remote: Updating references
Merging refs/tags/changes/749
> git rev-parse refs/tags/changes/749^{commit} # timeout=10
> git merge 7dfa84b24716f742feb40cdc42dafd5e2063d8ed # timeout=10
> git rev-parse master^{commit} # timeout=10
Checking out Revision b35b1167fb7b0452e8b57d7e1b77910d33e28a73 (master)
> git config core.sparsecheckout # timeout=10
> git checkout -f b35b1167fb7b0452e8b57d7e1b77910d33e28a73
Commit message: "Merge commit '7dfa84b24716f742feb40cdc42dafd5e2063d8ed'"
> git rev-parse origin/master^{commit} # timeout=10
> git rev-list --no-walk 2fedbd625a351248a5e78a81c777ebf62c827ff4 # timeout=10
No emails were triggered.
Setting JDK_1_8_LATEST__HOME=/home/jenkins/tools/java/latest1.8
[PreCommit-BIGTOP-github-pr-build] $ /bin/bash /tmp/jenkins4922892676721548237.sh
% Total % Received % Xferd Average Speed Time Time Time Current
Dload Upload Total Spent Left Speed
0 0 0 0 0 0 0 0 --:--:-- --:--:-- --:--:-- 0 0 0 0 0 0 0 0 0 --:--:-- --:--:-- --:--:-- 0
24 74.7M 24 18.0M 0 0 44.3M 0 0:00:01 --:--:-- 0:00:01 44.3M100 74.7M 100 74.7M 0 0 79.3M 0 --:--:-- --:--:-- --:--:-- 106M
~/.gradle/wrapper/dists/gradle-4.10.3-bin/016e637c7ef47db2d3e632a3936ca351 ~/jenkins-slave/workspace/PreCommit-BIGTOP-github-pr-build
~/jenkins-slave/workspace/PreCommit-BIGTOP-github-pr-build
Welcome to Gradle 4.10.3!
Here are the highlights of this release:
- Incremental Java compilation by default
- Periodic Gradle caches cleanup
- Gradle Kotlin DSL 1.0-RC6
- Nested included builds
- SNAPSHOT plugin versions in the `plugins {}` block
For more details see https://docs.gradle.org/4.10.3/release-notes.html
> Task :rat
BUILD SUCCESSFUL in 27s
1 actionable task: 1 executed
[htmlpublisher] Archiving HTML reports...
Setting JDK_1_8_LATEST__HOME=/home/jenkins/tools/java/latest1.8
[htmlpublisher] Archiving at PROJECT level /home/jenkins/jenkins-slave/workspace/PreCommit-BIGTOP-github-pr-build/build/reports/rat to /x1/jenkins/jenkins-home/jobs/PreCommit-BIGTOP-github-pr-build/htmlreports/HTML_20Report
Setting JDK_1_8_LATEST__HOME=/home/jenkins/tools/java/latest1.8
[description-setter] Could not determine description.
Putting comment on the pull request
Setting JDK_1_8_LATEST__HOME=/home/jenkins/tools/java/latest1.8
Setting JDK_1_8_LATEST__HOME=/home/jenkins/tools/java/latest1.8
Email was triggered for: Success
Sending email for trigger: Success
Setting JDK_1_8_LATEST__HOME=/home/jenkins/tools/java/latest1.8
Setting JDK_1_8_LATEST__HOME=/home/jenkins/tools/java/latest1.8
Setting JDK_1_8_LATEST__HOME=/home/jenkins/tools/java/latest1.8
Setting JDK_1_8_LATEST__HOME=/home/jenkins/tools/java/latest1.8
Setting JDK_1_8_LATEST__HOME=/home/jenkins/tools/java/latest1.8
###################################################################################
############################## FAILED TESTS (if any) ##############################
No tests ran.