You are viewing a plain text version of this content. The canonical link for it is here.
Posted to mapreduce-dev@hadoop.apache.org by Apache Jenkins Server <je...@builds.apache.org> on 2014/12/04 16:25:13 UTC
Hadoop-Mapreduce-trunk - Build # 1979 - Still Failing
See https://builds.apache.org/job/Hadoop-Mapreduce-trunk/1979/
###################################################################################
########################## LAST 60 LINES OF THE CONSOLE ###########################
[...truncated 30695 lines...]
Running org.apache.hadoop.mapred.TestSpecialCharactersInOutputPath
Tests run: 1, Failures: 0, Errors: 0, Skipped: 0, Time elapsed: 25.619 sec - in org.apache.hadoop.mapred.TestSpecialCharactersInOutputPath
Running org.apache.hadoop.mapred.TestSequenceFileAsBinaryOutputFormat
Tests run: 3, Failures: 0, Errors: 0, Skipped: 0, Time elapsed: 1.636 sec - in org.apache.hadoop.mapred.TestSequenceFileAsBinaryOutputFormat
Results :
Tests in error:
TestJavaSerialization.testMapReduceJob:127 » IO Job failed!
TestJavaSerialization.testWriteToSequencefile:179 » IO Job failed!
Tests run: 520, Failures: 0, Errors: 2, Skipped: 11
[INFO] ------------------------------------------------------------------------
[INFO] Reactor Summary:
[INFO]
[INFO] hadoop-mapreduce-client ........................... SUCCESS [ 2.667 s]
[INFO] hadoop-mapreduce-client-core ...................... SUCCESS [01:28 min]
[INFO] hadoop-mapreduce-client-common .................... SUCCESS [ 27.323 s]
[INFO] hadoop-mapreduce-client-shuffle ................... SUCCESS [ 4.324 s]
[INFO] hadoop-mapreduce-client-app ....................... SUCCESS [14:07 min]
[INFO] hadoop-mapreduce-client-hs ........................ SUCCESS [05:34 min]
[INFO] hadoop-mapreduce-client-jobclient ................. FAILURE [ 01:39 h]
[INFO] hadoop-mapreduce-client-hs-plugins ................ SKIPPED
[INFO] hadoop-mapreduce-client-nativetask ................ SKIPPED
[INFO] Apache Hadoop MapReduce Examples .................. SKIPPED
[INFO] hadoop-mapreduce .................................. SKIPPED
[INFO] ------------------------------------------------------------------------
[INFO] BUILD FAILURE
[INFO] ------------------------------------------------------------------------
[INFO] Total time: 02:01 h
[INFO] Finished at: 2014-12-04T15:24:55+00:00
[INFO] Final Memory: 42M/597M
[INFO] ------------------------------------------------------------------------
[ERROR] Failed to execute goal org.apache.maven.plugins:maven-surefire-plugin:2.16:test (default-test) on project hadoop-mapreduce-client-jobclient: There are test failures.
[ERROR]
[ERROR] Please refer to /home/jenkins/jenkins-slave/workspace/Hadoop-Mapreduce-trunk/hadoop-mapreduce-project/hadoop-mapreduce-client/hadoop-mapreduce-client-jobclient/target/surefire-reports for the individual test results.
[ERROR] -> [Help 1]
[ERROR]
[ERROR] To see the full stack trace of the errors, re-run Maven with the -e switch.
[ERROR] Re-run Maven using the -X switch to enable full debug logging.
[ERROR]
[ERROR] For more information about the errors and possible solutions, please read the following articles:
[ERROR] [Help 1] http://cwiki.apache.org/confluence/display/MAVEN/MojoFailureException
[ERROR]
[ERROR] After correcting the problems, you can resume the build with the command
[ERROR] mvn <goals> -rf :hadoop-mapreduce-client-jobclient
Build step 'Execute shell' marked build as failure
[FINDBUGS] Skipping publisher since build result is FAILURE
Archiving artifacts
Sending artifact delta relative to Hadoop-Mapreduce-trunk #1970
Archived 1 artifacts
Archive block size is 32768
Received 0 blocks and 20250798 bytes
Compression is 0.0%
Took 5.3 sec
Recording test results
Email was triggered for: Failure
Sending email for trigger: Failure
###################################################################################
############################## FAILED TESTS (if any) ##############################
2 tests failed.
FAILED: org.apache.hadoop.mapred.TestJavaSerialization.testMapReduceJob
Error Message:
Job failed!
Stack Trace:
java.io.IOException: Job failed!
at org.apache.hadoop.mapred.JobClient.runJob(JobClient.java:838)
at org.apache.hadoop.mapred.TestJavaSerialization.testMapReduceJob(TestJavaSerialization.java:127)
FAILED: org.apache.hadoop.mapred.TestJavaSerialization.testWriteToSequencefile
Error Message:
Job failed!
Stack Trace:
java.io.IOException: Job failed!
at org.apache.hadoop.mapred.JobClient.runJob(JobClient.java:838)
at org.apache.hadoop.mapred.TestJavaSerialization.testWriteToSequencefile(TestJavaSerialization.java:179)
Hadoop-Mapreduce-trunk - Build # 1982 - Still Failing
Posted by Apache Jenkins Server <je...@builds.apache.org>.
See https://builds.apache.org/job/Hadoop-Mapreduce-trunk/1982/
###################################################################################
########################## LAST 60 LINES OF THE CONSOLE ###########################
[...truncated 30806 lines...]
Running org.apache.hadoop.mapred.TestSequenceFileAsBinaryOutputFormat
Tests run: 3, Failures: 0, Errors: 0, Skipped: 0, Time elapsed: 1.704 sec - in org.apache.hadoop.mapred.TestSequenceFileAsBinaryOutputFormat
Results :
Tests in error:
TestJavaSerialization.testMapReduceJob:127 » IO Job failed!
TestJavaSerialization.testWriteToSequencefile:179 » IO Job failed!
Tests run: 520, Failures: 0, Errors: 2, Skipped: 11
[INFO] ------------------------------------------------------------------------
[INFO] Reactor Summary:
[INFO]
[INFO] hadoop-mapreduce-client ........................... SUCCESS [ 2.594 s]
[INFO] hadoop-mapreduce-client-core ...................... SUCCESS [ 59.244 s]
[INFO] hadoop-mapreduce-client-common .................... SUCCESS [ 27.876 s]
[INFO] hadoop-mapreduce-client-shuffle ................... SUCCESS [ 4.381 s]
[INFO] hadoop-mapreduce-client-app ....................... SUCCESS [08:54 min]
[INFO] hadoop-mapreduce-client-hs ........................ SUCCESS [05:12 min]
[INFO] hadoop-mapreduce-client-jobclient ................. FAILURE [ 01:38 h]
[INFO] hadoop-mapreduce-client-hs-plugins ................ SKIPPED
[INFO] hadoop-mapreduce-client-nativetask ................ SKIPPED
[INFO] Apache Hadoop MapReduce Examples .................. SKIPPED
[INFO] hadoop-mapreduce .................................. SKIPPED
[INFO] ------------------------------------------------------------------------
[INFO] BUILD FAILURE
[INFO] ------------------------------------------------------------------------
[INFO] Total time: 01:54 h
[INFO] Finished at: 2014-12-07T15:18:35+00:00
[INFO] Final Memory: 42M/597M
[INFO] ------------------------------------------------------------------------
[ERROR] Failed to execute goal org.apache.maven.plugins:maven-surefire-plugin:2.16:test (default-test) on project hadoop-mapreduce-client-jobclient: There are test failures.
[ERROR]
[ERROR] Please refer to /home/jenkins/jenkins-slave/workspace/Hadoop-Mapreduce-trunk/hadoop-mapreduce-project/hadoop-mapreduce-client/hadoop-mapreduce-client-jobclient/target/surefire-reports for the individual test results.
[ERROR] -> [Help 1]
[ERROR]
[ERROR] To see the full stack trace of the errors, re-run Maven with the -e switch.
[ERROR] Re-run Maven using the -X switch to enable full debug logging.
[ERROR]
[ERROR] For more information about the errors and possible solutions, please read the following articles:
[ERROR] [Help 1] http://cwiki.apache.org/confluence/display/MAVEN/MojoFailureException
[ERROR]
[ERROR] After correcting the problems, you can resume the build with the command
[ERROR] mvn <goals> -rf :hadoop-mapreduce-client-jobclient
Build step 'Execute shell' marked build as failure
[FINDBUGS] Skipping publisher since build result is FAILURE
Archiving artifacts
Sending artifact delta relative to Hadoop-Mapreduce-trunk #1970
Archived 1 artifacts
Archive block size is 32768
Received 0 blocks and 20249956 bytes
Compression is 0.0%
Took 9.5 sec
Recording test results
Updating HADOOP-11313
Updating HDFS-7476
Email was triggered for: Failure
Sending email for trigger: Failure
###################################################################################
############################## FAILED TESTS (if any) ##############################
2 tests failed.
FAILED: org.apache.hadoop.mapred.TestJavaSerialization.testMapReduceJob
Error Message:
Job failed!
Stack Trace:
java.io.IOException: Job failed!
at org.apache.hadoop.mapred.JobClient.runJob(JobClient.java:838)
at org.apache.hadoop.mapred.TestJavaSerialization.testMapReduceJob(TestJavaSerialization.java:127)
FAILED: org.apache.hadoop.mapred.TestJavaSerialization.testWriteToSequencefile
Error Message:
Job failed!
Stack Trace:
java.io.IOException: Job failed!
at org.apache.hadoop.mapred.JobClient.runJob(JobClient.java:838)
at org.apache.hadoop.mapred.TestJavaSerialization.testWriteToSequencefile(TestJavaSerialization.java:179)
Hadoop-Mapreduce-trunk - Build # 1981 - Still Failing
Posted by Apache Jenkins Server <je...@builds.apache.org>.
See https://builds.apache.org/job/Hadoop-Mapreduce-trunk/1981/
###################################################################################
########################## LAST 60 LINES OF THE CONSOLE ###########################
[...truncated 30801 lines...]
Tests run: 520, Failures: 0, Errors: 2, Skipped: 11
[INFO] ------------------------------------------------------------------------
[INFO] Reactor Summary:
[INFO]
[INFO] hadoop-mapreduce-client ........................... SUCCESS [ 2.618 s]
[INFO] hadoop-mapreduce-client-core ...................... SUCCESS [ 59.178 s]
[INFO] hadoop-mapreduce-client-common .................... SUCCESS [ 27.788 s]
[INFO] hadoop-mapreduce-client-shuffle ................... SUCCESS [ 4.397 s]
[INFO] hadoop-mapreduce-client-app ....................... SUCCESS [08:56 min]
[INFO] hadoop-mapreduce-client-hs ........................ SUCCESS [05:12 min]
[INFO] hadoop-mapreduce-client-jobclient ................. FAILURE [ 01:36 h]
[INFO] hadoop-mapreduce-client-hs-plugins ................ SKIPPED
[INFO] hadoop-mapreduce-client-nativetask ................ SKIPPED
[INFO] Apache Hadoop MapReduce Examples .................. SKIPPED
[INFO] hadoop-mapreduce .................................. SKIPPED
[INFO] ------------------------------------------------------------------------
[INFO] BUILD FAILURE
[INFO] ------------------------------------------------------------------------
[INFO] Total time: 01:52 h
[INFO] Finished at: 2014-12-06T15:16:33+00:00
[INFO] Final Memory: 42M/604M
[INFO] ------------------------------------------------------------------------
[ERROR] Failed to execute goal org.apache.maven.plugins:maven-surefire-plugin:2.16:test (default-test) on project hadoop-mapreduce-client-jobclient: There are test failures.
[ERROR]
[ERROR] Please refer to /home/jenkins/jenkins-slave/workspace/Hadoop-Mapreduce-trunk/hadoop-mapreduce-project/hadoop-mapreduce-client/hadoop-mapreduce-client-jobclient/target/surefire-reports for the individual test results.
[ERROR] -> [Help 1]
[ERROR]
[ERROR] To see the full stack trace of the errors, re-run Maven with the -e switch.
[ERROR] Re-run Maven using the -X switch to enable full debug logging.
[ERROR]
[ERROR] For more information about the errors and possible solutions, please read the following articles:
[ERROR] [Help 1] http://cwiki.apache.org/confluence/display/MAVEN/MojoFailureException
[ERROR]
[ERROR] After correcting the problems, you can resume the build with the command
[ERROR] mvn <goals> -rf :hadoop-mapreduce-client-jobclient
Build step 'Execute shell' marked build as failure
[FINDBUGS] Skipping publisher since build result is FAILURE
Archiving artifacts
Sending artifact delta relative to Hadoop-Mapreduce-trunk #1970
Archived 1 artifacts
Archive block size is 32768
Received 0 blocks and 20249501 bytes
Compression is 0.0%
Took 11 sec
Recording test results
Updating YARN-2461
Updating YARN-2869
Updating HDFS-7459
Updating YARN-2056
Updating HADOOP-11355
Updating HDFS-7472
Updating HADOOP-11343
Updating HADOOP-11356
Updating HDFS-7474
Updating HDFS-7478
Email was triggered for: Failure
Sending email for trigger: Failure
###################################################################################
############################## FAILED TESTS (if any) ##############################
2 tests failed.
FAILED: org.apache.hadoop.mapred.TestJavaSerialization.testMapReduceJob
Error Message:
Job failed!
Stack Trace:
java.io.IOException: Job failed!
at org.apache.hadoop.mapred.JobClient.runJob(JobClient.java:838)
at org.apache.hadoop.mapred.TestJavaSerialization.testMapReduceJob(TestJavaSerialization.java:127)
FAILED: org.apache.hadoop.mapred.TestJavaSerialization.testWriteToSequencefile
Error Message:
Job failed!
Stack Trace:
java.io.IOException: Job failed!
at org.apache.hadoop.mapred.JobClient.runJob(JobClient.java:838)
at org.apache.hadoop.mapred.TestJavaSerialization.testWriteToSequencefile(TestJavaSerialization.java:179)
Hadoop-Mapreduce-trunk - Build # 1980 - Still Failing
Posted by Apache Jenkins Server <je...@builds.apache.org>.
See https://builds.apache.org/job/Hadoop-Mapreduce-trunk/1980/
###################################################################################
########################## LAST 60 LINES OF THE CONSOLE ###########################
[...truncated 30797 lines...]
Tests in error:
TestJavaSerialization.testMapReduceJob:127 » IO Job failed!
TestJavaSerialization.testWriteToSequencefile:179 » IO Job failed!
Tests run: 520, Failures: 0, Errors: 2, Skipped: 11
[INFO] ------------------------------------------------------------------------
[INFO] Reactor Summary:
[INFO]
[INFO] hadoop-mapreduce-client ........................... SUCCESS [ 2.620 s]
[INFO] hadoop-mapreduce-client-core ...................... SUCCESS [ 59.337 s]
[INFO] hadoop-mapreduce-client-common .................... SUCCESS [ 27.677 s]
[INFO] hadoop-mapreduce-client-shuffle ................... SUCCESS [ 4.391 s]
[INFO] hadoop-mapreduce-client-app ....................... SUCCESS [08:57 min]
[INFO] hadoop-mapreduce-client-hs ........................ SUCCESS [05:12 min]
[INFO] hadoop-mapreduce-client-jobclient ................. FAILURE [ 01:36 h]
[INFO] hadoop-mapreduce-client-hs-plugins ................ SKIPPED
[INFO] hadoop-mapreduce-client-nativetask ................ SKIPPED
[INFO] Apache Hadoop MapReduce Examples .................. SKIPPED
[INFO] hadoop-mapreduce .................................. SKIPPED
[INFO] ------------------------------------------------------------------------
[INFO] BUILD FAILURE
[INFO] ------------------------------------------------------------------------
[INFO] Total time: 01:52 h
[INFO] Finished at: 2014-12-05T15:16:38+00:00
[INFO] Final Memory: 42M/597M
[INFO] ------------------------------------------------------------------------
[ERROR] Failed to execute goal org.apache.maven.plugins:maven-surefire-plugin:2.16:test (default-test) on project hadoop-mapreduce-client-jobclient: There are test failures.
[ERROR]
[ERROR] Please refer to /home/jenkins/jenkins-slave/workspace/Hadoop-Mapreduce-trunk/hadoop-mapreduce-project/hadoop-mapreduce-client/hadoop-mapreduce-client-jobclient/target/surefire-reports for the individual test results.
[ERROR] -> [Help 1]
[ERROR]
[ERROR] To see the full stack trace of the errors, re-run Maven with the -e switch.
[ERROR] Re-run Maven using the -X switch to enable full debug logging.
[ERROR]
[ERROR] For more information about the errors and possible solutions, please read the following articles:
[ERROR] [Help 1] http://cwiki.apache.org/confluence/display/MAVEN/MojoFailureException
[ERROR]
[ERROR] After correcting the problems, you can resume the build with the command
[ERROR] mvn <goals> -rf :hadoop-mapreduce-client-jobclient
Build step 'Execute shell' marked build as failure
[FINDBUGS] Skipping publisher since build result is FAILURE
Archiving artifacts
Sending artifact delta relative to Hadoop-Mapreduce-trunk #1970
Archived 1 artifacts
Archive block size is 32768
Received 0 blocks and 20249435 bytes
Compression is 0.0%
Took 9.3 sec
Recording test results
Updating YARN-2189
Updating YARN-1492
Updating HDFS-7468
Updating HDFS-7454
Updating HADOOP-11348
Updating HDFS-7424
Updating YARN-2301
Email was triggered for: Failure
Sending email for trigger: Failure
###################################################################################
############################## FAILED TESTS (if any) ##############################
2 tests failed.
FAILED: org.apache.hadoop.mapred.TestJavaSerialization.testMapReduceJob
Error Message:
Job failed!
Stack Trace:
java.io.IOException: Job failed!
at org.apache.hadoop.mapred.JobClient.runJob(JobClient.java:838)
at org.apache.hadoop.mapred.TestJavaSerialization.testMapReduceJob(TestJavaSerialization.java:127)
FAILED: org.apache.hadoop.mapred.TestJavaSerialization.testWriteToSequencefile
Error Message:
Job failed!
Stack Trace:
java.io.IOException: Job failed!
at org.apache.hadoop.mapred.JobClient.runJob(JobClient.java:838)
at org.apache.hadoop.mapred.TestJavaSerialization.testWriteToSequencefile(TestJavaSerialization.java:179)