You are viewing a plain text version of this content. The canonical link for it is here.
Posted to builds@mesos.apache.org by Apache Jenkins Server <je...@builds.apache.org> on 2017/09/05 22:51:47 UTC
Build failed in Jenkins: Mesos-Reviewbot #19213
See <https://builds.apache.org/job/Mesos-Reviewbot/19213/display/redirect?page=changes>
Changes:
[josephwu] CMake: Harden Mesos build.
[josephwu] CMake: Fixed two instances of list appending style.
------------------------------------------
[...truncated 31.38 MB...]
I0905 22:51:41.255326 5813 slave.cpp:285] Agent using credential for: test-principal
I0905 22:51:41.255348 5813 credentials.hpp:37] Loading credentials for authentication from '/tmp/Endpoint_SlaveEndpointTest_AuthorizedRequest_2_8VGKFh/http_credentials'
I0905 22:51:41.255594 5813 http.cpp:1045] Creating default 'basic' HTTP authenticator for realm 'mesos-agent-readonly'
I0905 22:51:41.255764 5813 http.cpp:1045] Creating default 'basic' HTTP authenticator for realm 'mesos-agent-readwrite'
I0905 22:51:41.257203 5813 slave.cpp:581] Agent resources: [{"name":"cpus","scalar":{"value":2.0},"type":"SCALAR"},{"name":"mem","scalar":{"value":1024.0},"type":"SCALAR"},{"name":"disk","scalar":{"value":1024.0},"type":"SCALAR"},{"name":"ports","ranges":{"range":[{"begin":31000,"end":32000}]},"type":"RANGES"}]
I0905 22:51:41.257443 5813 slave.cpp:589] Agent attributes: [ ]
I0905 22:51:41.257459 5813 slave.cpp:598] Agent hostname: ae635d85e1eb
I0905 22:51:41.257627 5797 status_update_manager.cpp:177] Pausing sending status updates
I0905 22:51:41.258996 5795 state.cpp:64] Recovering state from '/tmp/Endpoint_SlaveEndpointTest_AuthorizedRequest_2_0DZMvo/meta'
I0905 22:51:41.259382 5793 status_update_manager.cpp:203] Recovering status update manager
I0905 22:51:41.259677 5805 containerizer.cpp:646] Recovering containerizer
I0905 22:51:41.261162 5812 provisioner.cpp:416] Provisioner recovery complete
I0905 22:51:41.261595 5810 slave.cpp:6296] Finished recovery
I0905 22:51:41.262169 5810 slave.cpp:6478] Querying resource estimator for oversubscribable resources
I0905 22:51:41.262501 5804 slave.cpp:6492] Received oversubscribable resources {} from the resource estimator
I0905 22:51:41.265193 5806 process.cpp:3954] Handling HTTP event for process 'slave(810)' with path: '/slave(810)/containers'
I0905 22:51:41.266504 5796 http.cpp:1185] HTTP GET for /slave(810)/containers from 172.17.0.7:41720
I0905 22:51:41.266574 5796 http.cpp:976] Authorizing principal 'test-principal' to GET the '/containers' endpoint
I0905 22:51:41.270783 5803 slave.cpp:859] Agent terminating
[ OK ] Endpoint/SlaveEndpointTest.AuthorizedRequest/2 (35 ms)
[ RUN ] Endpoint/SlaveEndpointTest.UnauthorizedRequest/0
I0905 22:51:41.287276 5772 containerizer.cpp:290] Using isolation { environment_secret, posix/cpu, posix/mem, filesystem/posix, network/cni }
W0905 22:51:41.288081 5772 backend.cpp:76] Failed to create 'aufs' backend: AufsBackend requires root privileges
W0905 22:51:41.288260 5772 backend.cpp:76] Failed to create 'bind' backend: BindBackend requires root privileges
I0905 22:51:41.288316 5772 provisioner.cpp:255] Using default backend 'copy'
I0905 22:51:41.293784 5802 slave.cpp:252] Mesos agent started on (811)@172.17.0.7:33064
I0905 22:51:41.293809 5802 slave.cpp:253] Flags at startup: --acls="" --appc_simple_discovery_uri_prefix="http://" --appc_store_dir="/tmp/Endpoint_SlaveEndpointTest_UnauthorizedRequest_0_wSD5BQ/store/appc" --authenticate_http_readonly="true" --authenticate_http_readwrite="true" --authenticatee="crammd5" --authentication_backoff_factor="1secs" --authorizer="local" --cgroups_cpu_enable_pids_and_tids_count="false" --cgroups_enable_cfs="false" --cgroups_hierarchy="/sys/fs/cgroup" --cgroups_limit_swap="false" --cgroups_root="mesos" --container_disk_watch_interval="15secs" --containerizers="mesos" --credential="/tmp/Endpoint_SlaveEndpointTest_UnauthorizedRequest_0_wSD5BQ/credential" --default_role="*" --disallow_sharing_agent_pid_namespace="false" --disk_watch_interval="1mins" --docker="docker" --docker_kill_orphans="true" --docker_registry="https://registry-1.docker.io" --docker_remove_delay="6hrs" --docker_socket="/var/run/docker.sock" --docker_stop_timeout="0ns" --docker_store_dir="/tmp/Endpoint_SlaveEndpointTest_UnauthorizedRequest_0_wSD5BQ/store/docker" --docker_volume_checkpoint_dir="/var/run/mesos/isolators/docker/volume" --enforce_container_disk_quota="false" --executor_registration_timeout="1mins" --executor_reregistration_timeout="2secs" --executor_shutdown_grace_period="5secs" --fetcher_cache_dir="/tmp/Endpoint_SlaveEndpointTest_UnauthorizedRequest_0_wSD5BQ/fetch" --fetcher_cache_size="2GB" --frameworks_home="" --gc_delay="1weeks" --gc_disk_headroom="0.1" --hadoop_home="" --help="false" --hostname_lookup="true" --http_command_executor="false" --http_credentials="/tmp/Endpoint_SlaveEndpointTest_UnauthorizedRequest_0_wSD5BQ/http_credentials" --http_heartbeat_interval="30secs" --initialize_driver_logging="true" --isolation="posix/cpu,posix/mem" --launcher="posix" --launcher_dir="/mesos/mesos-1.5.0/_build/src" --logbufsecs="0" --logging_level="INFO" --max_completed_executors_per_framework="150" --oversubscribed_resources_interval="15secs" --perf_duration="10secs" --perf_interval="1mins" --port="5051" --qos_correction_interval_min="0ns" --quiet="false" --recover="reconnect" --recovery_timeout="15mins" --registration_backoff_factor="10ms" --resources="cpus:2;gpus:0;mem:1024;disk:1024;ports:[31000-32000]" --revocable_cpu_low_priority="true" --runtime_dir="/tmp/Endpoint_SlaveEndpointTest_UnauthorizedRequest_0_wSD5BQ" --sandbox_directory="/mnt/mesos/sandbox" --strict="true" --switch_user="true" --systemd_enable_support="true" --systemd_runtime_directory="/run/systemd/system" --version="false" --work_dir="/tmp/Endpoint_SlaveEndpointTest_UnauthorizedRequest_0_saBAmX" --zk_session_timeout="10secs"
I0905 22:51:41.294191 5802 credentials.hpp:86] Loading credential for authentication from '/tmp/Endpoint_SlaveEndpointTest_UnauthorizedRequest_0_wSD5BQ/credential'
I0905 22:51:41.294342 5802 slave.cpp:285] Agent using credential for: test-principal
I0905 22:51:41.294368 5802 credentials.hpp:37] Loading credentials for authentication from '/tmp/Endpoint_SlaveEndpointTest_UnauthorizedRequest_0_wSD5BQ/http_credentials'
I0905 22:51:41.294608 5802 http.cpp:1045] Creating default 'basic' HTTP authenticator for realm 'mesos-agent-readonly'
I0905 22:51:41.294770 5802 http.cpp:1045] Creating default 'basic' HTTP authenticator for realm 'mesos-agent-readwrite'
I0905 22:51:41.296247 5802 slave.cpp:581] Agent resources: [{"name":"cpus","scalar":{"value":2.0},"type":"SCALAR"},{"name":"mem","scalar":{"value":1024.0},"type":"SCALAR"},{"name":"disk","scalar":{"value":1024.0},"type":"SCALAR"},{"name":"ports","ranges":{"range":[{"begin":31000,"end":32000}]},"type":"RANGES"}]
I0905 22:51:41.296491 5802 slave.cpp:589] Agent attributes: [ ]
I0905 22:51:41.296507 5802 slave.cpp:598] Agent hostname: ae635d85e1eb
I0905 22:51:41.296648 5791 status_update_manager.cpp:177] Pausing sending status updates
I0905 22:51:41.298079 5795 state.cpp:64] Recovering state from '/tmp/Endpoint_SlaveEndpointTest_UnauthorizedRequest_0_saBAmX/meta'
I0905 22:51:41.298449 5797 status_update_manager.cpp:203] Recovering status update manager
I0905 22:51:41.298739 5798 containerizer.cpp:646] Recovering containerizer
I0905 22:51:41.300444 5808 provisioner.cpp:416] Provisioner recovery complete
I0905 22:51:41.300886 5804 slave.cpp:6296] Finished recovery
I0905 22:51:41.301354 5804 slave.cpp:6478] Querying resource estimator for oversubscribable resources
I0905 22:51:41.301647 5813 slave.cpp:6492] Received oversubscribable resources {} from the resource estimator
I0905 22:51:41.305176 5803 process.cpp:3954] Handling HTTP event for process 'slave(811)' with path: '/slave(811)/monitor/statistics'
I0905 22:51:41.306509 5810 http.cpp:1185] HTTP GET for /slave(811)/monitor/statistics from 172.17.0.7:41724
I0905 22:51:41.306592 5810 http.cpp:976] Authorizing principal 'test-principal' to GET the '/monitor/statistics' endpoint
I0905 22:51:41.308509 5797 slave.cpp:859] Agent terminating
[ OK ] Endpoint/SlaveEndpointTest.UnauthorizedRequest/0 (35 ms)
[ RUN ] Endpoint/SlaveEndpointTest.UnauthorizedRequest/1
I0905 22:51:41.319948 5772 containerizer.cpp:290] Using isolation { environment_secret, posix/cpu, posix/mem, filesystem/posix, network/cni }
W0905 22:51:41.320439 5772 backend.cpp:76] Failed to create 'aufs' backend: AufsBackend requires root privileges
W0905 22:51:41.320549 5772 backend.cpp:76] Failed to create 'bind' backend: BindBackend requires root privileges
I0905 22:51:41.320593 5772 provisioner.cpp:255] Using default backend 'copy'
I0905 22:51:41.324239 5812 slave.cpp:252] Mesos agent started on (812)@172.17.0.7:33064
I0905 22:51:41.324261 5812 slave.cpp:253] Flags at startup: --acls="" --appc_simple_discovery_uri_prefix="http://" --appc_store_dir="/tmp/Endpoint_SlaveEndpointTest_UnauthorizedRequest_1_8WQOTp/store/appc" --authenticate_http_readonly="true" --authenticate_http_readwrite="true" --authenticatee="crammd5" --authentication_backoff_factor="1secs" --authorizer="local" --cgroups_cpu_enable_pids_and_tids_count="false" --cgroups_enable_cfs="false" --cgroups_hierarchy="/sys/fs/cgroup" --cgroups_limit_swap="false" --cgroups_root="mesos" --container_disk_watch_interval="15secs" --containerizers="mesos" --credential="/tmp/Endpoint_SlaveEndpointTest_UnauthorizedRequest_1_8WQOTp/credential" --default_role="*" --disallow_sharing_agent_pid_namespace="false" --disk_watch_interval="1mins" --docker="docker" --docker_kill_orphans="true" --docker_registry="https://registry-1.docker.io" --docker_remove_delay="6hrs" --docker_socket="/var/run/docker.sock" --docker_stop_timeout="0ns" --docker_store_dir="/tmp/Endpoint_SlaveEndpointTest_UnauthorizedRequest_1_8WQOTp/store/docker" --docker_volume_checkpoint_dir="/var/run/mesos/isolators/docker/volume" --enforce_container_disk_quota="false" --executor_registration_timeout="1mins" --executor_reregistration_timeout="2secs" --executor_shutdown_grace_period="5secs" --fetcher_cache_dir="/tmp/Endpoint_SlaveEndpointTest_UnauthorizedRequest_1_8WQOTp/fetch" --fetcher_cache_size="2GB" --frameworks_home="" --gc_delay="1weeks" --gc_disk_headroom="0.1" --hadoop_home="" --help="false" --hostname_lookup="true" --http_command_executor="false" --http_credentials="/tmp/Endpoint_SlaveEndpointTest_UnauthorizedRequest_1_8WQOTp/http_credentials" --http_heartbeat_interval="30secs" --initialize_driver_logging="true" --isolation="posix/cpu,posix/mem" --launcher="posix" --launcher_dir="/mesos/mesos-1.5.0/_build/src" --logbufsecs="0" --logging_level="INFO" --max_completed_executors_per_framework="150" --oversubscribed_resources_interval="15secs" --perf_duration="10secs" --perf_interval="1mins" --port="5051" --qos_correction_interval_min="0ns" --quiet="false" --recover="reconnect" --recovery_timeout="15mins" --registration_backoff_factor="10ms" --resources="cpus:2;gpus:0;mem:1024;disk:1024;ports:[31000-32000]" --revocable_cpu_low_priority="true" --runtime_dir="/tmp/Endpoint_SlaveEndpointTest_UnauthorizedRequest_1_8WQOTp" --sandbox_directory="/mnt/mesos/sandbox" --strict="true" --switch_user="true" --systemd_enable_support="true" --systemd_runtime_directory="/run/systemd/system" --version="false" --work_dir="/tmp/Endpoint_SlaveEndpointTest_UnauthorizedRequest_1_8xFczw" --zk_session_timeout="10secs"
I0905 22:51:41.324729 5812 credentials.hpp:86] Loading credential for authentication from '/tmp/Endpoint_SlaveEndpointTest_UnauthorizedRequest_1_8WQOTp/credential'
I0905 22:51:41.324910 5812 slave.cpp:285] Agent using credential for: test-principal
I0905 22:51:41.324931 5812 credentials.hpp:37] Loading credentials for authentication from '/tmp/Endpoint_SlaveEndpointTest_UnauthorizedRequest_1_8WQOTp/http_credentials'
I0905 22:51:41.325172 5812 http.cpp:1045] Creating default 'basic' HTTP authenticator for realm 'mesos-agent-readonly'
I0905 22:51:41.325320 5812 http.cpp:1045] Creating default 'basic' HTTP authenticator for realm 'mesos-agent-readwrite'
I0905 22:51:41.326627 5812 slave.cpp:581] Agent resources: [{"name":"cpus","scalar":{"value":2.0},"type":"SCALAR"},{"name":"mem","scalar":{"value":1024.0},"type":"SCALAR"},{"name":"disk","scalar":{"value":1024.0},"type":"SCALAR"},{"name":"ports","ranges":{"range":[{"begin":31000,"end":32000}]},"type":"RANGES"}]
I0905 22:51:41.326846 5812 slave.cpp:589] Agent attributes: [ ]
I0905 22:51:41.326861 5812 slave.cpp:598] Agent hostname: ae635d85e1eb
I0905 22:51:41.326989 5810 status_update_manager.cpp:177] Pausing sending status updates
I0905 22:51:41.328450 5794 state.cpp:64] Recovering state from '/tmp/Endpoint_SlaveEndpointTest_UnauthorizedRequest_1_8xFczw/meta'
I0905 22:51:41.328698 5811 status_update_manager.cpp:203] Recovering status update manager
I0905 22:51:41.328934 5809 containerizer.cpp:646] Recovering containerizer
I0905 22:51:41.330247 5800 provisioner.cpp:416] Provisioner recovery complete
I0905 22:51:41.330703 5807 slave.cpp:6296] Finished recovery
I0905 22:51:41.331279 5807 slave.cpp:6478] Querying resource estimator for oversubscribable resources
I0905 22:51:41.331534 5796 slave.cpp:6492] Received oversubscribable resources {} from the resource estimator
I0905 22:51:41.333889 5810 process.cpp:3954] Handling HTTP event for process 'slave(812)' with path: '/slave(812)/monitor/statistics.json'
I0905 22:51:41.335026 5804 http.cpp:1185] HTTP GET for /slave(812)/monitor/statistics.json from 172.17.0.7:41726
I0905 22:51:41.335109 5804 http.cpp:976] Authorizing principal 'test-principal' to GET the '/monitor/statistics.json' endpoint
I0905 22:51:41.337280 5794 slave.cpp:859] Agent terminating
[ OK ] Endpoint/SlaveEndpointTest.UnauthorizedRequest/1 (27 ms)
[ RUN ] Endpoint/SlaveEndpointTest.UnauthorizedRequest/2
I0905 22:51:41.347971 5772 containerizer.cpp:290] Using isolation { environment_secret, posix/cpu, posix/mem, filesystem/posix, network/cni }
W0905 22:51:41.348429 5772 backend.cpp:76] Failed to create 'aufs' backend: AufsBackend requires root privileges
W0905 22:51:41.348539 5772 backend.cpp:76] Failed to create 'bind' backend: BindBackend requires root privileges
I0905 22:51:41.348572 5772 provisioner.cpp:255] Using default backend 'copy'
I0905 22:51:41.352022 5800 slave.cpp:252] Mesos agent started on (813)@172.17.0.7:33064
I0905 22:51:41.352053 5800 slave.cpp:253] Flags at startup: --acls="" --appc_simple_discovery_uri_prefix="http://" --appc_store_dir="/tmp/Endpoint_SlaveEndpointTest_UnauthorizedRequest_2_55aAsZ/store/appc" --authenticate_http_readonly="true" --authenticate_http_readwrite="true" --authenticatee="crammd5" --authentication_backoff_factor="1secs" --authorizer="local" --cgroups_cpu_enable_pids_and_tids_count="false" --cgroups_enable_cfs="false" --cgroups_hierarchy="/sys/fs/cgroup" --cgroups_limit_swap="false" --cgroups_root="mesos" --container_disk_watch_interval="15secs" --containerizers="mesos" --credential="/tmp/Endpoint_SlaveEndpointTest_UnauthorizedRequest_2_55aAsZ/credential" --default_role="*" --disallow_sharing_agent_pid_namespace="false" --disk_watch_interval="1mins" --docker="docker" --docker_kill_orphans="true" --docker_registry="https://registry-1.docker.io" --docker_remove_delay="6hrs" --docker_socket="/var/run/docker.sock" --docker_stop_timeout="0ns" --docker_store_dir="/tmp/Endpoint_SlaveEndpointTest_UnauthorizedRequest_2_55aAsZ/store/docker" --docker_volume_checkpoint_dir="/var/run/mesos/isolators/docker/volume" --enforce_container_disk_quota="false" --executor_registration_timeout="1mins" --executor_reregistration_timeout="2secs" --executor_shutdown_grace_period="5secs" --fetcher_cache_dir="/tmp/Endpoint_SlaveEndpointTest_UnauthorizedRequest_2_55aAsZ/fetch" --fetcher_cache_size="2GB" --frameworks_home="" --gc_delay="1weeks" --gc_disk_headroom="0.1" --hadoop_home="" --help="false" --hostname_lookup="true" --http_command_executor="false" --http_credentials="/tmp/Endpoint_SlaveEndpointTest_UnauthorizedRequest_2_55aAsZ/http_credentials" --http_heartbeat_interval="30secs" --initialize_driver_logging="true" --isolation="posix/cpu,posix/mem" --launcher="posix" --launcher_dir="/mesos/mesos-1.5.0/_build/src" --logbufsecs="0" --logging_level="INFO" --max_completed_executors_per_framework="150" --oversubscribed_resources_interval="15secs" --perf_duration="10secs" --perf_interval="1mins" --port="5051" --qos_correction_interval_min="0ns" --quiet="false" --recover="reconnect" --recovery_timeout="15mins" --registration_backoff_factor="10ms" --resources="cpus:2;gpus:0;mem:1024;disk:1024;ports:[31000-32000]" --revocable_cpu_low_priority="true" --runtime_dir="/tmp/Endpoint_SlaveEndpointTest_UnauthorizedRequest_2_55aAsZ" --sandbox_directory="/mnt/mesos/sandbox" --strict="true" --switch_user="true" --systemd_enable_support="true" --systemd_runtime_directory="/run/systemd/system" --version="false" --work_dir="/tmp/Endpoint_SlaveEndpointTest_UnauthorizedRequest_2_NgiM35" --zk_session_timeout="10secs"
I0905 22:51:41.352722 5800 credentials.hpp:86] Loading credential for authentication from '/tmp/Endpoint_SlaveEndpointTest_UnauthorizedRequest_2_55aAsZ/credential'
I0905 22:51:41.353004 5800 slave.cpp:285] Agent using credential for: test-principal
I0905 22:51:41.353062 5800 credentials.hpp:37] Loading credentials for authentication from '/tmp/Endpoint_SlaveEndpointTest_UnauthorizedRequest_2_55aAsZ/http_credentials'
I0905 22:51:41.353485 5800 http.cpp:1045] Creating default 'basic' HTTP authenticator for realm 'mesos-agent-readonly'
I0905 22:51:41.353703 5800 http.cpp:1045] Creating default 'basic' HTTP authenticator for realm 'mesos-agent-readwrite'
I0905 22:51:41.355203 5800 slave.cpp:581] Agent resources: [{"name":"cpus","scalar":{"value":2.0},"type":"SCALAR"},{"name":"mem","scalar":{"value":1024.0},"type":"SCALAR"},{"name":"disk","scalar":{"value":1024.0},"type":"SCALAR"},{"name":"ports","ranges":{"range":[{"begin":31000,"end":32000}]},"type":"RANGES"}]
I0905 22:51:41.355415 5800 slave.cpp:589] Agent attributes: [ ]
I0905 22:51:41.355428 5800 slave.cpp:598] Agent hostname: ae635d85e1eb
I0905 22:51:41.355573 5799 status_update_manager.cpp:177] Pausing sending status updates
I0905 22:51:41.356977 5805 state.cpp:64] Recovering state from '/tmp/Endpoint_SlaveEndpointTest_UnauthorizedRequest_2_NgiM35/meta'
I0905 22:51:41.357283 5802 status_update_manager.cpp:203] Recovering status update manager
I0905 22:51:41.357460 5807 containerizer.cpp:646] Recovering containerizer
I0905 22:51:41.358837 5795 provisioner.cpp:416] Provisioner recovery complete
I0905 22:51:41.359138 5809 slave.cpp:6296] Finished recovery
I0905 22:51:41.359863 5809 slave.cpp:6478] Querying resource estimator for oversubscribable resources
I0905 22:51:41.360095 5801 slave.cpp:6492] Received oversubscribable resources {} from the resource estimator
I0905 22:51:41.363065 5794 process.cpp:3954] Handling HTTP event for process 'slave(813)' with path: '/slave(813)/containers'
I0905 22:51:41.364253 5800 http.cpp:1185] HTTP GET for /slave(813)/containers from 172.17.0.7:41728
I0905 22:51:41.364321 5800 http.cpp:976] Authorizing principal 'test-principal' to GET the '/containers' endpoint
I0905 22:51:41.366567 5772 slave.cpp:859] Agent terminating
[ OK ] Endpoint/SlaveEndpointTest.UnauthorizedRequest/2 (29 ms)
[ RUN ] Endpoint/SlaveEndpointTest.NoAuthorizer/0
I0905 22:51:41.378695 5772 containerizer.cpp:290] Using isolation { environment_secret, posix/cpu, posix/mem, filesystem/posix, network/cni }
W0905 22:51:41.379189 5772 backend.cpp:76] Failed to create 'aufs' backend: AufsBackend requires root privileges
W0905 22:51:41.379295 5772 backend.cpp:76] Failed to create 'bind' backend: BindBackend requires root privileges
I0905 22:51:41.379328 5772 provisioner.cpp:255] Using default backend 'copy'
I0905 22:51:41.381006 5772 cluster.cpp:448] Creating default 'local' authorizer
I0905 22:51:41.382926 5808 slave.cpp:252] Mesos agent started on (814)@172.17.0.7:33064
I0905 22:51:41.382946 5808 slave.cpp:253] Flags at startup: --acls="" --appc_simple_discovery_uri_prefix="http://" --appc_store_dir="/tmp/Endpoint_SlaveEndpointTest_NoAuthorizer_0_QSK0iz/store/appc" --authenticate_http_readonly="true" --authenticate_http_readwrite="true" --authenticatee="crammd5" --authentication_backoff_factor="1secs" --authorizer="local" --cgroups_cpu_enable_pids_and_tids_count="false" --cgroups_enable_cfs="false" --cgroups_hierarchy="/sys/fs/cgroup" --cgroups_limit_swap="false" --cgroups_root="mesos" --container_disk_watch_interval="15secs" --containerizers="mesos" --credential="/tmp/Endpoint_SlaveEndpointTest_NoAuthorizer_0_QSK0iz/credential" --default_role="*" --disallow_sharing_agent_pid_namespace="false" --disk_watch_interval="1mins" --docker="docker" --docker_kill_orphans="true" --docker_registry="https://registry-1.docker.io" --docker_remove_delay="6hrs" --docker_socket="/var/run/docker.sock" --docker_stop_timeout="0ns" --docker_store_dir="/tmp/Endpoint_SlaveEndpointTest_NoAuthorizer_0_QSK0iz/store/docker" --docker_volume_checkpoint_dir="/var/run/mesos/isolators/docker/volume" --enforce_container_disk_quota="false" --executor_registration_timeout="1mins" --executor_reregistration_timeout="2secs" --executor_shutdown_grace_period="5secs" --fetcher_cache_dir="/tmp/Endpoint_SlaveEndpointTest_NoAuthorizer_0_QSK0iz/fetch" --fetcher_cache_size="2GB" --frameworks_home="" --gc_delay="1weeks" --gc_disk_headroom="0.1" --hadoop_home="" --help="false" --hostname_lookup="true" --http_command_executor="false" --http_credentials="/tmp/Endpoint_SlaveEndpointTest_NoAuthorizer_0_QSK0iz/http_credentials" --http_heartbeat_interval="30secs" --initialize_driver_logging="true" --isolation="posix/cpu,posix/mem" --launcher="posix" --launcher_dir="/mesos/mesos-1.5.0/_build/src" --logbufsecs="0" --logging_level="INFO" --max_completed_executors_per_framework="150" --oversubscribed_resources_interval="15secs" --perf_duration="10secs" --perf_interval="1mins" --port="5051" --qos_correction_interval_min="0ns" --quiet="false" --recover="reconnect" --recovery_timeout="15mins" --registration_backoff_factor="10ms" --resources="cpus:2;gpus:0;mem:1024;disk:1024;ports:[31000-32000]" --revocable_cpu_low_priority="true" --runtime_dir="/tmp/Endpoint_SlaveEndpointTest_NoAuthorizer_0_QSK0iz" --sandbox_directory="/mnt/mesos/sandbox" --strict="true" --switch_user="true" --systemd_enable_support="true" --systemd_runtime_directory="/run/systemd/system" --version="false" --work_dir="/tmp/Endpoint_SlaveEndpointTest_NoAuthorizer_0_rLqJPF" --zk_session_timeout="10secs"
I0905 22:51:41.383345 5808 credentials.hpp:86] Loading credential for authentication from '/tmp/Endpoint_SlaveEndpointTest_NoAuthorizer_0_QSK0iz/credential'
I0905 22:51:41.383486 5808 slave.cpp:285] Agent using credential for: test-principal
I0905 22:51:41.383505 5808 credentials.hpp:37] Loading credentials for authentication from '/tmp/Endpoint_SlaveEndpointTest_NoAuthorizer_0_QSK0iz/http_credentials'
I0905 22:51:41.383703 5808 http.cpp:1045] Creating default 'basic' HTTP authenticator for realm 'mesos-agent-readonly'
I0905 22:51:41.383842 5808 http.cpp:1045] Creating default 'basic' HTTP authenticator for realm 'mesos-agent-readwrite'
I0905 22:51:41.385046 5808 slave.cpp:581] Agent resources: [{"name":"cpus","scalar":{"value":2.0},"type":"SCALAR"},{"name":"mem","scalar":{"value":1024.0},"type":"SCALAR"},{"name":"disk","scalar":{"value":1024.0},"type":"SCALAR"},{"name":"ports","ranges":{"range":[{"begin":31000,"end":32000}]},"type":"RANGES"}]
I0905 22:51:41.385242 5808 slave.cpp:589] Agent attributes: [ ]
I0905 22:51:41.385255 5808 slave.cpp:598] Agent hostname: ae635d85e1eb
I0905 22:51:41.385370 5791 status_update_manager.cpp:177] Pausing sending status updates
I0905 22:51:41.386493 5796 state.cpp:64] Recovering state from '/tmp/Endpoint_SlaveEndpointTest_NoAuthorizer_0_rLqJPF/meta'
I0905 22:51:41.386806 5794 status_update_manager.cpp:203] Recovering status update manager
I0905 22:51:41.386998 5800 containerizer.cpp:646] Recovering containerizer
I0905 22:51:41.388234 5795 provisioner.cpp:416] Provisioner recovery complete
I0905 22:51:41.388552 5808 slave.cpp:6296] Finished recovery
I0905 22:51:41.388919 5808 slave.cpp:6478] Querying resource estimator for oversubscribable resources
I0905 22:51:41.389124 5803 slave.cpp:6492] Received oversubscribable resources {} from the resource estimator
I0905 22:51:41.392040 5791 process.cpp:3954] Handling HTTP event for process 'slave(814)' with path: '/slave(814)/monitor/statistics'
I0905 22:51:41.393164 5796 http.cpp:1185] HTTP GET for /slave(814)/monitor/statistics from 172.17.0.7:41730
I0905 22:51:41.393241 5796 http.cpp:976] Authorizing principal 'test-principal' to GET the '/monitor/statistics' endpoint
I0905 22:51:41.395864 5808 slave.cpp:859] Agent terminating
[ OK ] Endpoint/SlaveEndpointTest.NoAuthorizer/0 (29 ms)
[ RUN ] Endpoint/SlaveEndpointTest.NoAuthorizer/1
I0905 22:51:41.408645 5772 containerizer.cpp:290] Using isolation { environment_secret, posix/cpu, posix/mem, filesystem/posix, network/cni }
W0905 22:51:41.409133 5772 backend.cpp:76] Failed to create 'aufs' backend: AufsBackend requires root privileges
W0905 22:51:41.409253 5772 backend.cpp:76] Failed to create 'bind' backend: BindBackend requires root privileges
I0905 22:51:41.409286 5772 provisioner.cpp:255] Using default backend 'copy'
I0905 22:51:41.411204 5772 cluster.cpp:448] Creating default 'local' authorizer
I0905 22:51:41.413177 5807 slave.cpp:252] Mesos agent started on (815)@172.17.0.7:33064
I0905 22:51:41.413200 5807 slave.cpp:253] Flags at startup: --acls="" --appc_simple_discovery_uri_prefix="http://" --appc_store_dir="/tmp/Endpoint_SlaveEndpointTest_NoAuthorizer_1_sGM8q9/store/appc" --authenticate_http_readonly="true" --authenticate_http_readwrite="true" --authenticatee="crammd5" --authentication_backoff_factor="1secs" --authorizer="local" --cgroups_cpu_enable_pids_and_tids_count="false" --cgroups_enable_cfs="false" --cgroups_hierarchy="/sys/fs/cgroup" --cgroups_limit_swap="false" --cgroups_root="mesos" --container_disk_watch_interval="15secs" --containerizers="mesos" --credential="/tmp/Endpoint_SlaveEndpointTest_NoAuthorizer_1_sGM8q9/credential" --default_role="*" --disallow_sharing_agent_pid_namespace="false" --disk_watch_interval="1mins" --docker="docker" --docker_kill_orphans="true" --docker_registry="https://registry-1.docker.io" --docker_remove_delay="6hrs" --docker_socket="/var/run/docker.sock" --docker_stop_timeout="0ns" --docker_store_dir="/tmp/Endpoint_SlaveEndpointTest_NoAuthorizer_1_sGM8q9/store/docker" --docker_volume_checkpoint_dir="/var/run/mesos/isolators/docker/volume" --enforce_container_disk_quota="false" --executor_registration_timeout="1mins" --executor_reregistration_timeout="2secs" --executor_shutdown_grace_period="5secs" --fetcher_cache_dir="/tmp/Endpoint_SlaveEndpointTest_NoAuthorizer_1_sGM8q9/fetch" --fetcher_cache_size="2GB" --frameworks_home="" --gc_delay="1weeks" --gc_disk_headroom="0.1" --hadoop_home="" --help="false" --hostname_lookup="true" --http_command_executor="false" --http_credentials="/tmp/Endpoint_SlaveEndpointTest_NoAuthorizer_1_sGM8q9/http_credentials" --http_heartbeat_interval="30secs" --initialize_driver_logging="true" --isolation="posix/cpu,posix/mem" --launcher="posix" --launcher_dir="/mesos/mesos-1.5.0/_build/src" --logbufsecs="0" --logging_level="INFO" --max_completed_executors_per_framework="150" --oversubscribed_resources_interval="15secs" --perf_duration="10secs" --perf_interval="1mins" --port="5051" --qos_correction_interval_min="0ns" --quiet="false" --recover="reconnect" --recovery_timeout="15mins" --registration_backoff_factor="10ms" --resources="cpus:2;gpus:0;mem:1024;disk:1024;ports:[31000-32000]" --revocable_cpu_low_priority="true" --runtime_dir="/tmp/Endpoint_SlaveEndpointTest_NoAuthorizer_1_sGM8q9" --sandbox_directory="/mnt/mesos/sandbox" --strict="true" --switch_user="true" --systemd_enable_support="true" --systemd_runtime_directory="/run/systemd/system" --version="false" --work_dir="/tmp/Endpoint_SlaveEndpointTest_NoAuthorizer_1_0EyoTf" --zk_session_timeout="10secs"
I0905 22:51:41.413666 5807 credentials.hpp:86] Loading credential for authentication from '/tmp/Endpoint_SlaveEndpointTest_NoAuthorizer_1_sGM8q9/credential'
I0905 22:51:41.413908 5807 slave.cpp:285] Agent using credential for: test-principal
I0905 22:51:41.413929 5807 credentials.hpp:37] Loading credentials for authentication from '/tmp/Endpoint_SlaveEndpointTest_NoAuthorizer_1_sGM8q9/http_credentials'
I0905 22:51:41.414209 5807 http.cpp:1045] Creating default 'basic' HTTP authenticator for realm 'mesos-agent-readonly'
I0905 22:51:41.414412 5807 http.cpp:1045] Creating default 'basic' HTTP authenticator for realm 'mesos-agent-readwrite'
I0905 22:51:41.415786 5807 slave.cpp:581] Agent resources: [{"name":"cpus","scalar":{"value":2.0},"type":"SCALAR"},{"name":"mem","scalar":{"value":1024.0},"type":"SCALAR"},{"name":"disk","scalar":{"value":1024.0},"type":"SCALAR"},{"name":"ports","ranges":{"range":[{"begin":31000,"end":32000}]},"type":"RANGES"}]
I0905 22:51:41.416005 5807 slave.cpp:589] Agent attributes: [ ]
I0905 22:51:41.416020 5807 slave.cpp:598] Agent hostname: ae635d85e1eb
I0905 22:51:41.416415 5793 status_update_manager.cpp:177] Pausing sending status updates
I0905 22:51:41.417903 5792 state.cpp:64] Recovering state from '/tmp/Endpoint_SlaveEndpointTest_NoAuthorizer_1_0EyoTf/meta'
I0905 22:51:41.418305 5806 status_update_manager.cpp:203] Recovering status update manager
I0905 22:51:41.418516 5801 containerizer.cpp:646] Recovering containerizer
I0905 22:51:41.420152 5802 provisioner.cpp:416] Provisioner recovery complete
I0905 22:51:41.420502 5803 slave.cpp:6296] Finished recovery
I0905 22:51:41.421365 5803 slave.cpp:6478] Querying resource estimator for oversubscribable resources
I0905 22:51:41.421660 5813 slave.cpp:6492] Received oversubscribable resources {} from the resource estimator
I0905 22:51:41.424741 5798 process.cpp:3954] Handling HTTP event for process 'slave(815)' with path: '/slave(815)/monitor/statistics.json'
I0905 22:51:41.426184 5792 http.cpp:1185] HTTP GET for /slave(815)/monitor/statistics.json from 172.17.0.7:41732
I0905 22:51:41.426272 5792 http.cpp:976] Authorizing principal 'test-principal' to GET the '/monitor/statistics.json' endpoint
I0905 22:51:41.429152 5803 slave.cpp:859] Agent terminating
[ OK ] Endpoint/SlaveEndpointTest.NoAuthorizer/1 (33 ms)
[ RUN ] Endpoint/SlaveEndpointTest.NoAuthorizer/2
I0905 22:51:41.440670 5772 containerizer.cpp:290] Using isolation { environment_secret, posix/cpu, posix/mem, filesystem/posix, network/cni }
W0905 22:51:41.441135 5772 backend.cpp:76] Failed to create 'aufs' backend: AufsBackend requires root privileges
W0905 22:51:41.441241 5772 backend.cpp:76] Failed to create 'bind' backend: BindBackend requires root privileges
I0905 22:51:41.441272 5772 provisioner.cpp:255] Using default backend 'copy'
I0905 22:51:41.442827 5772 cluster.cpp:448] Creating default 'local' authorizer
I0905 22:51:41.444588 5800 slave.cpp:252] Mesos agent started on (816)@172.17.0.7:33064
I0905 22:51:41.444628 5800 slave.cpp:253] Flags at startup: --acls="" --appc_simple_discovery_uri_prefix="http://" --appc_store_dir="/tmp/Endpoint_SlaveEndpointTest_NoAuthorizer_2_6IxESJ/store/appc" --authenticate_http_readonly="true" --authenticate_http_readwrite="true" --authenticatee="crammd5" --authentication_backoff_factor="1secs" --authorizer="local" --cgroups_cpu_enable_pids_and_tids_count="false" --cgroups_enable_cfs="false" --cgroups_hierarchy="/sys/fs/cgroup" --cgroups_limit_swap="false" --cgroups_root="mesos" --container_disk_watch_interval="15secs" --containerizers="mesos" --credential="/tmp/Endpoint_SlaveEndpointTest_NoAuthorizer_2_6IxESJ/credential" --default_role="*" --disallow_sharing_agent_pid_namespace="false" --disk_watch_interval="1mins" --docker="docker" --docker_kill_orphans="true" --docker_registry="https://registry-1.docker.io" --docker_remove_delay="6hrs" --docker_socket="/var/run/docker.sock" --docker_stop_timeout="0ns" --docker_store_dir="/tmp/Endpoint_SlaveEndpointTest_NoAuthorizer_2_6IxESJ/store/docker" --docker_volume_checkpoint_dir="/var/run/mesos/isolators/docker/volume" --enforce_container_disk_quota="false" --executor_registration_timeout="1mins" --executor_reregistration_timeout="2secs" --executor_shutdown_grace_period="5secs" --fetcher_cache_dir="/tmp/Endpoint_SlaveEndpointTest_NoAuthorizer_2_6IxESJ/fetch" --fetcher_cache_size="2GB" --frameworks_home="" --gc_delay="1weeks" --gc_disk_headroom="0.1" --hadoop_home="" --help="false" --hostname_lookup="true" --http_command_executor="false" --http_credentials="/tmp/Endpoint_SlaveEndpointTest_NoAuthorizer_2_6IxESJ/http_credentials" --http_heartbeat_interval="30secs" --initialize_driver_logging="true" --isolation="posix/cpu,posix/mem" --launcher="posix" --launcher_dir="/mesos/mesos-1.5.0/_build/src" --logbufsecs="0" --logging_level="INFO" --max_completed_executors_per_framework="150" --oversubscribed_resources_interval="15secs" --perf_duration="10secs" --perf_interval="1mins" --port="5051" --qos_correction_interval_min="0ns" --quiet="false" --recover="reconnect" --recovery_timeout="15mins" --registration_backoff_factor="10ms" --resources="cpus:2;gpus:0;mem:1024;disk:1024;ports:[31000-32000]" --revocable_cpu_low_priority="true" --runtime_dir="/tmp/Endpoint_SlaveEndpointTest_NoAuthorizer_2_6IxESJ" --sandbox_directory="/mnt/mesos/sandbox" --strict="true" --switch_user="true" --systemd_enable_support="true" --systemd_runtime_directory="/run/systemd/system" --version="false" --work_dir="/tmp/Endpoint_SlaveEndpointTest_NoAuthorizer_2_xj63fQ" --zk_session_timeout="10secs"
I0905 22:51:41.445183 5800 credentials.hpp:86] Loading credential for authentication from '/tmp/Endpoint_SlaveEndpointTest_NoAuthorizer_2_6IxESJ/credential'
I0905 22:51:41.445420 5800 slave.cpp:285] Agent using credential for: test-principal
I0905 22:51:41.445441 5800 credentials.hpp:37] Loading credentials for authentication from '/tmp/Endpoint_SlaveEndpointTest_NoAuthorizer_2_6IxESJ/http_credentials'
I0905 22:51:41.445694 5800 http.cpp:1045] Creating default 'basic' HTTP authenticator for realm 'mesos-agent-readonly'
I0905 22:51:41.445919 5800 http.cpp:1045] Creating default 'basic' HTTP authenticator for realm 'mesos-agent-readwrite'
I0905 22:51:41.447232 5800 slave.cpp:581] Agent resources: [{"name":"cpus","scalar":{"value":2.0},"type":"SCALAR"},{"name":"mem","scalar":{"value":1024.0},"type":"SCALAR"},{"name":"disk","scalar":{"value":1024.0},"type":"SCALAR"},{"name":"ports","ranges":{"range":[{"begin":31000,"end":32000}]},"type":"RANGES"}]
I0905 22:51:41.447445 5800 slave.cpp:589] Agent attributes: [ ]
I0905 22:51:41.447459 5800 slave.cpp:598] Agent hostname: ae635d85e1eb
I0905 22:51:41.447616 5797 status_update_manager.cpp:177] Pausing sending status updates
I0905 22:51:41.449266 5805 state.cpp:64] Recovering state from '/tmp/Endpoint_SlaveEndpointTest_NoAuthorizer_2_xj63fQ/meta'
I0905 22:51:41.449579 5802 status_update_manager.cpp:203] Recovering status update manager
I0905 22:51:41.449798 5799 containerizer.cpp:646] Recovering containerizer
I0905 22:51:41.451007 5807 provisioner.cpp:416] Provisioner recovery complete
I0905 22:51:41.451354 5800 slave.cpp:6296] Finished recovery
I0905 22:51:41.451827 5800 slave.cpp:6478] Querying resource estimator for oversubscribable resources
I0905 22:51:41.452076 5792 slave.cpp:6492] Received oversubscribable resources {} from the resource estimator
I0905 22:51:41.454193 5801 process.cpp:3954] Handling HTTP event for process 'slave(816)' with path: '/slave(816)/containers'
I0905 22:51:41.455381 5793 http.cpp:1185] HTTP GET for /slave(816)/containers from 172.17.0.7:41736
I0905 22:51:41.455469 5793 http.cpp:976] Authorizing principal 'test-principal' to GET the '/containers' endpoint
I0905 22:51:41.459203 5814 slave.cpp:859] Agent terminating
[ OK ] Endpoint/SlaveEndpointTest.NoAuthorizer/2 (28 ms)
[----------] 9 tests from Endpoint/SlaveEndpointTest (291 ms total)
[----------] 2 tests from ContainerizerType/DefaultContainerDNSFlagTest
[ RUN ] ContainerizerType/DefaultContainerDNSFlagTest.ValidateFlag/0
[ OK ] ContainerizerType/DefaultContainerDNSFlagTest.ValidateFlag/0 (9 ms)
[ RUN ] ContainerizerType/DefaultContainerDNSFlagTest.ValidateFlag/1
[ OK ] ContainerizerType/DefaultContainerDNSFlagTest.ValidateFlag/1 (8 ms)
[----------] 2 tests from ContainerizerType/DefaultContainerDNSFlagTest (17 ms total)
[----------] Global test environment tear-down
[==========] 1667 tests from 183 test cases ran. (630298 ms total)
[ PASSED ] 1663 tests.
[ FAILED ] 4 tests, listed below:
[ FAILED ] DefaultExecutorCheckTest.CommandCheckDeliveredAndReconciled
[ FAILED ] DefaultExecutorCheckTest.CommandCheckStatusChange
[ FAILED ] DefaultExecutorCheckTest.CommandCheckSeesParentsEnv
[ FAILED ] DefaultExecutorCheckTest.CommandCheckSharesWorkDirWithTask
4 FAILED TESTS
YOU HAVE 20 DISABLED TESTS
I0905 22:51:41.532594 5815 process.cpp:1072] Failed to accept socket: future discarded
make[4]: *** [check-local] Error 1
make[4]: Leaving directory `/mesos/mesos-1.5.0/_build/src'
make[3]: *** [check-am] Error 2
make[3]: Leaving directory `/mesos/mesos-1.5.0/_build/src'
make[2]: *** [check] Error 2
make[2]: Leaving directory `/mesos/mesos-1.5.0/_build/src'
make[1]: *** [check-recursive] Error 1
make[1]: Leaving directory `/mesos/mesos-1.5.0/_build'
make: *** [distcheck] Error 1
+ docker rmi mesos-1504648508-23043
Untagged: mesos-1504648508-23043:latest
Deleted: sha256:99b357c26ffad1306f03e91993f4d7c639e3bf6aba96648400456290981bed57
Deleted: sha256:847981de65d20cc054eb9c9ed2198589dd72fad43b453835b5512d9e7ab89b08
Deleted: sha256:9a42771d21828c239ae7924851a31c14f745e7fae200fbe427db0dd3d1e94ee8
Deleted: sha256:70b797e3306e9f534f5c958d78c4cea27214189ce8b82d4f2f175166e9839a8d
Deleted: sha256:590ee386bcb938cd6013efa2776e073af241f065ab0b5793df6a7fe1320d4805
Deleted: sha256:72d9f2826ce749c5ef68eafe3ee3cc95e833e2a279ef38b8ba701eb0f6276669
Deleted: sha256:b69546c830a05c55ac757c1e2f6736563775d91a7be4c4a145f4a2a68d2c59a9
Deleted: sha256:0c9a8537e843cc9eca1b0589d7975800751c19d829caa0286e64be89035734b6
Deleted: sha256:26723b0899b4dd5f8f5fee49f7a8874346d1b45e112d4e339675e2f551e541f5
Deleted: sha256:f8d69398127927498e1e088d34111797712f38daf717ea98e4c6dfecbdd6ab1a
Deleted: sha256:5dc017749617ed508f7c48f26a1578caf308268082d6c6c3b320505df521e9f4
Deleted: sha256:fd3293d1f342c1fb1e090bda5a69ee43d30363f2fdfca7897b891bacbc4c665d
Deleted: sha256:24533e22cd605e33268f608b322d7e6abeb79df56da13998613c8efeb282a065
Deleted: sha256:88817c6e01b751374d5ff2673f1cbc9feefa7eefbb21ca290c67f9f69cc9b5b7
Deleted: sha256:7f671df68a280fcc67a22ac17f7da534f473ee2745fe56f192e29fe6a7ebc3b8
Deleted: sha256:af852c0e589eebdc3494d9ebe2ff05e551af57f0a0a42838f632e0411b9a4f29
Deleted: sha256:5cf7ad8ee1dac6c4b6bb988e55567bd1abe23044ce5a0498fa32c400fc5c809a
Deleted: sha256:736005fb0e807e1461f32c2792cedcf9b7d3e2d459ad393bb29883f7e3028bed
Deleted: sha256:60a56968cf6824c7074aedea334b4de898677b3261b61229d7a5c037d2571809
Deleted: sha256:e827bf047a222c5bc246587c6bc7ac30c294166c144435978b65f4a961e68260
Deleted: sha256:7c9a93f97662d535ced97c3c57c29bd8de9bddf5a92bdff3de3516f0e2baad3f
Deleted: sha256:35195fbd8e255f5695c366bd436b26e6b559d2f269d024c36647ae2f589153a2
Deleted: sha256:8e678906430bef602d63dbfc3e58967da94d953728a427e316dd746703eaa192
Deleted: sha256:aefcda4d73c2a0e1ecff6a8561eba9798508511337c9fe9c4579532d5a85d2e1
Build step 'Execute shell' marked build as failure
Jenkins build is back to normal : Mesos-Reviewbot #19215
Posted by Apache Jenkins Server <je...@builds.apache.org>.
See <https://builds.apache.org/job/Mesos-Reviewbot/19215/display/redirect>
Build failed in Jenkins: Mesos-Reviewbot #19214
Posted by Apache Jenkins Server <je...@builds.apache.org>.
See <https://builds.apache.org/job/Mesos-Reviewbot/19214/display/redirect?page=changes>
Changes:
[yujie.jay] Moved sandbox path volume logic to the dedicated isolator.
[yujie.jay] Moved SANDBOX_PATH volume tests to the right place.
------------------------------------------
[...truncated 31.37 MB...]
I0905 23:49:52.375285 5815 slave.cpp:285] Agent using credential for: test-principal
I0905 23:49:52.375306 5815 credentials.hpp:37] Loading credentials for authentication from '/tmp/Endpoint_SlaveEndpointTest_AuthorizedRequest_2_lCgzML/http_credentials'
I0905 23:49:52.375516 5815 http.cpp:1045] Creating default 'basic' HTTP authenticator for realm 'mesos-agent-readonly'
I0905 23:49:52.375658 5815 http.cpp:1045] Creating default 'basic' HTTP authenticator for realm 'mesos-agent-readwrite'
I0905 23:49:52.377089 5815 slave.cpp:581] Agent resources: [{"name":"cpus","scalar":{"value":2.0},"type":"SCALAR"},{"name":"mem","scalar":{"value":1024.0},"type":"SCALAR"},{"name":"disk","scalar":{"value":1024.0},"type":"SCALAR"},{"name":"ports","ranges":{"range":[{"begin":31000,"end":32000}]},"type":"RANGES"}]
I0905 23:49:52.377488 5815 slave.cpp:589] Agent attributes: [ ]
I0905 23:49:52.377511 5815 slave.cpp:598] Agent hostname: c3b30bb5a8d1
I0905 23:49:52.377727 5813 status_update_manager.cpp:177] Pausing sending status updates
I0905 23:49:52.379464 5819 state.cpp:64] Recovering state from '/tmp/Endpoint_SlaveEndpointTest_AuthorizedRequest_2_H4y66E/meta'
I0905 23:49:52.379739 5806 status_update_manager.cpp:203] Recovering status update manager
I0905 23:49:52.379997 5806 containerizer.cpp:648] Recovering containerizer
I0905 23:49:52.381909 5815 provisioner.cpp:416] Provisioner recovery complete
I0905 23:49:52.382380 5823 slave.cpp:6296] Finished recovery
I0905 23:49:52.382863 5823 slave.cpp:6478] Querying resource estimator for oversubscribable resources
I0905 23:49:52.383097 5809 slave.cpp:6492] Received oversubscribable resources {} from the resource estimator
I0905 23:49:52.386332 5813 process.cpp:3954] Handling HTTP event for process 'slave(810)' with path: '/slave(810)/containers'
I0905 23:49:52.387737 5815 http.cpp:1185] HTTP GET for /slave(810)/containers from 172.17.0.7:53908
I0905 23:49:52.387858 5815 http.cpp:976] Authorizing principal 'test-principal' to GET the '/containers' endpoint
I0905 23:49:52.391885 5782 slave.cpp:859] Agent terminating
[ OK ] Endpoint/SlaveEndpointTest.AuthorizedRequest/2 (32 ms)
[ RUN ] Endpoint/SlaveEndpointTest.UnauthorizedRequest/0
I0905 23:49:52.403235 5782 containerizer.cpp:292] Using isolation { environment_secret, posix/cpu, posix/mem, filesystem/posix, network/cni }
W0905 23:49:52.403708 5782 backend.cpp:76] Failed to create 'aufs' backend: AufsBackend requires root privileges
W0905 23:49:52.403811 5782 backend.cpp:76] Failed to create 'bind' backend: BindBackend requires root privileges
I0905 23:49:52.403842 5782 provisioner.cpp:255] Using default backend 'copy'
I0905 23:49:52.408473 5818 slave.cpp:252] Mesos agent started on (811)@172.17.0.7:33636
I0905 23:49:52.408498 5818 slave.cpp:253] Flags at startup: --acls="" --appc_simple_discovery_uri_prefix="http://" --appc_store_dir="/tmp/Endpoint_SlaveEndpointTest_UnauthorizedRequest_0_b9RNIc/store/appc" --authenticate_http_readonly="true" --authenticate_http_readwrite="true" --authenticatee="crammd5" --authentication_backoff_factor="1secs" --authorizer="local" --cgroups_cpu_enable_pids_and_tids_count="false" --cgroups_enable_cfs="false" --cgroups_hierarchy="/sys/fs/cgroup" --cgroups_limit_swap="false" --cgroups_root="mesos" --container_disk_watch_interval="15secs" --containerizers="mesos" --credential="/tmp/Endpoint_SlaveEndpointTest_UnauthorizedRequest_0_b9RNIc/credential" --default_role="*" --disallow_sharing_agent_pid_namespace="false" --disk_watch_interval="1mins" --docker="docker" --docker_kill_orphans="true" --docker_registry="https://registry-1.docker.io" --docker_remove_delay="6hrs" --docker_socket="/var/run/docker.sock" --docker_stop_timeout="0ns" --docker_store_dir="/tmp/Endpoint_SlaveEndpointTest_UnauthorizedRequest_0_b9RNIc/store/docker" --docker_volume_checkpoint_dir="/var/run/mesos/isolators/docker/volume" --enforce_container_disk_quota="false" --executor_registration_timeout="1mins" --executor_reregistration_timeout="2secs" --executor_shutdown_grace_period="5secs" --fetcher_cache_dir="/tmp/Endpoint_SlaveEndpointTest_UnauthorizedRequest_0_b9RNIc/fetch" --fetcher_cache_size="2GB" --frameworks_home="" --gc_delay="1weeks" --gc_disk_headroom="0.1" --hadoop_home="" --help="false" --hostname_lookup="true" --http_command_executor="false" --http_credentials="/tmp/Endpoint_SlaveEndpointTest_UnauthorizedRequest_0_b9RNIc/http_credentials" --http_heartbeat_interval="30secs" --initialize_driver_logging="true" --isolation="posix/cpu,posix/mem" --launcher="posix" --launcher_dir="/mesos/mesos-1.5.0/_build/src" --logbufsecs="0" --logging_level="INFO" --max_completed_executors_per_framework="150" --oversubscribed_resources_interval="15secs" --perf_duration="10secs" --perf_interval="1mins" --port="5051" --qos_correction_interval_min="0ns" --quiet="false" --recover="reconnect" --recovery_timeout="15mins" --registration_backoff_factor="10ms" --resources="cpus:2;gpus:0;mem:1024;disk:1024;ports:[31000-32000]" --revocable_cpu_low_priority="true" --runtime_dir="/tmp/Endpoint_SlaveEndpointTest_UnauthorizedRequest_0_b9RNIc" --sandbox_directory="/mnt/mesos/sandbox" --strict="true" --switch_user="true" --systemd_enable_support="true" --systemd_runtime_directory="/run/systemd/system" --version="false" --work_dir="/tmp/Endpoint_SlaveEndpointTest_UnauthorizedRequest_0_BE5uY5" --zk_session_timeout="10secs"
I0905 23:49:52.408922 5818 credentials.hpp:86] Loading credential for authentication from '/tmp/Endpoint_SlaveEndpointTest_UnauthorizedRequest_0_b9RNIc/credential'
I0905 23:49:52.409056 5818 slave.cpp:285] Agent using credential for: test-principal
I0905 23:49:52.409078 5818 credentials.hpp:37] Loading credentials for authentication from '/tmp/Endpoint_SlaveEndpointTest_UnauthorizedRequest_0_b9RNIc/http_credentials'
I0905 23:49:52.409287 5818 http.cpp:1045] Creating default 'basic' HTTP authenticator for realm 'mesos-agent-readonly'
I0905 23:49:52.409430 5818 http.cpp:1045] Creating default 'basic' HTTP authenticator for realm 'mesos-agent-readwrite'
I0905 23:49:52.410708 5818 slave.cpp:581] Agent resources: [{"name":"cpus","scalar":{"value":2.0},"type":"SCALAR"},{"name":"mem","scalar":{"value":1024.0},"type":"SCALAR"},{"name":"disk","scalar":{"value":1024.0},"type":"SCALAR"},{"name":"ports","ranges":{"range":[{"begin":31000,"end":32000}]},"type":"RANGES"}]
I0905 23:49:52.410924 5818 slave.cpp:589] Agent attributes: [ ]
I0905 23:49:52.410935 5818 slave.cpp:598] Agent hostname: c3b30bb5a8d1
I0905 23:49:52.411053 5805 status_update_manager.cpp:177] Pausing sending status updates
I0905 23:49:52.412317 5808 state.cpp:64] Recovering state from '/tmp/Endpoint_SlaveEndpointTest_UnauthorizedRequest_0_BE5uY5/meta'
I0905 23:49:52.412760 5820 status_update_manager.cpp:203] Recovering status update manager
I0905 23:49:52.412948 5820 containerizer.cpp:648] Recovering containerizer
I0905 23:49:52.414378 5805 provisioner.cpp:416] Provisioner recovery complete
I0905 23:49:52.414808 5804 slave.cpp:6296] Finished recovery
I0905 23:49:52.415205 5804 slave.cpp:6478] Querying resource estimator for oversubscribable resources
I0905 23:49:52.415449 5815 slave.cpp:6492] Received oversubscribable resources {} from the resource estimator
I0905 23:49:52.418629 5816 process.cpp:3954] Handling HTTP event for process 'slave(811)' with path: '/slave(811)/monitor/statistics'
I0905 23:49:52.420100 5808 http.cpp:1185] HTTP GET for /slave(811)/monitor/statistics from 172.17.0.7:53910
I0905 23:49:52.420184 5808 http.cpp:976] Authorizing principal 'test-principal' to GET the '/monitor/statistics' endpoint
I0905 23:49:52.422574 5782 slave.cpp:859] Agent terminating
[ OK ] Endpoint/SlaveEndpointTest.UnauthorizedRequest/0 (30 ms)
[ RUN ] Endpoint/SlaveEndpointTest.UnauthorizedRequest/1
I0905 23:49:52.434267 5782 containerizer.cpp:292] Using isolation { environment_secret, posix/cpu, posix/mem, filesystem/posix, network/cni }
W0905 23:49:52.434904 5782 backend.cpp:76] Failed to create 'aufs' backend: AufsBackend requires root privileges
W0905 23:49:52.435034 5782 backend.cpp:76] Failed to create 'bind' backend: BindBackend requires root privileges
I0905 23:49:52.435081 5782 provisioner.cpp:255] Using default backend 'copy'
I0905 23:49:52.439620 5823 slave.cpp:252] Mesos agent started on (812)@172.17.0.7:33636
I0905 23:49:52.439647 5823 slave.cpp:253] Flags at startup: --acls="" --appc_simple_discovery_uri_prefix="http://" --appc_store_dir="/tmp/Endpoint_SlaveEndpointTest_UnauthorizedRequest_1_RDKzXD/store/appc" --authenticate_http_readonly="true" --authenticate_http_readwrite="true" --authenticatee="crammd5" --authentication_backoff_factor="1secs" --authorizer="local" --cgroups_cpu_enable_pids_and_tids_count="false" --cgroups_enable_cfs="false" --cgroups_hierarchy="/sys/fs/cgroup" --cgroups_limit_swap="false" --cgroups_root="mesos" --container_disk_watch_interval="15secs" --containerizers="mesos" --credential="/tmp/Endpoint_SlaveEndpointTest_UnauthorizedRequest_1_RDKzXD/credential" --default_role="*" --disallow_sharing_agent_pid_namespace="false" --disk_watch_interval="1mins" --docker="docker" --docker_kill_orphans="true" --docker_registry="https://registry-1.docker.io" --docker_remove_delay="6hrs" --docker_socket="/var/run/docker.sock" --docker_stop_timeout="0ns" --docker_store_dir="/tmp/Endpoint_SlaveEndpointTest_UnauthorizedRequest_1_RDKzXD/store/docker" --docker_volume_checkpoint_dir="/var/run/mesos/isolators/docker/volume" --enforce_container_disk_quota="false" --executor_registration_timeout="1mins" --executor_reregistration_timeout="2secs" --executor_shutdown_grace_period="5secs" --fetcher_cache_dir="/tmp/Endpoint_SlaveEndpointTest_UnauthorizedRequest_1_RDKzXD/fetch" --fetcher_cache_size="2GB" --frameworks_home="" --gc_delay="1weeks" --gc_disk_headroom="0.1" --hadoop_home="" --help="false" --hostname_lookup="true" --http_command_executor="false" --http_credentials="/tmp/Endpoint_SlaveEndpointTest_UnauthorizedRequest_1_RDKzXD/http_credentials" --http_heartbeat_interval="30secs" --initialize_driver_logging="true" --isolation="posix/cpu,posix/mem" --launcher="posix" --launcher_dir="/mesos/mesos-1.5.0/_build/src" --logbufsecs="0" --logging_level="INFO" --max_completed_executors_per_framework="150" --oversubscribed_resources_interval="15secs" --perf_duration="10secs" --perf_interval="1mins" --port="5051" --qos_correction_interval_min="0ns" --quiet="false" --recover="reconnect" --recovery_timeout="15mins" --registration_backoff_factor="10ms" --resources="cpus:2;gpus:0;mem:1024;disk:1024;ports:[31000-32000]" --revocable_cpu_low_priority="true" --runtime_dir="/tmp/Endpoint_SlaveEndpointTest_UnauthorizedRequest_1_RDKzXD" --sandbox_directory="/mnt/mesos/sandbox" --strict="true" --switch_user="true" --systemd_enable_support="true" --systemd_runtime_directory="/run/systemd/system" --version="false" --work_dir="/tmp/Endpoint_SlaveEndpointTest_UnauthorizedRequest_1_JNtH8w" --zk_session_timeout="10secs"
I0905 23:49:52.440039 5823 credentials.hpp:86] Loading credential for authentication from '/tmp/Endpoint_SlaveEndpointTest_UnauthorizedRequest_1_RDKzXD/credential'
I0905 23:49:52.440178 5823 slave.cpp:285] Agent using credential for: test-principal
I0905 23:49:52.440201 5823 credentials.hpp:37] Loading credentials for authentication from '/tmp/Endpoint_SlaveEndpointTest_UnauthorizedRequest_1_RDKzXD/http_credentials'
I0905 23:49:52.440412 5823 http.cpp:1045] Creating default 'basic' HTTP authenticator for realm 'mesos-agent-readonly'
I0905 23:49:52.440557 5823 http.cpp:1045] Creating default 'basic' HTTP authenticator for realm 'mesos-agent-readwrite'
I0905 23:49:52.441880 5823 slave.cpp:581] Agent resources: [{"name":"cpus","scalar":{"value":2.0},"type":"SCALAR"},{"name":"mem","scalar":{"value":1024.0},"type":"SCALAR"},{"name":"disk","scalar":{"value":1024.0},"type":"SCALAR"},{"name":"ports","ranges":{"range":[{"begin":31000,"end":32000}]},"type":"RANGES"}]
I0905 23:49:52.442098 5823 slave.cpp:589] Agent attributes: [ ]
I0905 23:49:52.442109 5823 slave.cpp:598] Agent hostname: c3b30bb5a8d1
I0905 23:49:52.442255 5806 status_update_manager.cpp:177] Pausing sending status updates
I0905 23:49:52.443547 5803 state.cpp:64] Recovering state from '/tmp/Endpoint_SlaveEndpointTest_UnauthorizedRequest_1_JNtH8w/meta'
I0905 23:49:52.443920 5815 status_update_manager.cpp:203] Recovering status update manager
I0905 23:49:52.444170 5810 containerizer.cpp:648] Recovering containerizer
I0905 23:49:52.445705 5806 provisioner.cpp:416] Provisioner recovery complete
I0905 23:49:52.446100 5820 slave.cpp:6296] Finished recovery
I0905 23:49:52.446470 5820 slave.cpp:6478] Querying resource estimator for oversubscribable resources
I0905 23:49:52.446715 5816 slave.cpp:6492] Received oversubscribable resources {} from the resource estimator
I0905 23:49:52.449827 5822 process.cpp:3954] Handling HTTP event for process 'slave(812)' with path: '/slave(812)/monitor/statistics.json'
I0905 23:49:52.450958 5824 http.cpp:1185] HTTP GET for /slave(812)/monitor/statistics.json from 172.17.0.7:53912
I0905 23:49:52.451021 5824 http.cpp:976] Authorizing principal 'test-principal' to GET the '/monitor/statistics.json' endpoint
I0905 23:49:52.453317 5806 slave.cpp:859] Agent terminating
[ OK ] Endpoint/SlaveEndpointTest.UnauthorizedRequest/1 (30 ms)
[ RUN ] Endpoint/SlaveEndpointTest.UnauthorizedRequest/2
I0905 23:49:52.465296 5782 containerizer.cpp:292] Using isolation { environment_secret, posix/cpu, posix/mem, filesystem/posix, network/cni }
W0905 23:49:52.465773 5782 backend.cpp:76] Failed to create 'aufs' backend: AufsBackend requires root privileges
W0905 23:49:52.465878 5782 backend.cpp:76] Failed to create 'bind' backend: BindBackend requires root privileges
I0905 23:49:52.465910 5782 provisioner.cpp:255] Using default backend 'copy'
I0905 23:49:52.469280 5805 slave.cpp:252] Mesos agent started on (813)@172.17.0.7:33636
I0905 23:49:52.469305 5805 slave.cpp:253] Flags at startup: --acls="" --appc_simple_discovery_uri_prefix="http://" --appc_store_dir="/tmp/Endpoint_SlaveEndpointTest_UnauthorizedRequest_2_DnbVu5/store/appc" --authenticate_http_readonly="true" --authenticate_http_readwrite="true" --authenticatee="crammd5" --authentication_backoff_factor="1secs" --authorizer="local" --cgroups_cpu_enable_pids_and_tids_count="false" --cgroups_enable_cfs="false" --cgroups_hierarchy="/sys/fs/cgroup" --cgroups_limit_swap="false" --cgroups_root="mesos" --container_disk_watch_interval="15secs" --containerizers="mesos" --credential="/tmp/Endpoint_SlaveEndpointTest_UnauthorizedRequest_2_DnbVu5/credential" --default_role="*" --disallow_sharing_agent_pid_namespace="false" --disk_watch_interval="1mins" --docker="docker" --docker_kill_orphans="true" --docker_registry="https://registry-1.docker.io" --docker_remove_delay="6hrs" --docker_socket="/var/run/docker.sock" --docker_stop_timeout="0ns" --docker_store_dir="/tmp/Endpoint_SlaveEndpointTest_UnauthorizedRequest_2_DnbVu5/store/docker" --docker_volume_checkpoint_dir="/var/run/mesos/isolators/docker/volume" --enforce_container_disk_quota="false" --executor_registration_timeout="1mins" --executor_reregistration_timeout="2secs" --executor_shutdown_grace_period="5secs" --fetcher_cache_dir="/tmp/Endpoint_SlaveEndpointTest_UnauthorizedRequest_2_DnbVu5/fetch" --fetcher_cache_size="2GB" --frameworks_home="" --gc_delay="1weeks" --gc_disk_headroom="0.1" --hadoop_home="" --help="false" --hostname_lookup="true" --http_command_executor="false" --http_credentials="/tmp/Endpoint_SlaveEndpointTest_UnauthorizedRequest_2_DnbVu5/http_credentials" --http_heartbeat_interval="30secs" --initialize_driver_logging="true" --isolation="posix/cpu,posix/mem" --launcher="posix" --launcher_dir="/mesos/mesos-1.5.0/_build/src" --logbufsecs="0" --logging_level="INFO" --max_completed_executors_per_framework="150" --oversubscribed_resources_interval="15secs" --perf_duration="10secs" --perf_interval="1mins" --port="5051" --qos_correction_interval_min="0ns" --quiet="false" --recover="reconnect" --recovery_timeout="15mins" --registration_backoff_factor="10ms" --resources="cpus:2;gpus:0;mem:1024;disk:1024;ports:[31000-32000]" --revocable_cpu_low_priority="true" --runtime_dir="/tmp/Endpoint_SlaveEndpointTest_UnauthorizedRequest_2_DnbVu5" --sandbox_directory="/mnt/mesos/sandbox" --strict="true" --switch_user="true" --systemd_enable_support="true" --systemd_runtime_directory="/run/systemd/system" --version="false" --work_dir="/tmp/Endpoint_SlaveEndpointTest_UnauthorizedRequest_2_f4LoBY" --zk_session_timeout="10secs"
I0905 23:49:52.469651 5805 credentials.hpp:86] Loading credential for authentication from '/tmp/Endpoint_SlaveEndpointTest_UnauthorizedRequest_2_DnbVu5/credential'
I0905 23:49:52.469782 5805 slave.cpp:285] Agent using credential for: test-principal
I0905 23:49:52.469804 5805 credentials.hpp:37] Loading credentials for authentication from '/tmp/Endpoint_SlaveEndpointTest_UnauthorizedRequest_2_DnbVu5/http_credentials'
I0905 23:49:52.470007 5805 http.cpp:1045] Creating default 'basic' HTTP authenticator for realm 'mesos-agent-readonly'
I0905 23:49:52.470144 5805 http.cpp:1045] Creating default 'basic' HTTP authenticator for realm 'mesos-agent-readwrite'
I0905 23:49:52.471397 5805 slave.cpp:581] Agent resources: [{"name":"cpus","scalar":{"value":2.0},"type":"SCALAR"},{"name":"mem","scalar":{"value":1024.0},"type":"SCALAR"},{"name":"disk","scalar":{"value":1024.0},"type":"SCALAR"},{"name":"ports","ranges":{"range":[{"begin":31000,"end":32000}]},"type":"RANGES"}]
I0905 23:49:52.471612 5805 slave.cpp:589] Agent attributes: [ ]
I0905 23:49:52.471623 5805 slave.cpp:598] Agent hostname: c3b30bb5a8d1
I0905 23:49:52.471762 5814 status_update_manager.cpp:177] Pausing sending status updates
I0905 23:49:52.473001 5811 state.cpp:64] Recovering state from '/tmp/Endpoint_SlaveEndpointTest_UnauthorizedRequest_2_f4LoBY/meta'
I0905 23:49:52.473285 5819 status_update_manager.cpp:203] Recovering status update manager
I0905 23:49:52.473516 5801 containerizer.cpp:648] Recovering containerizer
I0905 23:49:52.474812 5806 provisioner.cpp:416] Provisioner recovery complete
I0905 23:49:52.475172 5821 slave.cpp:6296] Finished recovery
I0905 23:49:52.475708 5821 slave.cpp:6478] Querying resource estimator for oversubscribable resources
I0905 23:49:52.476023 5822 slave.cpp:6492] Received oversubscribable resources {} from the resource estimator
I0905 23:49:52.479938 5824 process.cpp:3954] Handling HTTP event for process 'slave(813)' with path: '/slave(813)/containers'
I0905 23:49:52.481585 5813 http.cpp:1185] HTTP GET for /slave(813)/containers from 172.17.0.7:53914
I0905 23:49:52.481674 5813 http.cpp:976] Authorizing principal 'test-principal' to GET the '/containers' endpoint
I0905 23:49:52.484239 5819 slave.cpp:859] Agent terminating
[ OK ] Endpoint/SlaveEndpointTest.UnauthorizedRequest/2 (36 ms)
[ RUN ] Endpoint/SlaveEndpointTest.NoAuthorizer/0
I0905 23:49:52.502553 5782 containerizer.cpp:292] Using isolation { environment_secret, posix/cpu, posix/mem, filesystem/posix, network/cni }
W0905 23:49:52.503062 5782 backend.cpp:76] Failed to create 'aufs' backend: AufsBackend requires root privileges
W0905 23:49:52.503180 5782 backend.cpp:76] Failed to create 'bind' backend: BindBackend requires root privileges
I0905 23:49:52.503212 5782 provisioner.cpp:255] Using default backend 'copy'
I0905 23:49:52.504880 5782 cluster.cpp:448] Creating default 'local' authorizer
I0905 23:49:52.506862 5809 slave.cpp:252] Mesos agent started on (814)@172.17.0.7:33636
I0905 23:49:52.506888 5809 slave.cpp:253] Flags at startup: --acls="" --appc_simple_discovery_uri_prefix="http://" --appc_store_dir="/tmp/Endpoint_SlaveEndpointTest_NoAuthorizer_0_pMt6mx/store/appc" --authenticate_http_readonly="true" --authenticate_http_readwrite="true" --authenticatee="crammd5" --authentication_backoff_factor="1secs" --authorizer="local" --cgroups_cpu_enable_pids_and_tids_count="false" --cgroups_enable_cfs="false" --cgroups_hierarchy="/sys/fs/cgroup" --cgroups_limit_swap="false" --cgroups_root="mesos" --container_disk_watch_interval="15secs" --containerizers="mesos" --credential="/tmp/Endpoint_SlaveEndpointTest_NoAuthorizer_0_pMt6mx/credential" --default_role="*" --disallow_sharing_agent_pid_namespace="false" --disk_watch_interval="1mins" --docker="docker" --docker_kill_orphans="true" --docker_registry="https://registry-1.docker.io" --docker_remove_delay="6hrs" --docker_socket="/var/run/docker.sock" --docker_stop_timeout="0ns" --docker_store_dir="/tmp/Endpoint_SlaveEndpointTest_NoAuthorizer_0_pMt6mx/store/docker" --docker_volume_checkpoint_dir="/var/run/mesos/isolators/docker/volume" --enforce_container_disk_quota="false" --executor_registration_timeout="1mins" --executor_reregistration_timeout="2secs" --executor_shutdown_grace_period="5secs" --fetcher_cache_dir="/tmp/Endpoint_SlaveEndpointTest_NoAuthorizer_0_pMt6mx/fetch" --fetcher_cache_size="2GB" --frameworks_home="" --gc_delay="1weeks" --gc_disk_headroom="0.1" --hadoop_home="" --help="false" --hostname_lookup="true" --http_command_executor="false" --http_credentials="/tmp/Endpoint_SlaveEndpointTest_NoAuthorizer_0_pMt6mx/http_credentials" --http_heartbeat_interval="30secs" --initialize_driver_logging="true" --isolation="posix/cpu,posix/mem" --launcher="posix" --launcher_dir="/mesos/mesos-1.5.0/_build/src" --logbufsecs="0" --logging_level="INFO" --max_completed_executors_per_framework="150" --oversubscribed_resources_interval="15secs" --perf_duration="10secs" --perf_interval="1mins" --port="5051" --qos_correction_interval_min="0ns" --quiet="false" --recover="reconnect" --recovery_timeout="15mins" --registration_backoff_factor="10ms" --resources="cpus:2;gpus:0;mem:1024;disk:1024;ports:[31000-32000]" --revocable_cpu_low_priority="true" --runtime_dir="/tmp/Endpoint_SlaveEndpointTest_NoAuthorizer_0_pMt6mx" --sandbox_directory="/mnt/mesos/sandbox" --strict="true" --switch_user="true" --systemd_enable_support="true" --systemd_runtime_directory="/run/systemd/system" --version="false" --work_dir="/tmp/Endpoint_SlaveEndpointTest_NoAuthorizer_0_PkY4nq" --zk_session_timeout="10secs"
I0905 23:49:52.507272 5809 credentials.hpp:86] Loading credential for authentication from '/tmp/Endpoint_SlaveEndpointTest_NoAuthorizer_0_pMt6mx/credential'
I0905 23:49:52.507438 5809 slave.cpp:285] Agent using credential for: test-principal
I0905 23:49:52.507462 5809 credentials.hpp:37] Loading credentials for authentication from '/tmp/Endpoint_SlaveEndpointTest_NoAuthorizer_0_pMt6mx/http_credentials'
I0905 23:49:52.507694 5809 http.cpp:1045] Creating default 'basic' HTTP authenticator for realm 'mesos-agent-readonly'
I0905 23:49:52.507858 5809 http.cpp:1045] Creating default 'basic' HTTP authenticator for realm 'mesos-agent-readwrite'
I0905 23:49:52.509296 5809 slave.cpp:581] Agent resources: [{"name":"cpus","scalar":{"value":2.0},"type":"SCALAR"},{"name":"mem","scalar":{"value":1024.0},"type":"SCALAR"},{"name":"disk","scalar":{"value":1024.0},"type":"SCALAR"},{"name":"ports","ranges":{"range":[{"begin":31000,"end":32000}]},"type":"RANGES"}]
I0905 23:49:52.509528 5809 slave.cpp:589] Agent attributes: [ ]
I0905 23:49:52.509544 5809 slave.cpp:598] Agent hostname: c3b30bb5a8d1
I0905 23:49:52.509670 5813 status_update_manager.cpp:177] Pausing sending status updates
I0905 23:49:52.511234 5808 state.cpp:64] Recovering state from '/tmp/Endpoint_SlaveEndpointTest_NoAuthorizer_0_PkY4nq/meta'
I0905 23:49:52.511533 5808 status_update_manager.cpp:203] Recovering status update manager
I0905 23:49:52.511709 5808 containerizer.cpp:648] Recovering containerizer
I0905 23:49:52.513538 5822 provisioner.cpp:416] Provisioner recovery complete
I0905 23:49:52.513944 5804 slave.cpp:6296] Finished recovery
I0905 23:49:52.514536 5804 slave.cpp:6478] Querying resource estimator for oversubscribable resources
I0905 23:49:52.514833 5810 slave.cpp:6492] Received oversubscribable resources {} from the resource estimator
I0905 23:49:52.518211 5802 process.cpp:3954] Handling HTTP event for process 'slave(814)' with path: '/slave(814)/monitor/statistics'
I0905 23:49:52.519744 5807 http.cpp:1185] HTTP GET for /slave(814)/monitor/statistics from 172.17.0.7:53916
I0905 23:49:52.519815 5807 http.cpp:976] Authorizing principal 'test-principal' to GET the '/monitor/statistics' endpoint
I0905 23:49:52.523550 5782 slave.cpp:859] Agent terminating
[ OK ] Endpoint/SlaveEndpointTest.NoAuthorizer/0 (32 ms)
[ RUN ] Endpoint/SlaveEndpointTest.NoAuthorizer/1
I0905 23:49:52.534788 5782 containerizer.cpp:292] Using isolation { environment_secret, posix/cpu, posix/mem, filesystem/posix, network/cni }
W0905 23:49:52.535287 5782 backend.cpp:76] Failed to create 'aufs' backend: AufsBackend requires root privileges
W0905 23:49:52.535390 5782 backend.cpp:76] Failed to create 'bind' backend: BindBackend requires root privileges
I0905 23:49:52.535421 5782 provisioner.cpp:255] Using default backend 'copy'
I0905 23:49:52.536999 5782 cluster.cpp:448] Creating default 'local' authorizer
I0905 23:49:52.538838 5818 slave.cpp:252] Mesos agent started on (815)@172.17.0.7:33636
I0905 23:49:52.538895 5818 slave.cpp:253] Flags at startup: --acls="" --appc_simple_discovery_uri_prefix="http://" --appc_store_dir="/tmp/Endpoint_SlaveEndpointTest_NoAuthorizer_1_1VdzzZ/store/appc" --authenticate_http_readonly="true" --authenticate_http_readwrite="true" --authenticatee="crammd5" --authentication_backoff_factor="1secs" --authorizer="local" --cgroups_cpu_enable_pids_and_tids_count="false" --cgroups_enable_cfs="false" --cgroups_hierarchy="/sys/fs/cgroup" --cgroups_limit_swap="false" --cgroups_root="mesos" --container_disk_watch_interval="15secs" --containerizers="mesos" --credential="/tmp/Endpoint_SlaveEndpointTest_NoAuthorizer_1_1VdzzZ/credential" --default_role="*" --disallow_sharing_agent_pid_namespace="false" --disk_watch_interval="1mins" --docker="docker" --docker_kill_orphans="true" --docker_registry="https://registry-1.docker.io" --docker_remove_delay="6hrs" --docker_socket="/var/run/docker.sock" --docker_stop_timeout="0ns" --docker_store_dir="/tmp/Endpoint_SlaveEndpointTest_NoAuthorizer_1_1VdzzZ/store/docker" --docker_volume_checkpoint_dir="/var/run/mesos/isolators/docker/volume" --enforce_container_disk_quota="false" --executor_registration_timeout="1mins" --executor_reregistration_timeout="2secs" --executor_shutdown_grace_period="5secs" --fetcher_cache_dir="/tmp/Endpoint_SlaveEndpointTest_NoAuthorizer_1_1VdzzZ/fetch" --fetcher_cache_size="2GB" --frameworks_home="" --gc_delay="1weeks" --gc_disk_headroom="0.1" --hadoop_home="" --help="false" --hostname_lookup="true" --http_command_executor="false" --http_credentials="/tmp/Endpoint_SlaveEndpointTest_NoAuthorizer_1_1VdzzZ/http_credentials" --http_heartbeat_interval="30secs" --initialize_driver_logging="true" --isolation="posix/cpu,posix/mem" --launcher="posix" --launcher_dir="/mesos/mesos-1.5.0/_build/src" --logbufsecs="0" --logging_level="INFO" --max_completed_executors_per_framework="150" --oversubscribed_resources_interval="15secs" --perf_duration="10secs" --perf_interval="1mins" --port="5051" --qos_correction_interval_min="0ns" --quiet="false" --recover="reconnect" --recovery_timeout="15mins" --registration_backoff_factor="10ms" --resources="cpus:2;gpus:0;mem:1024;disk:1024;ports:[31000-32000]" --revocable_cpu_low_priority="true" --runtime_dir="/tmp/Endpoint_SlaveEndpointTest_NoAuthorizer_1_1VdzzZ" --sandbox_directory="/mnt/mesos/sandbox" --strict="true" --switch_user="true" --systemd_enable_support="true" --systemd_runtime_directory="/run/systemd/system" --version="false" --work_dir="/tmp/Endpoint_SlaveEndpointTest_NoAuthorizer_1_p1MIvS" --zk_session_timeout="10secs"
I0905 23:49:52.539471 5818 credentials.hpp:86] Loading credential for authentication from '/tmp/Endpoint_SlaveEndpointTest_NoAuthorizer_1_1VdzzZ/credential'
I0905 23:49:52.539765 5818 slave.cpp:285] Agent using credential for: test-principal
I0905 23:49:52.539789 5818 credentials.hpp:37] Loading credentials for authentication from '/tmp/Endpoint_SlaveEndpointTest_NoAuthorizer_1_1VdzzZ/http_credentials'
I0905 23:49:52.540103 5818 http.cpp:1045] Creating default 'basic' HTTP authenticator for realm 'mesos-agent-readonly'
I0905 23:49:52.540469 5818 http.cpp:1045] Creating default 'basic' HTTP authenticator for realm 'mesos-agent-readwrite'
I0905 23:49:52.542119 5818 slave.cpp:581] Agent resources: [{"name":"cpus","scalar":{"value":2.0},"type":"SCALAR"},{"name":"mem","scalar":{"value":1024.0},"type":"SCALAR"},{"name":"disk","scalar":{"value":1024.0},"type":"SCALAR"},{"name":"ports","ranges":{"range":[{"begin":31000,"end":32000}]},"type":"RANGES"}]
I0905 23:49:52.542379 5818 slave.cpp:589] Agent attributes: [ ]
I0905 23:49:52.542393 5818 slave.cpp:598] Agent hostname: c3b30bb5a8d1
I0905 23:49:52.542564 5813 status_update_manager.cpp:177] Pausing sending status updates
I0905 23:49:52.544337 5803 state.cpp:64] Recovering state from '/tmp/Endpoint_SlaveEndpointTest_NoAuthorizer_1_p1MIvS/meta'
I0905 23:49:52.544644 5823 status_update_manager.cpp:203] Recovering status update manager
I0905 23:49:52.544827 5822 containerizer.cpp:648] Recovering containerizer
I0905 23:49:52.546602 5819 provisioner.cpp:416] Provisioner recovery complete
I0905 23:49:52.546993 5815 slave.cpp:6296] Finished recovery
I0905 23:49:52.547497 5815 slave.cpp:6478] Querying resource estimator for oversubscribable resources
I0905 23:49:52.547751 5812 slave.cpp:6492] Received oversubscribable resources {} from the resource estimator
I0905 23:49:52.551306 5806 process.cpp:3954] Handling HTTP event for process 'slave(815)' with path: '/slave(815)/monitor/statistics.json'
I0905 23:49:52.553213 5810 http.cpp:1185] HTTP GET for /slave(815)/monitor/statistics.json from 172.17.0.7:53918
I0905 23:49:52.553278 5810 http.cpp:976] Authorizing principal 'test-principal' to GET the '/monitor/statistics.json' endpoint
I0905 23:49:52.557736 5782 slave.cpp:859] Agent terminating
[ OK ] Endpoint/SlaveEndpointTest.NoAuthorizer/1 (34 ms)
[ RUN ] Endpoint/SlaveEndpointTest.NoAuthorizer/2
I0905 23:49:52.568946 5782 containerizer.cpp:292] Using isolation { environment_secret, posix/cpu, posix/mem, filesystem/posix, network/cni }
W0905 23:49:52.569409 5782 backend.cpp:76] Failed to create 'aufs' backend: AufsBackend requires root privileges
W0905 23:49:52.569512 5782 backend.cpp:76] Failed to create 'bind' backend: BindBackend requires root privileges
I0905 23:49:52.569545 5782 provisioner.cpp:255] Using default backend 'copy'
I0905 23:49:52.571079 5782 cluster.cpp:448] Creating default 'local' authorizer
I0905 23:49:52.573657 5803 slave.cpp:252] Mesos agent started on (816)@172.17.0.7:33636
I0905 23:49:52.573698 5803 slave.cpp:253] Flags at startup: --acls="" --appc_simple_discovery_uri_prefix="http://" --appc_store_dir="/tmp/Endpoint_SlaveEndpointTest_NoAuthorizer_2_Jatd6r/store/appc" --authenticate_http_readonly="true" --authenticate_http_readwrite="true" --authenticatee="crammd5" --authentication_backoff_factor="1secs" --authorizer="local" --cgroups_cpu_enable_pids_and_tids_count="false" --cgroups_enable_cfs="false" --cgroups_hierarchy="/sys/fs/cgroup" --cgroups_limit_swap="false" --cgroups_root="mesos" --container_disk_watch_interval="15secs" --containerizers="mesos" --credential="/tmp/Endpoint_SlaveEndpointTest_NoAuthorizer_2_Jatd6r/credential" --default_role="*" --disallow_sharing_agent_pid_namespace="false" --disk_watch_interval="1mins" --docker="docker" --docker_kill_orphans="true" --docker_registry="https://registry-1.docker.io" --docker_remove_delay="6hrs" --docker_socket="/var/run/docker.sock" --docker_stop_timeout="0ns" --docker_store_dir="/tmp/Endpoint_SlaveEndpointTest_NoAuthorizer_2_Jatd6r/store/docker" --docker_volume_checkpoint_dir="/var/run/mesos/isolators/docker/volume" --enforce_container_disk_quota="false" --executor_registration_timeout="1mins" --executor_reregistration_timeout="2secs" --executor_shutdown_grace_period="5secs" --fetcher_cache_dir="/tmp/Endpoint_SlaveEndpointTest_NoAuthorizer_2_Jatd6r/fetch" --fetcher_cache_size="2GB" --frameworks_home="" --gc_delay="1weeks" --gc_disk_headroom="0.1" --hadoop_home="" --help="false" --hostname_lookup="true" --http_command_executor="false" --http_credentials="/tmp/Endpoint_SlaveEndpointTest_NoAuthorizer_2_Jatd6r/http_credentials" --http_heartbeat_interval="30secs" --initialize_driver_logging="true" --isolation="posix/cpu,posix/mem" --launcher="posix" --launcher_dir="/mesos/mesos-1.5.0/_build/src" --logbufsecs="0" --logging_level="INFO" --max_completed_executors_per_framework="150" --oversubscribed_resources_interval="15secs" --perf_duration="10secs" --perf_interval="1mins" --port="5051" --qos_correction_interval_min="0ns" --quiet="false" --recover="reconnect" --recovery_timeout="15mins" --registration_backoff_factor="10ms" --resources="cpus:2;gpus:0;mem:1024;disk:1024;ports:[31000-32000]" --revocable_cpu_low_priority="true" --runtime_dir="/tmp/Endpoint_SlaveEndpointTest_NoAuthorizer_2_Jatd6r" --sandbox_directory="/mnt/mesos/sandbox" --strict="true" --switch_user="true" --systemd_enable_support="true" --systemd_runtime_directory="/run/systemd/system" --version="false" --work_dir="/tmp/Endpoint_SlaveEndpointTest_NoAuthorizer_2_32nhXk" --zk_session_timeout="10secs"
I0905 23:49:52.574386 5803 credentials.hpp:86] Loading credential for authentication from '/tmp/Endpoint_SlaveEndpointTest_NoAuthorizer_2_Jatd6r/credential'
I0905 23:49:52.574615 5803 slave.cpp:285] Agent using credential for: test-principal
I0905 23:49:52.574663 5803 credentials.hpp:37] Loading credentials for authentication from '/tmp/Endpoint_SlaveEndpointTest_NoAuthorizer_2_Jatd6r/http_credentials'
I0905 23:49:52.574988 5803 http.cpp:1045] Creating default 'basic' HTTP authenticator for realm 'mesos-agent-readonly'
I0905 23:49:52.575253 5803 http.cpp:1045] Creating default 'basic' HTTP authenticator for realm 'mesos-agent-readwrite'
I0905 23:49:52.577211 5803 slave.cpp:581] Agent resources: [{"name":"cpus","scalar":{"value":2.0},"type":"SCALAR"},{"name":"mem","scalar":{"value":1024.0},"type":"SCALAR"},{"name":"disk","scalar":{"value":1024.0},"type":"SCALAR"},{"name":"ports","ranges":{"range":[{"begin":31000,"end":32000}]},"type":"RANGES"}]
I0905 23:49:52.577456 5803 slave.cpp:589] Agent attributes: [ ]
I0905 23:49:52.577469 5803 slave.cpp:598] Agent hostname: c3b30bb5a8d1
I0905 23:49:52.577659 5804 status_update_manager.cpp:177] Pausing sending status updates
I0905 23:49:52.579221 5811 state.cpp:64] Recovering state from '/tmp/Endpoint_SlaveEndpointTest_NoAuthorizer_2_32nhXk/meta'
I0905 23:49:52.579696 5809 status_update_manager.cpp:203] Recovering status update manager
I0905 23:49:52.579876 5811 containerizer.cpp:648] Recovering containerizer
I0905 23:49:52.581498 5806 provisioner.cpp:416] Provisioner recovery complete
I0905 23:49:52.581882 5819 slave.cpp:6296] Finished recovery
I0905 23:49:52.582456 5819 slave.cpp:6478] Querying resource estimator for oversubscribable resources
I0905 23:49:52.582705 5824 slave.cpp:6492] Received oversubscribable resources {} from the resource estimator
I0905 23:49:52.586105 5821 process.cpp:3954] Handling HTTP event for process 'slave(816)' with path: '/slave(816)/containers'
I0905 23:49:52.587504 5808 http.cpp:1185] HTTP GET for /slave(816)/containers from 172.17.0.7:53920
I0905 23:49:52.587574 5808 http.cpp:976] Authorizing principal 'test-principal' to GET the '/containers' endpoint
I0905 23:49:52.591765 5782 slave.cpp:859] Agent terminating
[ OK ] Endpoint/SlaveEndpointTest.NoAuthorizer/2 (35 ms)
[----------] 9 tests from Endpoint/SlaveEndpointTest (306 ms total)
[----------] 2 tests from ContainerizerType/DefaultContainerDNSFlagTest
[ RUN ] ContainerizerType/DefaultContainerDNSFlagTest.ValidateFlag/0
[ OK ] ContainerizerType/DefaultContainerDNSFlagTest.ValidateFlag/0 (11 ms)
[ RUN ] ContainerizerType/DefaultContainerDNSFlagTest.ValidateFlag/1
[ OK ] ContainerizerType/DefaultContainerDNSFlagTest.ValidateFlag/1 (10 ms)
[----------] 2 tests from ContainerizerType/DefaultContainerDNSFlagTest (21 ms total)
[----------] Global test environment tear-down
[==========] 1667 tests from 183 test cases ran. (609752 ms total)
[ PASSED ] 1663 tests.
[ FAILED ] 4 tests, listed below:
[ FAILED ] DefaultExecutorCheckTest.CommandCheckDeliveredAndReconciled
[ FAILED ] DefaultExecutorCheckTest.CommandCheckStatusChange
[ FAILED ] DefaultExecutorCheckTest.CommandCheckSeesParentsEnv
[ FAILED ] DefaultExecutorCheckTest.CommandCheckSharesWorkDirWithTask
4 FAILED TESTS
YOU HAVE 20 DISABLED TESTS
I0905 23:49:52.687180 5825 process.cpp:1072] Failed to accept socket: future discarded
make[4]: *** [check-local] Error 1
make[4]: Leaving directory `/mesos/mesos-1.5.0/_build/src'
make[3]: *** [check-am] Error 2
make[3]: Leaving directory `/mesos/mesos-1.5.0/_build/src'
make[2]: *** [check] Error 2
make[2]: Leaving directory `/mesos/mesos-1.5.0/_build/src'
make[1]: *** [check-recursive] Error 1
make[1]: Leaving directory `/mesos/mesos-1.5.0/_build'
make: *** [distcheck] Error 1
+ docker rmi mesos-1504652059-11527
Untagged: mesos-1504652059-11527:latest
Deleted: sha256:4e21b2c46e5877888b1d9c55666ccc33587e9d84692c15a47b608244e258232b
Deleted: sha256:881759f3c4f18f1909ebe66f59d08e62431264fab4cabe38c45766864e4f300c
Deleted: sha256:0090ad7195dc80b3fef6de653624cc1ebcfeca41d42fd14de44fef1c25df31b5
Deleted: sha256:1ce92e3659778f03e0f8c93ab9da15fa54b694af5ab68a1ab2542434247c80b9
Deleted: sha256:15daecec1d67803827796901bbc645dd5296669b77d8e23f6df44b4fea27e42f
Deleted: sha256:8a9e16f0d99e0dc03672402a23a962788c48df5be174056660ba14452ff34831
Deleted: sha256:fa80e64b3dd0d72b823d71b127d4cfd380e293e7a6ba7107d189512ed5ac41dc
Deleted: sha256:7b601c7e44cdde42e422446e189d6b6e343a567b898c146505bc7feb06d9a1b8
Deleted: sha256:c688737c0adfb8b978cadd63e39f9fefa703291eeecc896358d204b3681c1093
Deleted: sha256:e04102d6b18e67aa72d5f0958a46fc1795c7fb6ce3b9612d9c29dda8d1594295
Deleted: sha256:76de7c2ddb1e4bac6231195b8689d060e5a2c607d0ca2e70db52a8d3b5ec6619
Deleted: sha256:93b1bfe9747bc9af0eacceaf789bedb1641849f9ecaee9ec9ef73c4e1c7dd2d9
Deleted: sha256:5baf1fa9dfa570ec1ea3371bdc6939b9435bbbfb1a7db7da8bb20c897670f56f
Deleted: sha256:c36eb3ca597a666067d42d79c0b1453dbde9762eb358357462cbc26c1b112e89
Deleted: sha256:59ee8abefda721134511329d858b41840950ddf57966c1a94aa492a2f8cf1f87
Deleted: sha256:03aec9a8466e0b3aadc51b494656b556478ebd4619eea40ea432ba15cdcde34f
Deleted: sha256:51ad84a165b8940d57744f9bf26f83a481c20b4379fd4a60967c49c9ce0061f2
Deleted: sha256:f6f7661ff7d63b98003fa4df0ec88fe9976e779092597e1e12ba12f66ce400ca
Deleted: sha256:01254eaf86b92a73d8d0f17f4d74976cd0ce8f1c4e453291357efbc9c618da87
Deleted: sha256:f63dad15a4f23bcda54e3bca551c52ce6266de5fd3206d8dbd1d391b3dd158d2
Deleted: sha256:c611c5464434b1f444a2a911df337305d8d72d8f70ed24386411268a36c7c3e0
Deleted: sha256:3831c7783c2c11085f60dc3ff3525f581d78ca9fa1226137bed302a70b13efc0
Deleted: sha256:4cb310b84f295fa522efd302af2560873053bd6ab35dd9cb37d406b822915bfd
Deleted: sha256:f7467a9677e9bff92e8cd632bb921ad1a8ffc2914e5e12583366e4d87afb5b94
Build step 'Execute shell' marked build as failure