You are viewing a plain text version of this content. The canonical link for it is here.
Posted to builds@beam.apache.org by Apache Jenkins Server <je...@builds.apache.org> on 2021/03/05 13:40:30 UTC
beam_PostCommit_Py_ValCont - Build # 7515 - Aborted!
beam_PostCommit_Py_ValCont - Build # 7515 - Aborted:
Check console output at https://ci-beam.apache.org/job/beam_PostCommit_Py_ValCont/7515/ to view the results.
Jenkins build is back to normal : beam_PostCommit_Py_ValCont #7518
Posted by Apache Jenkins Server <je...@builds.apache.org>.
See <https://ci-beam.apache.org/job/beam_PostCommit_Py_ValCont/7518/display/redirect>
---------------------------------------------------------------------
To unsubscribe, e-mail: builds-unsubscribe@beam.apache.org
For additional commands, e-mail: builds-help@beam.apache.org
Build failed in Jenkins: beam_PostCommit_Py_ValCont #7517
Posted by Apache Jenkins Server <je...@builds.apache.org>.
See <https://ci-beam.apache.org/job/beam_PostCommit_Py_ValCont/7517/display/redirect?page=changes>
Changes:
[sychen] Remove experiement --enable_streaming_auto_sharding
[Boyuan Zhang] Add topic and subscription overridden field into pubsub proto.
[heejong] [BEAM-11924] Add Java TextIO.read() to TestExpansionService
[noreply] [BEAM-11748] Fix PViewToIdMapper in Samza runner to not include hashcode
[noreply] Bump pandas version to 1.2.3 in python container (#14157)
[noreply] Increase the timeout for ValidatesContainer suite (#14151)
------------------------------------------
Started by timer
Running as SYSTEM
[EnvInject] - Loading node environment variables.
Building remotely on apache-beam-jenkins-14 (beam) in workspace <https://ci-beam.apache.org/job/beam_PostCommit_Py_ValCont/ws/>
No credentials specified
Wiping out workspace first.
Cloning the remote Git repository
Cloning repository https://github.com/apache/beam.git
> git init <https://ci-beam.apache.org/job/beam_PostCommit_Py_ValCont/ws/src> # timeout=10
Fetching upstream changes from https://github.com/apache/beam.git
> git --version # timeout=10
> git fetch --tags --progress https://github.com/apache/beam.git +refs/heads/*:refs/remotes/origin/* # timeout=10
> git config remote.origin.url https://github.com/apache/beam.git # timeout=10
> git config --add remote.origin.fetch +refs/heads/*:refs/remotes/origin/* # timeout=10
> git config remote.origin.url https://github.com/apache/beam.git # timeout=10
Fetching upstream changes from https://github.com/apache/beam.git
> git fetch --tags --progress https://github.com/apache/beam.git +refs/heads/*:refs/remotes/origin/* +refs/pull/${ghprbPullId}/*:refs/remotes/origin/pr/${ghprbPullId}/* # timeout=10
> git rev-parse origin/master^{commit} # timeout=10
Checking out Revision 33d59b34bcf789f196e23d259ca52d2fa057d3a8 (origin/master)
> git config core.sparsecheckout # timeout=10
> git checkout -f 33d59b34bcf789f196e23d259ca52d2fa057d3a8 # timeout=10
Commit message: "Increase the timeout for ValidatesContainer suite (#14151)"
> git rev-list --no-walk adf85a1fa18cb45fd14fe2537e26bac69b158f87 # timeout=10
No emails were triggered.
[EnvInject] - Executing scripts and injecting environment variables after the SCM step.
[EnvInject] - Injecting as environment variables the properties content
SPARK_LOCAL_IP=127.0.0.1
SETUPTOOLS_USE_DISTUTILS=stdlib
[EnvInject] - Variables injected successfully.
[Gradle] - Launching build.
[src] $ <https://ci-beam.apache.org/job/beam_PostCommit_Py_ValCont/ws/src/gradlew> --continue --max-workers=12 -Dorg.gradle.jvmargs=-Xms2g -Dorg.gradle.jvmargs=-Xmx4g -Pdocker-pull-licenses :sdks:python:test-suites:dataflow:validatesContainerTests
Starting a Gradle Daemon (subsequent builds will be faster)
> Task :buildSrc:compileJava NO-SOURCE
> Task :buildSrc:compileGroovy FROM-CACHE
> Task :buildSrc:pluginDescriptors
> Task :buildSrc:processResources
> Task :buildSrc:classes
> Task :buildSrc:jar
> Task :buildSrc:assemble
> Task :buildSrc:spotlessGroovy FROM-CACHE
> Task :buildSrc:spotlessGroovyCheck UP-TO-DATE
> Task :buildSrc:spotlessGroovyGradle FROM-CACHE
> Task :buildSrc:spotlessGroovyGradleCheck UP-TO-DATE
> Task :buildSrc:spotlessCheck UP-TO-DATE
> Task :buildSrc:pluginUnderTestMetadata
> Task :buildSrc:compileTestJava NO-SOURCE
> Task :buildSrc:compileTestGroovy NO-SOURCE
> Task :buildSrc:processTestResources NO-SOURCE
> Task :buildSrc:testClasses UP-TO-DATE
> Task :buildSrc:test NO-SOURCE
> Task :buildSrc:validatePlugins FROM-CACHE
> Task :buildSrc:check UP-TO-DATE
> Task :buildSrc:build
Configuration on demand is an incubating feature.
FAILURE: Build failed with an exception.
* What went wrong:
Task 'validatesContainerTests' not found in project ':sdks:python:test-suites:dataflow'.
* Try:
Run gradlew tasks to get a list of available tasks. Run with --stacktrace option to get the stack trace. Run with --info or --debug option to get more log output. Run with --scan to get full insights.
* Get more help at https://help.gradle.org
Deprecated Gradle features were used in this build, making it incompatible with Gradle 7.0.
Use '--warning-mode all' to show the individual deprecation warnings.
See https://docs.gradle.org/6.8/userguide/command_line_interface.html#sec:command_line_warnings
BUILD FAILED in 19s
Publishing build scan...
https://gradle.com/s/j4l4d5juk676s
Build step 'Invoke Gradle script' changed build result to FAILURE
Build step 'Invoke Gradle script' marked build as failure
---------------------------------------------------------------------
To unsubscribe, e-mail: builds-unsubscribe@beam.apache.org
For additional commands, e-mail: builds-help@beam.apache.org
beam_PostCommit_Py_ValCont - Build # 7516 - Aborted!
Posted by Apache Jenkins Server <je...@builds.apache.org>.
beam_PostCommit_Py_ValCont - Build # 7516 - Aborted:
Check console output at https://ci-beam.apache.org/job/beam_PostCommit_Py_ValCont/7516/ to view the results.