You are viewing a plain text version of this content. The canonical link for it is here.
Posted to builds@beam.apache.org by Apache Jenkins Server <je...@builds.apache.org> on 2022/09/13 23:16:20 UTC

Build failed in Jenkins: beam_PostCommit_XVR_Direct #3136

See <https://ci-beam.apache.org/job/beam_PostCommit_XVR_Direct/3136/display/redirect?page=changes>

Changes:

[noreply] Pin the version of cloudpickle to 2.1.x (#23120)

[noreply] Add streaming test for Write API sink (#21903)

[noreply] [Go SDK] Proto changes for timer param (#23216)

[noreply] Bump github.com/testcontainers/testcontainers-go in /sdks (#23201)

[noreply] Update to objsize to 0.5.2 which is under BSD-3 license (fixes #23096)

[noreply] Exclude insignificant whitespace from cloud object (#23217)

[noreply] Trying out property-based tests for Beam python coders (#22233)


------------------------------------------
[...truncated 160.33 KB...]
     ━━━━━━━━━━━━━━━━━━━━━━━━━━━━━━━━━━━━━━━━ 2.0/2.0 MB 27.4 MB/s eta 0:00:00
Requirement already satisfied: setuptools in /usr/local/lib/python3.7/site-packages (57.5.0)
Collecting setuptools
  Downloading setuptools-65.3.0-py3-none-any.whl (1.2 MB)
     ━━━━━━━━━━━━━━━━━━━━━━━━━━━━━━━━━━━━━━━━ 1.2/1.2 MB 59.6 MB/s eta 0:00:00
Installing collected packages: setuptools, pip
  Attempting uninstall: setuptools
    Found existing installation: setuptools 57.5.0
    Uninstalling setuptools-57.5.0:
      Successfully uninstalled setuptools-57.5.0
  Attempting uninstall: pip
    Found existing installation: pip 22.0.4
    Uninstalling pip-22.0.4:
      Successfully uninstalled pip-22.0.4
Successfully installed pip-22.2.2 setuptools-65.3.0
WARNING: Running pip as the 'root' user can result in broken permissions and conflicting behaviour with the system package manager. It is recommended to use a virtual environment instead: https://pip.pypa.io/warnings/venv
Removing intermediate container 3df797e42359
 ---> 28a1f3e9799c
Step 8/32 : ENV CLOUDSDK_CORE_DISABLE_PROMPTS yes
 ---> Running in b782f8c516c5
Removing intermediate container b782f8c516c5
 ---> 0d8292705c2a
Step 9/32 : ENV PATH $PATH:/usr/local/gcloud/google-cloud-sdk/bin
 ---> Running in 76319a388745
Removing intermediate container 76319a388745
 ---> 9c757eba8531
Step 10/32 : RUN mkdir -p /usr/local/gcloud &&     cd /usr/local/gcloud &&     curl -s -O https://dl.google.com/dl/cloudsdk/release/google-cloud-sdk.tar.gz &&     tar -xf google-cloud-sdk.tar.gz &&     /usr/local/gcloud/google-cloud-sdk/install.sh &&     rm google-cloud-sdk.tar.gz
 ---> Running in 6c38330a2965
Welcome to the Google Cloud CLI!
WARNING: You appear to be running this script as root. This may cause 
the installation to be inaccessible to users other than the root user.
Beginning update. This process may take several minutes.


Your current Google Cloud CLI version is: 402.0.0
Installing components from version: 402.0.0

┌─────────────────────────────────────────────────────────────────────────────┐
│                     These components will be installed.                     │
├─────────────────────────────────────────────────────┬────────────┬──────────┤
│                         Name                        │  Version   │   Size   │
├─────────────────────────────────────────────────────┼────────────┼──────────┤
│ BigQuery Command Line Tool                          │     2.0.75 │  1.6 MiB │
│ BigQuery Command Line Tool (Platform Specific)      │     2.0.75 │  < 1 MiB │
│ Cloud Storage Command Line Tool                     │       5.13 │ 15.5 MiB │
│ Cloud Storage Command Line Tool (Platform Specific) │       5.11 │  < 1 MiB │
│ Google Cloud CLI Core Libraries (Platform Specific) │ 2022.08.05 │  < 1 MiB │
│ Google Cloud CRC32C Hash Tool                       │      1.0.0 │  1.2 MiB │
│ anthoscli                                           │     0.2.29 │ 37.6 MiB │
│ gcloud cli dependencies                             │ 2021.04.16 │  < 1 MiB │
└─────────────────────────────────────────────────────┴────────────┴──────────┘

For the latest full release notes, please visit:
  https://cloud.google.com/sdk/release_notes

╔════════════════════════════════════════════════════════════╗
╠═ Creating update staging area                             ═╣
╚════════════════════════════════════════════════════════════╝
╔════════════════════════════════════════════════════════════╗
╠═ Installing: BigQuery Command Line Tool                   ═╣
╚════════════════════════════════════════════════════════════╝
╔════════════════════════════════════════════════════════════╗
╠═ Installing: BigQuery Command Line Tool (Platform Spec... ═╣
╚════════════════════════════════════════════════════════════╝
╔════════════════════════════════════════════════════════════╗
╠═ Installing: Cloud Storage Command Line Tool              ═╣
╚════════════════════════════════════════════════════════════╝
╔════════════════════════════════════════════════════════════╗
╠═ Installing: Cloud Storage Command Line Tool (Platform... ═╣
╚════════════════════════════════════════════════════════════╝
╔════════════════════════════════════════════════════════════╗
╠═ Installing: Default set of gcloud commands               ═╣
╚════════════════════════════════════════════════════════════╝
╔════════════════════════════════════════════════════════════╗
╠═ Installing: Google Cloud CLI Core Libraries (Platform... ═╣
╚════════════════════════════════════════════════════════════╝
╔════════════════════════════════════════════════════════════╗
╠═ Installing: Google Cloud CRC32C Hash Tool                ═╣
╚════════════════════════════════════════════════════════════╝
╔════════════════════════════════════════════════════════════╗
╠═ Installing: Google Cloud CRC32C Hash Tool                ═╣
╚════════════════════════════════════════════════════════════╝
╔════════════════════════════════════════════════════════════╗
╠═ Installing: anthoscli                                    ═╣
╚════════════════════════════════════════════════════════════╝
╔════════════════════════════════════════════════════════════╗
╠═ Installing: anthoscli                                    ═╣
╚════════════════════════════════════════════════════════════╝
╔════════════════════════════════════════════════════════════╗
╠═ Installing: gcloud cli dependencies                      ═╣
╚════════════════════════════════════════════════════════════╝
╔════════════════════════════════════════════════════════════╗
╠═ Creating backup and activating new installation          ═╣
╚════════════════════════════════════════════════════════════╝

Performing post processing steps...
..................................................................................................done.

Update done!


To help improve the quality of this product, we collect anonymized usage data
and anonymized stacktraces when crashes are encountered; additional information
is available at <https://cloud.google.com/sdk/usage-statistics>. This data is
handled in accordance with our privacy policy
<https://cloud.google.com/terms/cloud-privacy-notice>. You may choose to opt in this
collection now (by choosing 'Y' at the below prompt), or at any time in the
future by running the following command:

    gcloud config set disable_usage_reporting false


This will install all the core command line tools necessary for working with
the Google Cloud Platform.

==> Source [/usr/local/gcloud/google-cloud-sdk/completion.bash.inc] in your profile to enable shell command completion for gcloud.
==> Source [/usr/local/gcloud/google-cloud-sdk/path.bash.inc] in your profile to add the Google Cloud SDK command line tools to your $PATH.

For more information on how to get started, please visit:
  https://cloud.google.com/sdk/docs/quickstarts


Removing intermediate container 6c38330a2965
 ---> cbad7136cacc
Step 11/32 : RUN ln -s /usr/bin/ccache /usr/local/bin/gcc
 ---> Running in ec374e8e36e2
Removing intermediate container ec374e8e36e2
 ---> f7da64ee2157
Step 12/32 : RUN ccache --set-config=sloppiness=file_macro && ccache --set-config=hash_dir=false
 ---> Running in be129ac0b3b3
Removing intermediate container be129ac0b3b3
 ---> 633a74643f0b
Step 13/32 : COPY target/apache-beam.tar.gz /opt/apache/beam/tars/
 ---> 75bb47288d72
Step 14/32 : RUN pip install --no-deps -v /opt/apache/beam/tars/apache-beam.tar.gz[gcp]
 ---> Running in 546b2b64aec8
Using pip 22.2.2 from /usr/local/lib/python3.7/site-packages/pip (python 3.7)
Processing /opt/apache/beam/tars/apache-beam.tar.gz
  Preparing metadata (setup.py): started
  Running command python setup.py egg_info
  Traceback (most recent call last):
    File "<string>", line 36, in <module>
    File "<pip-setuptools-caller>", line 34, in <module>
    File "/tmp/pip-req-build-xtyvsk9s/setup.py", line 169, in <module>
      generate_protos_first()
    File "/tmp/pip-req-build-xtyvsk9s/setup.py", line 139, in generate_protos_first
      gen_protos.generate_proto_files()
    File "/tmp/pip-req-build-xtyvsk9s/gen_protos.py", line 476, in generate_proto_files
      raise RuntimeError(error_msg)
  RuntimeError: Not in apache git tree, unable to find proto definitions.
  error: subprocess-exited-with-error
  
  × python setup.py egg_info did not run successfully.
  │ exit code: 1
  ╰─> See above for output.
  
  note: This error originates from a subprocess, and is likely not a problem with pip.
  full command: /usr/local/bin/python -c '
  exec(compile('"'"''"'"''"'"'
  # This is <pip-setuptools-caller> -- a caller that pip uses to run setup.py
  #
  # - It imports setuptools before invoking setup.py, to enable projects that directly
  #   import from `distutils.core` to work with newer packaging standards.
  # - It provides a clear error message when setuptools is not installed.
  # - It sets `sys.argv[0]` to the underlying `setup.py`, when invoking `setup.py` so
  #   setuptools doesn'"'"'t think the script is `-c`. This avoids the following warning:
  #     manifest_maker: standard file '"'"'-c'"'"' not found".
  # - It generates a shim setup.py, for handling setup.cfg-only projects.
  import os, sys, tokenize
  
  try:
      import setuptools
  except ImportError as error:
      print(
          "ERROR: Can not execute `setup.py` since setuptools is not available in "
          "the build environment.",
          file=sys.stderr,
      )
      sys.exit(1)
  
  __file__ = %r
  sys.argv[0] = __file__
  
  if os.path.exists(__file__):
      filename = __file__
      with tokenize.open(__file__) as f:
          setup_py_code = f.read()
  else:
      filename = "<auto-generated setuptools caller>"
      setup_py_code = "from setuptools import setup; setup()"
  
  exec(compile(setup_py_code, filename, "exec"))
  '"'"''"'"''"'"' % ('"'"'/tmp/pip-req-build-xtyvsk9s/setup.py'"'"',), "<pip-setuptools-caller>", "exec"))' egg_info --egg-base /tmp/pip-pip-egg-info-7_s4chfn
  cwd: /tmp/pip-req-build-xtyvsk9s/
  Preparing metadata (setup.py): finished with status 'error'
error: metadata-generation-failed

× Encountered error while generating package metadata.
╰─> See above for output.

note: This is an issue with the package mentioned above, not pip.
hint: See above for details.
The command '/bin/sh -c pip install --no-deps -v /opt/apache/beam/tars/apache-beam.tar.gz[gcp]' returned a non-zero code: 1

> Task :sdks:python:container:py37:docker FAILED

FAILURE: Build completed with 2 failures.

1: Task failed with an exception.
-----------
* What went wrong:
Execution failed for task ':sdks:python:installGcpTest'.
> Process 'command 'sh'' finished with non-zero exit value 1

* Try:
> Run with --stacktrace option to get the stack trace.
> Run with --info or --debug option to get more log output.
==============================================================================

2: Task failed with an exception.
-----------
* What went wrong:
Execution failed for task ':sdks:python:container:py37:docker'.
> Process 'command 'docker'' finished with non-zero exit value 1

* Try:
> Run with --stacktrace option to get the stack trace.
> Run with --info or --debug option to get more log output.
==============================================================================

* Get more help at https://help.gradle.org

Deprecated Gradle features were used in this build, making it incompatible with Gradle 8.0.

You can use '--warning-mode all' to show the individual deprecation warnings and determine if they come from your own scripts or plugins.

See https://docs.gradle.org/7.5.1/userguide/command_line_interface.html#sec:command_line_warnings

Execution optimizations have been disabled for 1 invalid unit(s) of work during this build to ensure correctness.
Please consult deprecation warnings for more details.

BUILD FAILED in 5m 52s
239 actionable tasks: 155 executed, 72 from cache, 12 up-to-date

Publishing build scan...
https://gradle.com/s/te7pes6zqmwkg

Build step 'Invoke Gradle script' changed build result to FAILURE
Build step 'Invoke Gradle script' marked build as failure

---------------------------------------------------------------------
To unsubscribe, e-mail: builds-unsubscribe@beam.apache.org
For additional commands, e-mail: builds-help@beam.apache.org


Jenkins build is back to normal : beam_PostCommit_XVR_Direct #3139

Posted by Apache Jenkins Server <je...@builds.apache.org>.
See <https://ci-beam.apache.org/job/beam_PostCommit_XVR_Direct/3139/display/redirect?page=changes>


---------------------------------------------------------------------
To unsubscribe, e-mail: builds-unsubscribe@beam.apache.org
For additional commands, e-mail: builds-help@beam.apache.org


Build failed in Jenkins: beam_PostCommit_XVR_Direct #3138

Posted by Apache Jenkins Server <je...@builds.apache.org>.
See <https://ci-beam.apache.org/job/beam_PostCommit_XVR_Direct/3138/display/redirect?page=changes>

Changes:

[noreply] Publish results of JMH benchmark runs (Java SDK) to InfluxDB (part of


------------------------------------------
[...truncated 137.38 KB...]
Collecting mock==2.0.0
  Downloading mock-2.0.0-py2.py3-none-any.whl (56 kB)
     ━━━━━━━━━━━━━━━━━━━━━━━━━━━━━━━━━━━━━━━━ 56.8/56.8 KB 8.1 MB/s eta 0:00:00
Collecting nltk==3.7
  Downloading nltk-3.7-py3-none-any.whl (1.5 MB)
     ━━━━━━━━━━━━━━━━━━━━━━━━━━━━━━━━━━━━━━━━ 1.5/1.5 MB 54.5 MB/s eta 0:00:00
Collecting nose==1.3.7
  Downloading nose-1.3.7-py3-none-any.whl (154 kB)
     ━━━━━━━━━━━━━━━━━━━━━━━━━━━━━━━━━━━━━━ 154.7/154.7 KB 19.3 MB/s eta 0:00:00
Collecting numpy==1.21.6
  Downloading numpy-1.21.6-cp37-cp37m-manylinux_2_12_x86_64.manylinux2010_x86_64.whl (15.7 MB)
     ━━━━━━━━━━━━━━━━━━━━━━━━━━━━━━━━━━━━━━━━ 15.7/15.7 MB 24.8 MB/s eta 0:00:00
Collecting oauth2client==4.1.3
  Downloading oauth2client-4.1.3-py2.py3-none-any.whl (98 kB)
     ━━━━━━━━━━━━━━━━━━━━━━━━━━━━━━━━━━━━━━━━ 98.2/98.2 KB 11.4 MB/s eta 0:00:00
Collecting oauthlib==3.2.0
  Downloading oauthlib-3.2.0-py3-none-any.whl (151 kB)
     ━━━━━━━━━━━━━━━━━━━━━━━━━━━━━━━━━━━━━━━ 151.5/151.5 KB 7.3 MB/s eta 0:00:00
Collecting objsize==0.5.2
  Downloading objsize-0.5.2-py3-none-any.whl (8.2 kB)
Collecting opt-einsum==3.3.0
  Downloading opt_einsum-3.3.0-py3-none-any.whl (65 kB)
     ━━━━━━━━━━━━━━━━━━━━━━━━━━━━━━━━━━━━━━━━ 65.5/65.5 KB 9.6 MB/s eta 0:00:00

> Task :sdks:java:extensions:sql:expansion-service:shadowJar

> Task :sdks:java:container:java8:docker
 ---> 301612c33fa3
Step 12/21 : COPY target/LICENSE /opt/apache/beam/
 ---> 3c44b68e0780
Step 13/21 : COPY target/NOTICE /opt/apache/beam/
 ---> 0a092ad22ddb
Step 14/21 : ADD target/third_party_licenses /opt/apache/beam/third_party_licenses/
 ---> 0bffba7aeff3
Step 15/21 : COPY target/LICENSE target/options/* /opt/apache/beam/options/
 ---> 4efb70d8a113
Step 16/21 : RUN rm /opt/apache/beam/options/LICENSE
 ---> Running in 70cd1cbeaa33
Removing intermediate container 70cd1cbeaa33
 ---> 8acbe69bbc22
Step 17/21 : COPY target/LICENSE target/go-licenses/* /opt/apache/beam/third_party_licenses/golang/
 ---> f07bbfde6a6d
Step 18/21 : RUN rm /opt/apache/beam/third_party_licenses/golang/LICENSE
 ---> Running in ac9c1f66aa79
Removing intermediate container ac9c1f66aa79
 ---> 0677af9269ed
Step 19/21 : RUN if [ "${pull_licenses}" = "false" ] ; then     rm -rf /opt/apache/beam/third_party_licenses ;    fi
 ---> Running in 773f49c2fb66
Removing intermediate container 773f49c2fb66
 ---> 35461bdab94b
Step 20/21 : COPY target/profiler/* /opt/google_cloud_profiler/
 ---> 45bc502a03e1
Step 21/21 : ENTRYPOINT ["/opt/apache/beam/boot"]
 ---> Running in e997f8d916fd
Removing intermediate container e997f8d916fd
 ---> 7bff25f169e9
Successfully built 7bff25f169e9
Successfully tagged apache/beam_java8_sdk:2.43.0.dev

> Task :sdks:python:container:py37:docker
Collecting orjson==3.7.11
  Downloading orjson-3.7.11-cp37-cp37m-manylinux_2_28_x86_64.whl (148 kB)
     ━━━━━━━━━━━━━━━━━━━━━━━━━━━━━━━━━━━━━━ 148.1/148.1 KB 20.5 MB/s eta 0:00:00
Collecting overrides==6.1.0
  Downloading overrides-6.1.0-py3-none-any.whl (14 kB)
Collecting packaging==21.3
  Downloading packaging-21.3-py3-none-any.whl (40 kB)
     ━━━━━━━━━━━━━━━━━━━━━━━━━━━━━━━━━━━━━━━━ 40.8/40.8 KB 4.9 MB/s eta 0:00:00
Collecting pandas==1.3.5
  Downloading pandas-1.3.5-cp37-cp37m-manylinux_2_17_x86_64.manylinux2014_x86_64.whl (11.3 MB)
     ━━━━━━━━━━━━━━━━━━━━━━━━━━━━━━━━━━━━━━━━ 11.3/11.3 MB 77.1 MB/s eta 0:00:00
Collecting parameterized==0.8.1
  Downloading parameterized-0.8.1-py2.py3-none-any.whl (26 kB)
Collecting pbr==5.9.0
  Downloading pbr-5.9.0-py2.py3-none-any.whl (112 kB)
     ━━━━━━━━━━━━━━━━━━━━━━━━━━━━━━━━━━━━━━━ 112.3/112.3 KB 1.5 MB/s eta 0:00:00
Collecting pluggy==1.0.0
  Downloading pluggy-1.0.0-py2.py3-none-any.whl (13 kB)
Collecting proto-plus==1.20.6
  Downloading proto_plus-1.20.6-py3-none-any.whl (46 kB)
     ━━━━━━━━━━━━━━━━━━━━━━━━━━━━━━━━━━━━━━━━ 46.4/46.4 KB 5.4 MB/s eta 0:00:00
Collecting protobuf==3.19.4
  Downloading protobuf-3.19.4-cp37-cp37m-manylinux_2_17_x86_64.manylinux2014_x86_64.whl (1.1 MB)
     ━━━━━━━━━━━━━━━━━━━━━━━━━━━━━━━━━━━━━━━━ 1.1/1.1 MB 49.4 MB/s eta 0:00:00
Collecting psycopg2-binary==2.9.3
  Downloading psycopg2_binary-2.9.3-cp37-cp37m-manylinux_2_17_x86_64.manylinux2014_x86_64.whl (3.0 MB)

> Task :sdks:java:io:google-cloud-platform:expansion-service:shadowJar

> Task :sdks:python:container:py37:docker
     ━━━━━━━━━━━━━━━━━━━━━━━━━━━━━━━━━━━━━━━━ 3.0/3.0 MB 78.3 MB/s eta 0:00:00
Collecting py==1.11.0
  Downloading py-1.11.0-py2.py3-none-any.whl (98 kB)
     ━━━━━━━━━━━━━━━━━━━━━━━━━━━━━━━━━━━━━━━━ 98.7/98.7 KB 15.7 MB/s eta 0:00:00
Collecting pyarrow==7.0.0
  Downloading pyarrow-7.0.0-cp37-cp37m-manylinux_2_17_x86_64.manylinux2014_x86_64.whl (26.7 MB)
     ━━━━━━━━━━━━━━━━━━━━━━━━━━━━━━━━━━━━━━━━ 26.7/26.7 MB 49.1 MB/s eta 0:00:00
Collecting pyasn1==0.4.8
  Downloading pyasn1-0.4.8-py2.py3-none-any.whl (77 kB)
     ━━━━━━━━━━━━━━━━━━━━━━━━━━━━━━━━━━━━━━━━ 77.1/77.1 KB 11.7 MB/s eta 0:00:00
Collecting pyasn1-modules==0.2.8
  Downloading pyasn1_modules-0.2.8-py2.py3-none-any.whl (155 kB)
     ━━━━━━━━━━━━━━━━━━━━━━━━━━━━━━━━━━━━━━ 155.3/155.3 KB 12.3 MB/s eta 0:00:00
Collecting pycparser==2.21
  Downloading pycparser-2.21-py2.py3-none-any.whl (118 kB)
     ━━━━━━━━━━━━━━━━━━━━━━━━━━━━━━━━━━━━━━ 118.7/118.7 KB 17.0 MB/s eta 0:00:00
Collecting pydot==1.4.2
  Downloading pydot-1.4.2-py2.py3-none-any.whl (21 kB)
Collecting PyHamcrest==1.10.1
  Downloading PyHamcrest-1.10.1-py3-none-any.whl (48 kB)
     ━━━━━━━━━━━━━━━━━━━━━━━━━━━━━━━━━━━━━━━━ 48.9/48.9 KB 7.5 MB/s eta 0:00:00
Collecting pymongo==3.12.3
  Downloading pymongo-3.12.3-cp37-cp37m-manylinux_2_17_x86_64.manylinux2014_x86_64.whl (508 kB)
     ━━━━━━━━━━━━━━━━━━━━━━━━━━━━━━━━━━━━━━ 508.1/508.1 KB 36.8 MB/s eta 0:00:00
Collecting PyMySQL==1.0.2
  Downloading PyMySQL-1.0.2-py3-none-any.whl (43 kB)
     ━━━━━━━━━━━━━━━━━━━━━━━━━━━━━━━━━━━━━━━━ 43.8/43.8 KB 6.4 MB/s eta 0:00:00
Collecting pyparsing==3.0.9
  Downloading pyparsing-3.0.9-py3-none-any.whl (98 kB)
     ━━━━━━━━━━━━━━━━━━━━━━━━━━━━━━━━━━━━━━━━ 98.3/98.3 KB 13.6 MB/s eta 0:00:00
Collecting pytest==7.1.2
  Downloading pytest-7.1.2-py3-none-any.whl (297 kB)
     ━━━━━━━━━━━━━━━━━━━━━━━━━━━━━━━━━━━━━━ 297.0/297.0 KB 32.1 MB/s eta 0:00:00
Collecting pytest-forked==1.4.0
  Downloading pytest_forked-1.4.0-py3-none-any.whl (4.9 kB)
Collecting pytest-timeout==2.1.0
  Downloading pytest_timeout-2.1.0-py3-none-any.whl (12 kB)
Collecting pytest-xdist==2.5.0
  Downloading pytest_xdist-2.5.0-py3-none-any.whl (41 kB)
     ━━━━━━━━━━━━━━━━━━━━━━━━━━━━━━━━━━━━━━━━ 41.7/41.7 KB 6.2 MB/s eta 0:00:00
Collecting python-dateutil==2.8.2
  Downloading python_dateutil-2.8.2-py2.py3-none-any.whl (247 kB)
     ━━━━━━━━━━━━━━━━━━━━━━━━━━━━━━━━━━━━━━ 247.7/247.7 KB 28.0 MB/s eta 0:00:00
Collecting python-snappy==0.6.1
  Downloading python_snappy-0.6.1-cp37-cp37m-manylinux_2_12_x86_64.manylinux2010_x86_64.whl (56 kB)
     ━━━━━━━━━━━━━━━━━━━━━━━━━━━━━━━━━━━━━━━━ 56.5/56.5 KB 8.7 MB/s eta 0:00:00
Collecting pytz==2022.1
  Downloading pytz-2022.1-py2.py3-none-any.whl (503 kB)
     ━━━━━━━━━━━━━━━━━━━━━━━━━━━━━━━━━━━━━━ 503.5/503.5 KB 41.3 MB/s eta 0:00:00
Collecting PyYAML==6.0
  Downloading PyYAML-6.0-cp37-cp37m-manylinux_2_5_x86_64.manylinux1_x86_64.manylinux_2_12_x86_64.manylinux2010_x86_64.whl (596 kB)
     ━━━━━━━━━━━━━━━━━━━━━━━━━━━━━━━━━━━━━━ 596.3/596.3 KB 50.7 MB/s eta 0:00:00
Collecting regex==2022.7.25
  Downloading regex-2022.7.25-cp37-cp37m-manylinux_2_17_x86_64.manylinux2014_x86_64.whl (751 kB)
     ━━━━━━━━━━━━━━━━━━━━━━━━━━━━━━━━━━━━━━ 752.0/752.0 KB 54.3 MB/s eta 0:00:00
Collecting requests==2.28.1
  Downloading requests-2.28.1-py3-none-any.whl (62 kB)
     ━━━━━━━━━━━━━━━━━━━━━━━━━━━━━━━━━━━━━━━━ 62.8/62.8 KB 9.8 MB/s eta 0:00:00
Collecting requests-mock==1.9.3
  Downloading requests_mock-1.9.3-py2.py3-none-any.whl (27 kB)
Collecting requests-oauthlib==1.3.1
  Downloading requests_oauthlib-1.3.1-py2.py3-none-any.whl (23 kB)
Collecting rsa==4.9
  Downloading rsa-4.9-py3-none-any.whl (34 kB)
Collecting scikit-learn==1.0.2
  Downloading scikit_learn-1.0.2-cp37-cp37m-manylinux_2_17_x86_64.manylinux2014_x86_64.whl (24.8 MB)

> Task :sdks:java:io:google-cloud-platform:expansion-service:startShadowScripts
> Task :sdks:java:io:google-cloud-platform:expansion-service:shadowDistTar

> Task :sdks:python:container:py37:docker
     ━━━━━━━━━━━━━━━━━━━━━━━━━━━━━━━━━━━━━━━━ 24.8/24.8 MB 50.6 MB/s eta 0:00:00
Collecting scipy==1.7.3
  Downloading scipy-1.7.3-cp37-cp37m-manylinux_2_12_x86_64.manylinux2010_x86_64.whl (38.1 MB)
     ━━━━━━━━━━━━━━━━━━━━━━━━━━━━━━━━━━━━━━━━ 38.1/38.1 MB 29.9 MB/s eta 0:00:00
Collecting six==1.16.0
  Downloading six-1.16.0-py2.py3-none-any.whl (11 kB)
Collecting soupsieve==2.3.2.post1
  Downloading soupsieve-2.3.2.post1-py3-none-any.whl (37 kB)
Collecting SQLAlchemy==1.4.39
  Downloading SQLAlchemy-1.4.39-cp37-cp37m-manylinux_2_5_x86_64.manylinux1_x86_64.manylinux_2_17_x86_64.manylinux2014_x86_64.whl (1.6 MB)
     ━━━━━━━━━━━━━━━━━━━━━━━━━━━━━━━━━━━━━━━━ 1.6/1.6 MB 63.7 MB/s eta 0:00:00
Collecting tenacity==5.1.5
  Downloading tenacity-5.1.5-py2.py3-none-any.whl (34 kB)
Collecting tensorboard==2.9.1
  Downloading tensorboard-2.9.1-py3-none-any.whl (5.8 MB)
     ━━━━━━━━━━━━━━━━━━━━━━━━━━━━━━━━━━━━━━━━ 5.8/5.8 MB 77.3 MB/s eta 0:00:00
Collecting tensorboard-data-server==0.6.1
  Downloading tensorboard_data_server-0.6.1-py3-none-manylinux2010_x86_64.whl (4.9 MB)
     ━━━━━━━━━━━━━━━━━━━━━━━━━━━━━━━━━━━━━━━━ 4.9/4.9 MB 80.3 MB/s eta 0:00:00
Collecting tensorboard-plugin-wit==1.8.1
  Downloading tensorboard_plugin_wit-1.8.1-py3-none-any.whl (781 kB)
     ━━━━━━━━━━━━━━━━━━━━━━━━━━━━━━━━━━━━━━ 781.3/781.3 KB 52.4 MB/s eta 0:00:00
Collecting tensorflow==2.9.1
  Downloading tensorflow-2.9.1-cp37-cp37m-manylinux_2_17_x86_64.manylinux2014_x86_64.whl (511.7 MB)

> Task :sdks:java:io:google-cloud-platform:expansion-service:shadowDistZip
> Task :sdks:java:io:google-cloud-platform:expansion-service:assemble
> Task :sdks:java:io:google-cloud-platform:expansion-service:analyzeClassesDependencies
> Task :sdks:java:io:google-cloud-platform:expansion-service:analyzeDependencies
> Task :sdks:java:io:google-cloud-platform:expansion-service:test NO-SOURCE
> Task :sdks:java:io:google-cloud-platform:expansion-service:check
> Task :sdks:java:io:google-cloud-platform:expansion-service:build

> Task :sdks:python:container:py37:docker
     ━━━━━━━━━━━━━━━━━━━━━━━━━━━━━━━━━━━━━━━ 511.7/511.7 MB 1.9 MB/s eta 0:00:00
Collecting tensorflow-estimator==2.9.0
  Downloading tensorflow_estimator-2.9.0-py2.py3-none-any.whl (438 kB)
     ━━━━━━━━━━━━━━━━━━━━━━━━━━━━━━━━━━━━━━━ 438.7/438.7 KB 2.5 MB/s eta 0:00:00
Collecting tensorflow-io-gcs-filesystem==0.26.0
  Downloading tensorflow_io_gcs_filesystem-0.26.0-cp37-cp37m-manylinux_2_12_x86_64.manylinux2010_x86_64.whl (2.4 MB)
     ━━━━━━━━━━━━━━━━━━━━━━━━━━━━━━━━━━━━━━━━ 2.4/2.4 MB 10.7 MB/s eta 0:00:00
The command '/bin/sh -c pip install --no-deps -v /opt/apache/beam/tars/apache-beam.tar.gz[gcp]' returned a non-zero code: 1

> Task :sdks:python:container:py37:docker FAILED

FAILURE: Build completed with 2 failures.

1: Task failed with an exception.
-----------
* What went wrong:
Execution failed for task ':sdks:python:installGcpTest'.
> Process 'command 'sh'' finished with non-zero exit value 1

* Try:
> Run with --stacktrace option to get the stack trace.
> Run with --info or --debug option to get more log output.
==============================================================================

2: Task failed with an exception.
-----------
* What went wrong:
Execution failed for task ':sdks:python:container:py37:docker'.
> Process 'command 'docker'' finished with non-zero exit value 1

* Try:
> Run with --stacktrace option to get the stack trace.
> Run with --info or --debug option to get more log output.
==============================================================================

* Get more help at https://help.gradle.org

Deprecated Gradle features were used in this build, making it incompatible with Gradle 8.0.

You can use '--warning-mode all' to show the individual deprecation warnings and determine if they come from your own scripts or plugins.

See https://docs.gradle.org/7.5.1/userguide/command_line_interface.html#sec:command_line_warnings

Execution optimizations have been disabled for 1 invalid unit(s) of work during this build to ensure correctness.
Please consult deprecation warnings for more details.

BUILD FAILED in 5m 30s
239 actionable tasks: 176 executed, 53 from cache, 10 up-to-date

Publishing build scan...
https://gradle.com/s/cr3zgt6js3gn4

Build step 'Invoke Gradle script' changed build result to FAILURE
Build step 'Invoke Gradle script' marked build as failure

---------------------------------------------------------------------
To unsubscribe, e-mail: builds-unsubscribe@beam.apache.org
For additional commands, e-mail: builds-help@beam.apache.org


Build failed in Jenkins: beam_PostCommit_XVR_Direct #3137

Posted by Apache Jenkins Server <je...@builds.apache.org>.
See <https://ci-beam.apache.org/job/beam_PostCommit_XVR_Direct/3137/display/redirect>

Changes:


------------------------------------------
[...truncated 154.31 KB...]
     ━━━━━━━━━━━━━━━━━━━━━━━━━━━━━━━━━━━━━━━━ 2.0/2.0 MB 26.7 MB/s eta 0:00:00
Requirement already satisfied: setuptools in /usr/local/lib/python3.7/site-packages (57.5.0)
Collecting setuptools
  Downloading setuptools-65.3.0-py3-none-any.whl (1.2 MB)
     ━━━━━━━━━━━━━━━━━━━━━━━━━━━━━━━━━━━━━━━━ 1.2/1.2 MB 56.2 MB/s eta 0:00:00
Installing collected packages: setuptools, pip
  Attempting uninstall: setuptools
    Found existing installation: setuptools 57.5.0
    Uninstalling setuptools-57.5.0:
      Successfully uninstalled setuptools-57.5.0
  Attempting uninstall: pip
    Found existing installation: pip 22.0.4
    Uninstalling pip-22.0.4:
      Successfully uninstalled pip-22.0.4
Successfully installed pip-22.2.2 setuptools-65.3.0
WARNING: Running pip as the 'root' user can result in broken permissions and conflicting behaviour with the system package manager. It is recommended to use a virtual environment instead: https://pip.pypa.io/warnings/venv
Removing intermediate container 2d0fb9efcad5
 ---> 6a134bd59d66
Step 8/32 : ENV CLOUDSDK_CORE_DISABLE_PROMPTS yes
 ---> Running in 10901dbf3d9a
Removing intermediate container 10901dbf3d9a
 ---> 7cfabdcd8b3d
Step 9/32 : ENV PATH $PATH:/usr/local/gcloud/google-cloud-sdk/bin
 ---> Running in e8cceec37fe4
Removing intermediate container e8cceec37fe4
 ---> e029b5fa9d15
Step 10/32 : RUN mkdir -p /usr/local/gcloud &&     cd /usr/local/gcloud &&     curl -s -O https://dl.google.com/dl/cloudsdk/release/google-cloud-sdk.tar.gz &&     tar -xf google-cloud-sdk.tar.gz &&     /usr/local/gcloud/google-cloud-sdk/install.sh &&     rm google-cloud-sdk.tar.gz
 ---> Running in 19f00b5e507b
Welcome to the Google Cloud CLI!
WARNING: You appear to be running this script as root. This may cause 
the installation to be inaccessible to users other than the root user.
Beginning update. This process may take several minutes.


Your current Google Cloud CLI version is: 402.0.0
Installing components from version: 402.0.0

┌─────────────────────────────────────────────────────────────────────────────┐
│                     These components will be installed.                     │
├─────────────────────────────────────────────────────┬────────────┬──────────┤
│                         Name                        │  Version   │   Size   │
├─────────────────────────────────────────────────────┼────────────┼──────────┤
│ BigQuery Command Line Tool                          │     2.0.75 │  1.6 MiB │
│ BigQuery Command Line Tool (Platform Specific)      │     2.0.75 │  < 1 MiB │
│ Cloud Storage Command Line Tool                     │       5.13 │ 15.5 MiB │
│ Cloud Storage Command Line Tool (Platform Specific) │       5.11 │  < 1 MiB │
│ Google Cloud CLI Core Libraries (Platform Specific) │ 2022.08.05 │  < 1 MiB │
│ Google Cloud CRC32C Hash Tool                       │      1.0.0 │  1.2 MiB │
│ anthoscli                                           │     0.2.29 │ 37.6 MiB │
│ gcloud cli dependencies                             │ 2021.04.16 │  < 1 MiB │
└─────────────────────────────────────────────────────┴────────────┴──────────┘

For the latest full release notes, please visit:
  https://cloud.google.com/sdk/release_notes

╔════════════════════════════════════════════════════════════╗
╠═ Creating update staging area                             ═╣
╚════════════════════════════════════════════════════════════╝
╔════════════════════════════════════════════════════════════╗
╠═ Installing: BigQuery Command Line Tool                   ═╣
╚════════════════════════════════════════════════════════════╝
╔════════════════════════════════════════════════════════════╗
╠═ Installing: BigQuery Command Line Tool (Platform Spec... ═╣
╚════════════════════════════════════════════════════════════╝
╔════════════════════════════════════════════════════════════╗
╠═ Installing: Cloud Storage Command Line Tool              ═╣
╚════════════════════════════════════════════════════════════╝
╔════════════════════════════════════════════════════════════╗
╠═ Installing: Cloud Storage Command Line Tool (Platform... ═╣
╚════════════════════════════════════════════════════════════╝
╔════════════════════════════════════════════════════════════╗
╠═ Installing: Default set of gcloud commands               ═╣
╚════════════════════════════════════════════════════════════╝
╔════════════════════════════════════════════════════════════╗
╠═ Installing: Google Cloud CLI Core Libraries (Platform... ═╣
╚════════════════════════════════════════════════════════════╝
╔════════════════════════════════════════════════════════════╗
╠═ Installing: Google Cloud CRC32C Hash Tool                ═╣
╚════════════════════════════════════════════════════════════╝
╔════════════════════════════════════════════════════════════╗
╠═ Installing: Google Cloud CRC32C Hash Tool                ═╣
╚════════════════════════════════════════════════════════════╝
╔════════════════════════════════════════════════════════════╗
╠═ Installing: anthoscli                                    ═╣
╚════════════════════════════════════════════════════════════╝
╔════════════════════════════════════════════════════════════╗
╠═ Installing: anthoscli                                    ═╣
╚════════════════════════════════════════════════════════════╝
╔════════════════════════════════════════════════════════════╗
╠═ Installing: gcloud cli dependencies                      ═╣
╚════════════════════════════════════════════════════════════╝
╔════════════════════════════════════════════════════════════╗
╠═ Creating backup and activating new installation          ═╣
╚════════════════════════════════════════════════════════════╝

Performing post processing steps...
.....................................................................................done.

Update done!


To help improve the quality of this product, we collect anonymized usage data
and anonymized stacktraces when crashes are encountered; additional information
is available at <https://cloud.google.com/sdk/usage-statistics>. This data is
handled in accordance with our privacy policy
<https://cloud.google.com/terms/cloud-privacy-notice>. You may choose to opt in this
collection now (by choosing 'Y' at the below prompt), or at any time in the
future by running the following command:

    gcloud config set disable_usage_reporting false


This will install all the core command line tools necessary for working with
the Google Cloud Platform.

==> Source [/usr/local/gcloud/google-cloud-sdk/completion.bash.inc] in your profile to enable shell command completion for gcloud.
==> Source [/usr/local/gcloud/google-cloud-sdk/path.bash.inc] in your profile to add the Google Cloud SDK command line tools to your $PATH.

For more information on how to get started, please visit:
  https://cloud.google.com/sdk/docs/quickstarts


Removing intermediate container 19f00b5e507b
 ---> eff319d9b0b7
Step 11/32 : RUN ln -s /usr/bin/ccache /usr/local/bin/gcc
 ---> Running in 3c707362f77d
Removing intermediate container 3c707362f77d
 ---> 3264b6537abd
Step 12/32 : RUN ccache --set-config=sloppiness=file_macro && ccache --set-config=hash_dir=false
 ---> Running in 82d837baaa70
Removing intermediate container 82d837baaa70
 ---> 29b49f97b428
Step 13/32 : COPY target/apache-beam.tar.gz /opt/apache/beam/tars/
 ---> 147116358955
Step 14/32 : RUN pip install --no-deps -v /opt/apache/beam/tars/apache-beam.tar.gz[gcp]
 ---> Running in 80950ef4c0dc
Using pip 22.2.2 from /usr/local/lib/python3.7/site-packages/pip (python 3.7)
Processing /opt/apache/beam/tars/apache-beam.tar.gz
  Preparing metadata (setup.py): started
  Running command python setup.py egg_info
  Traceback (most recent call last):
    File "<string>", line 36, in <module>
    File "<pip-setuptools-caller>", line 34, in <module>
    File "/tmp/pip-req-build-tzh7dihn/setup.py", line 169, in <module>
      generate_protos_first()
    File "/tmp/pip-req-build-tzh7dihn/setup.py", line 139, in generate_protos_first
      gen_protos.generate_proto_files()
    File "/tmp/pip-req-build-tzh7dihn/gen_protos.py", line 476, in generate_proto_files
      raise RuntimeError(error_msg)
  RuntimeError: Not in apache git tree, unable to find proto definitions.
  error: subprocess-exited-with-error
  
  × python setup.py egg_info did not run successfully.
  │ exit code: 1
  ╰─> See above for output.
  
  note: This error originates from a subprocess, and is likely not a problem with pip.
  full command: /usr/local/bin/python -c '
  exec(compile('"'"''"'"''"'"'
  # This is <pip-setuptools-caller> -- a caller that pip uses to run setup.py
  #
  # - It imports setuptools before invoking setup.py, to enable projects that directly
  #   import from `distutils.core` to work with newer packaging standards.
  # - It provides a clear error message when setuptools is not installed.
  # - It sets `sys.argv[0]` to the underlying `setup.py`, when invoking `setup.py` so
  #   setuptools doesn'"'"'t think the script is `-c`. This avoids the following warning:
  #     manifest_maker: standard file '"'"'-c'"'"' not found".
  # - It generates a shim setup.py, for handling setup.cfg-only projects.
  import os, sys, tokenize
  
  try:
      import setuptools
  except ImportError as error:
      print(
          "ERROR: Can not execute `setup.py` since setuptools is not available in "
          "the build environment.",
          file=sys.stderr,
      )
      sys.exit(1)
  
  __file__ = %r
  sys.argv[0] = __file__
  
  if os.path.exists(__file__):
      filename = __file__
      with tokenize.open(__file__) as f:
          setup_py_code = f.read()
  else:
      filename = "<auto-generated setuptools caller>"
      setup_py_code = "from setuptools import setup; setup()"
  
  exec(compile(setup_py_code, filename, "exec"))
  '"'"''"'"''"'"' % ('"'"'/tmp/pip-req-build-tzh7dihn/setup.py'"'"',), "<pip-setuptools-caller>", "exec"))' egg_info --egg-base /tmp/pip-pip-egg-info-6j280x4t
  cwd: /tmp/pip-req-build-tzh7dihn/
  Preparing metadata (setup.py): finished with status 'error'
error: metadata-generation-failed

× Encountered error while generating package metadata.
╰─> See above for output.

note: This is an issue with the package mentioned above, not pip.
hint: See above for details.
The command '/bin/sh -c pip install --no-deps -v /opt/apache/beam/tars/apache-beam.tar.gz[gcp]' returned a non-zero code: 1

> Task :sdks:python:container:py37:docker FAILED

FAILURE: Build completed with 2 failures.

1: Task failed with an exception.
-----------
* What went wrong:
Execution failed for task ':sdks:python:installGcpTest'.
> Process 'command 'sh'' finished with non-zero exit value 1

* Try:
> Run with --stacktrace option to get the stack trace.
> Run with --info or --debug option to get more log output.
==============================================================================

2: Task failed with an exception.
-----------
* What went wrong:
Execution failed for task ':sdks:python:container:py37:docker'.
> Process 'command 'docker'' finished with non-zero exit value 1

* Try:
> Run with --stacktrace option to get the stack trace.
> Run with --info or --debug option to get more log output.
==============================================================================

* Get more help at https://help.gradle.org

Deprecated Gradle features were used in this build, making it incompatible with Gradle 8.0.

You can use '--warning-mode all' to show the individual deprecation warnings and determine if they come from your own scripts or plugins.

See https://docs.gradle.org/7.5.1/userguide/command_line_interface.html#sec:command_line_warnings

Execution optimizations have been disabled for 1 invalid unit(s) of work during this build to ensure correctness.
Please consult deprecation warnings for more details.

BUILD FAILED in 5m 55s
239 actionable tasks: 154 executed, 73 from cache, 12 up-to-date

Publishing build scan...
https://gradle.com/s/3dxlrbwmxarp6

Build step 'Invoke Gradle script' changed build result to FAILURE
Build step 'Invoke Gradle script' marked build as failure

---------------------------------------------------------------------
To unsubscribe, e-mail: builds-unsubscribe@beam.apache.org
For additional commands, e-mail: builds-help@beam.apache.org