You are viewing a plain text version of this content. The canonical link for it is here.
Posted to commits@myfaces.apache.org by Apache Jenkins Server <je...@builds.apache.org> on 2011/07/13 14:07:39 UTC
Build failed in Jenkins: myfaces-current-2.0-integration-tests #1
See <https://builds.apache.org/job/myfaces-current-2.0-integration-tests/1/>
------------------------------------------
Started by user jakobk
Building remotely on solaris2
Checking out a fresh workspace because there's no workspace at /zonestorage/hudson<https://builds.apache.org/job/myfaces-current-2.0-integration-tests/ws/>
Cleaning workspace /zonestorage/hudson<https://builds.apache.org/job/myfaces-current-2.0-integration-tests/ws/>
Checking out https://svn.apache.org/repos/asf/myfaces/core/branches/2.0.x/integration-tests
A servlet30-el22-basic-tests
A servlet30-el22-basic-tests/src
A servlet30-el22-basic-tests/src/test
A servlet30-el22-basic-tests/src/test/java
A servlet30-el22-basic-tests/src/test/java/org
A servlet30-el22-basic-tests/src/test/java/org/apache
A servlet30-el22-basic-tests/src/test/java/org/apache/myfaces
A servlet30-el22-basic-tests/src/test/java/org/apache/myfaces/integrationtest
A servlet30-el22-basic-tests/src/test/java/org/apache/myfaces/integrationtest/FormInputTest.java
A servlet30-el22-basic-tests/src/main
A servlet30-el22-basic-tests/src/main/java
A servlet30-el22-basic-tests/src/main/java/org
A servlet30-el22-basic-tests/src/main/java/org/apache
A servlet30-el22-basic-tests/src/main/java/org/apache/myfaces
A servlet30-el22-basic-tests/src/main/java/org/apache/myfaces/integrationtest
A servlet30-el22-basic-tests/src/main/java/org/apache/myfaces/integrationtest/FormInputBean.java
A servlet30-el22-basic-tests/src/main/resources
A servlet30-el22-basic-tests/src/main/webapp
A servlet30-el22-basic-tests/src/main/webapp/pages
A servlet30-el22-basic-tests/src/main/webapp/pages/formInput
A servlet30-el22-basic-tests/src/main/webapp/pages/formInput/index.xhtml
A servlet30-el22-basic-tests/src/main/webapp/pages/formInput/result.xhtml
A servlet30-el22-basic-tests/src/main/webapp/WEB-INF
A servlet30-el22-basic-tests/src/main/webapp/WEB-INF/web.xml
A servlet30-el22-basic-tests/pom.xml
A servlet25-el10-basic-tests
A servlet25-el10-basic-tests/src
A servlet25-el10-basic-tests/src/test
A servlet25-el10-basic-tests/src/test/java
A servlet25-el10-basic-tests/src/test/java/org
A servlet25-el10-basic-tests/src/test/java/org/apache
A servlet25-el10-basic-tests/src/test/java/org/apache/myfaces
A servlet25-el10-basic-tests/src/test/java/org/apache/myfaces/integrationtest
A servlet25-el10-basic-tests/src/test/java/org/apache/myfaces/integrationtest/FormInputTest.java
A servlet25-el10-basic-tests/src/main
A servlet25-el10-basic-tests/src/main/java
A servlet25-el10-basic-tests/src/main/java/org
A servlet25-el10-basic-tests/src/main/java/org/apache
A servlet25-el10-basic-tests/src/main/java/org/apache/myfaces
A servlet25-el10-basic-tests/src/main/java/org/apache/myfaces/integrationtest
A servlet25-el10-basic-tests/src/main/java/org/apache/myfaces/integrationtest/FormInputBean.java
A servlet25-el10-basic-tests/src/main/resources
A servlet25-el10-basic-tests/src/main/webapp
A servlet25-el10-basic-tests/src/main/webapp/pages
A servlet25-el10-basic-tests/src/main/webapp/pages/formInput
A servlet25-el10-basic-tests/src/main/webapp/pages/formInput/index.xhtml
A servlet25-el10-basic-tests/src/main/webapp/pages/formInput/result.xhtml
A servlet25-el10-basic-tests/src/main/webapp/WEB-INF
A servlet25-el10-basic-tests/src/main/webapp/WEB-INF/web.xml
A servlet25-el10-basic-tests/pom.xml
A integration-test-support
A integration-test-support/src
A integration-test-support/src/main
A integration-test-support/src/main/java
A integration-test-support/src/main/java/org
A integration-test-support/src/main/java/org/apache
A integration-test-support/src/main/java/org/apache/myfaces
A integration-test-support/src/main/java/org/apache/myfaces/integrationtest
A integration-test-support/src/main/java/org/apache/myfaces/integrationtest/support
A integration-test-support/src/main/java/org/apache/myfaces/integrationtest/support/MyFacesIntegrationTest.java
A integration-test-support/pom.xml
A pom.xml
A servlet25-el22-basic-tests
A servlet25-el22-basic-tests/src
A servlet25-el22-basic-tests/src/test
A servlet25-el22-basic-tests/src/test/java
A servlet25-el22-basic-tests/src/test/java/org
A servlet25-el22-basic-tests/src/test/java/org/apache
A servlet25-el22-basic-tests/src/test/java/org/apache/myfaces
A servlet25-el22-basic-tests/src/test/java/org/apache/myfaces/integrationtest
A servlet25-el22-basic-tests/src/test/java/org/apache/myfaces/integrationtest/FormInputTest.java
A servlet25-el22-basic-tests/src/main
A servlet25-el22-basic-tests/src/main/java
A servlet25-el22-basic-tests/src/main/java/org
A servlet25-el22-basic-tests/src/main/java/org/apache
A servlet25-el22-basic-tests/src/main/java/org/apache/myfaces
A servlet25-el22-basic-tests/src/main/java/org/apache/myfaces/integrationtest
A servlet25-el22-basic-tests/src/main/java/org/apache/myfaces/integrationtest/FormInputBean.java
A servlet25-el22-basic-tests/src/main/resources
A servlet25-el22-basic-tests/src/main/webapp
A servlet25-el22-basic-tests/src/main/webapp/pages
A servlet25-el22-basic-tests/src/main/webapp/pages/formInput
A servlet25-el22-basic-tests/src/main/webapp/pages/formInput/index.xhtml
A servlet25-el22-basic-tests/src/main/webapp/pages/formInput/result.xhtml
A servlet25-el22-basic-tests/src/main/webapp/WEB-INF
A servlet25-el22-basic-tests/src/main/webapp/WEB-INF/web.xml
A servlet25-el22-basic-tests/pom.xml
U .
At revision 1145964
Found mavenVersion 3.0.3 from file jar:file:/home/hudson/tools/maven/latest3/lib/maven-core-3.0.3.jar!/META-INF/maven/org.apache.maven/maven-core/pom.properties
Parsing POMs
ERROR: Failed to parse POMs
hudson.util.IOException2: remote file operation failed: <https://builds.apache.org/job/myfaces-current-2.0-integration-tests/ws/> at hudson.remoting.Channel@74216db4:solaris2
at hudson.FilePath.act(FilePath.java:754)
at hudson.FilePath.act(FilePath.java:740)
at hudson.maven.MavenModuleSetBuild$RunnerImpl.parsePoms(MavenModuleSetBuild.java:817)
at hudson.maven.MavenModuleSetBuild$RunnerImpl.doRun(MavenModuleSetBuild.java:617)
at hudson.model.AbstractBuild$AbstractRunner.run(AbstractBuild.java:429)
at hudson.model.Run.run(Run.java:1374)
at hudson.maven.MavenModuleSetBuild.run(MavenModuleSetBuild.java:467)
at hudson.model.ResourceController.execute(ResourceController.java:88)
at hudson.model.Executor.run(Executor.java:145)
Caused by: hudson.remoting.ProxyException: hudson.maven.MavenModuleSetBuild$MavenExecutionException: org.apache.maven.project.ProjectBuildingException: Some problems were encountered while processing the POMs:
[ERROR] 'dependencies.dependency.version' for org.apache.geronimo.specs:geronimo-el_1.0_spec:jar is missing. @ line 128, column 21
at hudson.maven.MavenModuleSetBuild$PomParser.invoke(MavenModuleSetBuild.java:1327)
at hudson.maven.MavenModuleSetBuild$PomParser.invoke(MavenModuleSetBuild.java:1110)
at hudson.FilePath$FileCallableWrapper.call(FilePath.java:1979)
at hudson.remoting.UserRequest.perform(UserRequest.java:118)
at hudson.remoting.UserRequest.perform(UserRequest.java:48)
at hudson.remoting.Request$2.run(Request.java:270)
at java.util.concurrent.Executors$RunnableAdapter.call(Executors.java:417)
at java.util.concurrent.FutureTask$Sync.innerRun(FutureTask.java:269)
at java.util.concurrent.FutureTask.run(FutureTask.java:123)
at java.util.concurrent.ThreadPoolExecutor$Worker.runTask(ThreadPoolExecutor.java:650)
at java.util.concurrent.ThreadPoolExecutor$Worker.run(ThreadPoolExecutor.java:675)
at java.lang.Thread.run(Thread.java:595)
Caused by: hudson.remoting.ProxyException: org.apache.maven.project.ProjectBuildingException: Some problems were encountered while processing the POMs:
[ERROR] 'dependencies.dependency.version' for org.apache.geronimo.specs:geronimo-el_1.0_spec:jar is missing. @ line 128, column 21
at org.apache.maven.project.DefaultProjectBuilder.build(DefaultProjectBuilder.java:339)
at hudson.maven.MavenEmbedder.buildProjects(MavenEmbedder.java:360)
at hudson.maven.MavenEmbedder.readProjects(MavenEmbedder.java:330)
at hudson.maven.MavenModuleSetBuild$PomParser.invoke(MavenModuleSetBuild.java:1277)
... 11 more