You are viewing a plain text version of this content. The canonical link for it is here.
Posted to builds@solr.apache.org by Policeman Jenkins Server <je...@thetaphi.de> on 2021/11/22 00:46:35 UTC

[JENKINS] Solr-main-MacOSX (64bit/jdk-17) - Build # 475 - Still Unstable!

Build: https://jenkins.thetaphi.de/job/Solr-main-MacOSX/475/
Java: 64bit/jdk-17 -XX:+UseCompressedOops -XX:+UseSerialGC

7 tests failed.
FAILED:  org.apache.solr.handler.designer.TestSchemaDesignerAPI.testBasicUserWorkflow

Error Message:
org.apache.solr.client.solrj.impl.BaseHttpSolrClient$RemoteSolrException: Error from server at http://127.0.0.1:60047/solr: Underlying core creation failed while creating collection: ._designer_testJson

Stack Trace:
org.apache.solr.client.solrj.impl.BaseHttpSolrClient$RemoteSolrException: Error from server at http://127.0.0.1:60047/solr: Underlying core creation failed while creating collection: ._designer_testJson
	at app//org.apache.solr.client.solrj.impl.HttpSolrClient.executeMethod(HttpSolrClient.java:668)
	at app//org.apache.solr.client.solrj.impl.HttpSolrClient.request(HttpSolrClient.java:239)
	at app//org.apache.solr.client.solrj.impl.HttpSolrClient.request(HttpSolrClient.java:222)
	at app//org.apache.solr.client.solrj.impl.LBSolrClient.doRequest(LBSolrClient.java:389)
	at app//org.apache.solr.client.solrj.impl.LBSolrClient.request(LBSolrClient.java:359)
	at app//org.apache.solr.client.solrj.impl.BaseCloudSolrClient.sendRequest(BaseCloudSolrClient.java:1132)
	at app//org.apache.solr.client.solrj.impl.BaseCloudSolrClient.requestWithRetryOnStaleState(BaseCloudSolrClient.java:898)
	at app//org.apache.solr.client.solrj.impl.BaseCloudSolrClient.request(BaseCloudSolrClient.java:832)
	at app//org.apache.solr.client.solrj.SolrRequest.process(SolrRequest.java:226)
	at app//org.apache.solr.client.solrj.SolrRequest.process(SolrRequest.java:243)
	at app//org.apache.solr.handler.designer.SchemaDesignerConfigSetHelper.createCollection(SchemaDesignerConfigSetHelper.java:648)
	at app//org.apache.solr.handler.designer.SchemaDesignerConfigSetHelper.createCollection(SchemaDesignerConfigSetHelper.java:642)
	at app//org.apache.solr.handler.designer.SchemaDesignerConfigSetHelper.reloadTempCollection(SchemaDesignerConfigSetHelper.java:248)
	at app//org.apache.solr.handler.designer.SchemaDesignerConfigSetHelper.updateSchemaObject(SchemaDesignerConfigSetHelper.java:283)
	at app//org.apache.solr.handler.designer.SchemaDesignerAPI.updateSchemaObject(SchemaDesignerAPI.java:415)
	at app//org.apache.solr.handler.designer.TestSchemaDesignerAPI.testBasicUserWorkflow(TestSchemaDesignerAPI.java:566)
	at java.base@17/jdk.internal.reflect.NativeMethodAccessorImpl.invoke0(Native Method)
	at java.base@17/jdk.internal.reflect.NativeMethodAccessorImpl.invoke(NativeMethodAccessorImpl.java:77)
	at java.base@17/jdk.internal.reflect.DelegatingMethodAccessorImpl.invoke(DelegatingMethodAccessorImpl.java:43)
	at java.base@17/java.lang.reflect.Method.invoke(Method.java:568)
	at app//com.carrotsearch.randomizedtesting.RandomizedRunner.invoke(RandomizedRunner.java:1754)
	at app//com.carrotsearch.randomizedtesting.RandomizedRunner$8.evaluate(RandomizedRunner.java:942)
	at app//com.carrotsearch.randomizedtesting.RandomizedRunner$9.evaluate(RandomizedRunner.java:978)
	at app//com.carrotsearch.randomizedtesting.RandomizedRunner$10.evaluate(RandomizedRunner.java:992)
	at app//com.carrotsearch.randomizedtesting.rules.SystemPropertiesRestoreRule$1.evaluate(SystemPropertiesRestoreRule.java:57)
	at app//org.junit.rules.RunRules.evaluate(RunRules.java:20)
	at app//org.apache.lucene.util.TestRuleSetupTeardownChained$1.evaluate(TestRuleSetupTeardownChained.java:44)
	at app//org.apache.lucene.util.AbstractBeforeAfterRule$1.evaluate(AbstractBeforeAfterRule.java:43)
	at app//org.apache.lucene.util.TestRuleThreadAndTestName$1.evaluate(TestRuleThreadAndTestName.java:45)
	at app//org.apache.lucene.util.TestRuleIgnoreAfterMaxFailures$1.evaluate(TestRuleIgnoreAfterMaxFailures.java:60)
	at app//org.apache.lucene.util.TestRuleMarkFailure$1.evaluate(TestRuleMarkFailure.java:44)
	at app//org.junit.rules.RunRules.evaluate(RunRules.java:20)
	at app//com.carrotsearch.randomizedtesting.rules.StatementAdapter.evaluate(StatementAdapter.java:36)
	at app//com.carrotsearch.randomizedtesting.ThreadLeakControl$StatementRunner.run(ThreadLeakControl.java:370)
	at app//com.carrotsearch.randomizedtesting.ThreadLeakControl.forkTimeoutingTask(ThreadLeakControl.java:819)
	at app//com.carrotsearch.randomizedtesting.ThreadLeakControl$3.evaluate(ThreadLeakControl.java:470)
	at app//com.carrotsearch.randomizedtesting.RandomizedRunner.runSingleTest(RandomizedRunner.java:951)
	at app//com.carrotsearch.randomizedtesting.RandomizedRunner$5.evaluate(RandomizedRunner.java:836)
	at app//com.carrotsearch.randomizedtesting.RandomizedRunner$6.evaluate(RandomizedRunner.java:887)
	at app//com.carrotsearch.randomizedtesting.RandomizedRunner$7.evaluate(RandomizedRunner.java:898)
	at app//com.carrotsearch.randomizedtesting.rules.StatementAdapter.evaluate(StatementAdapter.java:36)
	at app//org.apache.lucene.util.AbstractBeforeAfterRule$1.evaluate(AbstractBeforeAfterRule.java:43)
	at app//org.apache.lucene.util.AbstractBeforeAfterRule$1.evaluate(AbstractBeforeAfterRule.java:43)
	at app//com.carrotsearch.randomizedtesting.rules.SystemPropertiesRestoreRule$1.evaluate(SystemPropertiesRestoreRule.java:57)
	at app//org.junit.rules.RunRules.evaluate(RunRules.java:20)
	at app//org.apache.lucene.util.AbstractBeforeAfterRule$1.evaluate(AbstractBeforeAfterRule.java:43)
	at app//com.carrotsearch.randomizedtesting.rules.StatementAdapter.evaluate(StatementAdapter.java:36)
	at app//org.apache.lucene.util.TestRuleStoreClassName$1.evaluate(TestRuleStoreClassName.java:38)
	at app//com.carrotsearch.randomizedtesting.rules.NoShadowingOrOverridesOnMethodsRule$1.evaluate(NoShadowingOrOverridesOnMethodsRule.java:40)
	at app//com.carrotsearch.randomizedtesting.rules.NoShadowingOrOverridesOnMethodsRule$1.evaluate(NoShadowingOrOverridesOnMethodsRule.java:40)
	at app//com.carrotsearch.randomizedtesting.rules.StatementAdapter.evaluate(StatementAdapter.java:36)
	at app//com.carrotsearch.randomizedtesting.rules.StatementAdapter.evaluate(StatementAdapter.java:36)
	at app//org.apache.lucene.util.TestRuleAssertionsRequired$1.evaluate(TestRuleAssertionsRequired.java:53)
	at app//org.apache.lucene.util.AbstractBeforeAfterRule$1.evaluate(AbstractBeforeAfterRule.java:43)
	at app//org.apache.lucene.util.TestRuleMarkFailure$1.evaluate(TestRuleMarkFailure.java:44)
	at app//org.apache.lucene.util.TestRuleIgnoreAfterMaxFailures$1.evaluate(TestRuleIgnoreAfterMaxFailures.java:60)
	at app//org.apache.lucene.util.TestRuleIgnoreTestSuites$1.evaluate(TestRuleIgnoreTestSuites.java:47)
	at app//org.junit.rules.RunRules.evaluate(RunRules.java:20)
	at app//com.carrotsearch.randomizedtesting.rules.StatementAdapter.evaluate(StatementAdapter.java:36)
	at app//com.carrotsearch.randomizedtesting.ThreadLeakControl$StatementRunner.run(ThreadLeakControl.java:370)
	at app//com.carrotsearch.randomizedtesting.ThreadLeakControl.lambda$forkTimeoutingTask$0(ThreadLeakControl.java:826)
	at java.base@17/java.lang.Thread.run(Thread.java:833)


FAILED:  org.apache.solr.handler.designer.TestSchemaDesignerSettingsDAO.classMethod

Error Message:
com.carrotsearch.randomizedtesting.ThreadLeakError: 1 thread leaked from SUITE scope at org.apache.solr.handler.designer.TestSchemaDesignerSettingsDAO: 
   1) Thread[id=1853, name=ZKEventListenerThread, state=TIMED_WAITING, group=TGRP-TestSchemaDesignerSettingsDAO]
        at java.base@17/java.lang.Thread.sleep(Native Method)
        at app//org.apache.solr.common.cloud.ZkCmdExecutor.retryDelay(ZkCmdExecutor.java:156)
        at app//org.apache.solr.common.cloud.ZkCmdExecutor.retryOperation(ZkCmdExecutor.java:89)
        at app//org.apache.solr.common.cloud.SolrZkClient.exists(SolrZkClient.java:307)
        at app//org.apache.solr.cloud.ZkController.pathExists(ZkController.java:1118)
        at app//org.apache.solr.cloud.ZkSolrResourceLoader.openResource(ZkSolrResourceLoader.java:80)
        at app//org.apache.lucene.analysis.synonym.SynonymGraphFilterFactory.loadSynonyms(SynonymGraphFilterFactory.java:191)
        at app//org.apache.lucene.analysis.synonym.SynonymGraphFilterFactory.inform(SynonymGraphFilterFactory.java:161)
        at app//org.apache.solr.core.SolrResourceLoader.informAware(SolrResourceLoader.java:727)
        at app//org.apache.solr.schema.ManagedIndexSchema.informResourceLoaderAwareObjectsInChain(ManagedIndexSchema.java:1353)
        at app//org.apache.solr.schema.ManagedIndexSchema.informResourceLoaderAwareObjectsForFieldType(ManagedIndexSchema.java:1215)
        at app//org.apache.solr.schema.ManagedIndexSchema.postReadInform(ManagedIndexSchema.java:1191)
        at app//org.apache.solr.schema.IndexSchema.readSchema(IndexSchema.java:615)
        at app//org.apache.solr.schema.IndexSchema.<init>(IndexSchema.java:177)
        at app//org.apache.solr.schema.ManagedIndexSchema.<init>(ManagedIndexSchema.java:108)
        at app//org.apache.solr.schema.ManagedIndexSchemaFactory.create(ManagedIndexSchemaFactory.java:244)
        at app//org.apache.solr.schema.ManagedIndexSchemaFactory.create(ManagedIndexSchemaFactory.java:51)
        at app//org.apache.solr.core.ConfigSetService.createIndexSchema(ConfigSetService.java:316)
        at app//org.apache.solr.core.ConfigSetService.lambda$loadConfigSet$0(ConfigSetService.java:247)
        at app//org.apache.solr.core.ConfigSetService$$Lambda$620/0x0000000801203b58.get(Unknown Source)
        at app//org.apache.solr.core.ConfigSet.<init>(ConfigSet.java:46)
        at app//org.apache.solr.core.ConfigSetService.loadConfigSet(ConfigSetService.java:247)
        at app//org.apache.solr.core.CoreContainer.reload(CoreContainer.java:1708)
        at app//org.apache.solr.core.SolrCore.lambda$getConfListener$21(SolrCore.java:3140)
        at app//org.apache.solr.core.SolrCore$$Lambda$735/0x0000000801354a28.run(Unknown Source)
        at app//org.apache.solr.cloud.ZkController.lambda$fireEventListeners$17(ZkController.java:2473)
        at app//org.apache.solr.cloud.ZkController$$Lambda$831/0x0000000801397528.run(Unknown Source)
        at java.base@17/java.lang.Thread.run(Thread.java:833)

Stack Trace:
com.carrotsearch.randomizedtesting.ThreadLeakError: 1 thread leaked from SUITE scope at org.apache.solr.handler.designer.TestSchemaDesignerSettingsDAO: 
   1) Thread[id=1853, name=ZKEventListenerThread, state=TIMED_WAITING, group=TGRP-TestSchemaDesignerSettingsDAO]
        at java.base@17/java.lang.Thread.sleep(Native Method)
        at app//org.apache.solr.common.cloud.ZkCmdExecutor.retryDelay(ZkCmdExecutor.java:156)
        at app//org.apache.solr.common.cloud.ZkCmdExecutor.retryOperation(ZkCmdExecutor.java:89)
        at app//org.apache.solr.common.cloud.SolrZkClient.exists(SolrZkClient.java:307)
        at app//org.apache.solr.cloud.ZkController.pathExists(ZkController.java:1118)
        at app//org.apache.solr.cloud.ZkSolrResourceLoader.openResource(ZkSolrResourceLoader.java:80)
        at app//org.apache.lucene.analysis.synonym.SynonymGraphFilterFactory.loadSynonyms(SynonymGraphFilterFactory.java:191)
        at app//org.apache.lucene.analysis.synonym.SynonymGraphFilterFactory.inform(SynonymGraphFilterFactory.java:161)
        at app//org.apache.solr.core.SolrResourceLoader.informAware(SolrResourceLoader.java:727)
        at app//org.apache.solr.schema.ManagedIndexSchema.informResourceLoaderAwareObjectsInChain(ManagedIndexSchema.java:1353)
        at app//org.apache.solr.schema.ManagedIndexSchema.informResourceLoaderAwareObjectsForFieldType(ManagedIndexSchema.java:1215)
        at app//org.apache.solr.schema.ManagedIndexSchema.postReadInform(ManagedIndexSchema.java:1191)
        at app//org.apache.solr.schema.IndexSchema.readSchema(IndexSchema.java:615)
        at app//org.apache.solr.schema.IndexSchema.<init>(IndexSchema.java:177)
        at app//org.apache.solr.schema.ManagedIndexSchema.<init>(ManagedIndexSchema.java:108)
        at app//org.apache.solr.schema.ManagedIndexSchemaFactory.create(ManagedIndexSchemaFactory.java:244)
        at app//org.apache.solr.schema.ManagedIndexSchemaFactory.create(ManagedIndexSchemaFactory.java:51)
        at app//org.apache.solr.core.ConfigSetService.createIndexSchema(ConfigSetService.java:316)
        at app//org.apache.solr.core.ConfigSetService.lambda$loadConfigSet$0(ConfigSetService.java:247)
        at app//org.apache.solr.core.ConfigSetService$$Lambda$620/0x0000000801203b58.get(Unknown Source)
        at app//org.apache.solr.core.ConfigSet.<init>(ConfigSet.java:46)
        at app//org.apache.solr.core.ConfigSetService.loadConfigSet(ConfigSetService.java:247)
        at app//org.apache.solr.core.CoreContainer.reload(CoreContainer.java:1708)
        at app//org.apache.solr.core.SolrCore.lambda$getConfListener$21(SolrCore.java:3140)
        at app//org.apache.solr.core.SolrCore$$Lambda$735/0x0000000801354a28.run(Unknown Source)
        at app//org.apache.solr.cloud.ZkController.lambda$fireEventListeners$17(ZkController.java:2473)
        at app//org.apache.solr.cloud.ZkController$$Lambda$831/0x0000000801397528.run(Unknown Source)
        at java.base@17/java.lang.Thread.run(Thread.java:833)
	at __randomizedtesting.SeedInfo.seed([65DC64655136B86]:0)


FAILED:  org.apache.solr.prometheus.exporter.SolrExporterIntegrationTest.jsonFacetMetrics

Error Message:
java.lang.AssertionError: Metric must have name and value: solr_metrics_jvm_buffers{pool="mapped - 'non-volatile memory'",base_url="http://127.0.0.1:53669/solr",} 0.0 expected:<2> but was:<5>

Stack Trace:
java.lang.AssertionError: Metric must have name and value: solr_metrics_jvm_buffers{pool="mapped - 'non-volatile memory'",base_url="http://127.0.0.1:53669/solr",} 0.0 expected:<2> but was:<5>
	at __randomizedtesting.SeedInfo.seed([65DC64655136B86:350831C803C8EDB8]:0)
	at org.junit.Assert.fail(Assert.java:89)
	at org.junit.Assert.failNotEquals(Assert.java:835)
	at org.junit.Assert.assertEquals(Assert.java:647)
	at org.apache.solr.prometheus.exporter.SolrExporterTestBase.getAllMetrics(SolrExporterTestBase.java:110)
	at org.apache.solr.prometheus.exporter.SolrExporterTestBase.startMetricsExporterWithConfiguration(SolrExporterTestBase.java:79)
	at org.apache.solr.prometheus.exporter.SolrExporterIntegrationTest.setUp(SolrExporterIntegrationTest.java:34)
	at java.base/jdk.internal.reflect.NativeMethodAccessorImpl.invoke0(Native Method)
	at java.base/jdk.internal.reflect.NativeMethodAccessorImpl.invoke(NativeMethodAccessorImpl.java:77)
	at java.base/jdk.internal.reflect.DelegatingMethodAccessorImpl.invoke(DelegatingMethodAccessorImpl.java:43)
	at java.base/java.lang.reflect.Method.invoke(Method.java:568)
	at com.carrotsearch.randomizedtesting.RandomizedRunner.invoke(RandomizedRunner.java:1754)
	at com.carrotsearch.randomizedtesting.RandomizedRunner$9.evaluate(RandomizedRunner.java:976)
	at com.carrotsearch.randomizedtesting.RandomizedRunner$10.evaluate(RandomizedRunner.java:992)
	at com.carrotsearch.randomizedtesting.rules.SystemPropertiesRestoreRule$1.evaluate(SystemPropertiesRestoreRule.java:57)
	at org.junit.rules.RunRules.evaluate(RunRules.java:20)
	at org.apache.lucene.util.TestRuleSetupTeardownChained$1.evaluate(TestRuleSetupTeardownChained.java:44)
	at org.apache.lucene.util.AbstractBeforeAfterRule$1.evaluate(AbstractBeforeAfterRule.java:43)
	at org.apache.lucene.util.TestRuleThreadAndTestName$1.evaluate(TestRuleThreadAndTestName.java:45)
	at org.apache.lucene.util.TestRuleIgnoreAfterMaxFailures$1.evaluate(TestRuleIgnoreAfterMaxFailures.java:60)
	at org.apache.lucene.util.TestRuleMarkFailure$1.evaluate(TestRuleMarkFailure.java:44)
	at org.junit.rules.RunRules.evaluate(RunRules.java:20)
	at com.carrotsearch.randomizedtesting.rules.StatementAdapter.evaluate(StatementAdapter.java:36)
	at com.carrotsearch.randomizedtesting.ThreadLeakControl$StatementRunner.run(ThreadLeakControl.java:370)
	at com.carrotsearch.randomizedtesting.ThreadLeakControl.forkTimeoutingTask(ThreadLeakControl.java:819)
	at com.carrotsearch.randomizedtesting.ThreadLeakControl$3.evaluate(ThreadLeakControl.java:470)
	at com.carrotsearch.randomizedtesting.RandomizedRunner.runSingleTest(RandomizedRunner.java:951)
	at com.carrotsearch.randomizedtesting.RandomizedRunner$5.evaluate(RandomizedRunner.java:836)
	at com.carrotsearch.randomizedtesting.RandomizedRunner$6.evaluate(RandomizedRunner.java:887)
	at com.carrotsearch.randomizedtesting.RandomizedRunner$7.evaluate(RandomizedRunner.java:898)
	at com.carrotsearch.randomizedtesting.rules.StatementAdapter.evaluate(StatementAdapter.java:36)
	at org.apache.lucene.util.AbstractBeforeAfterRule$1.evaluate(AbstractBeforeAfterRule.java:43)
	at org.apache.lucene.util.AbstractBeforeAfterRule$1.evaluate(AbstractBeforeAfterRule.java:43)
	at com.carrotsearch.randomizedtesting.rules.SystemPropertiesRestoreRule$1.evaluate(SystemPropertiesRestoreRule.java:57)
	at org.junit.rules.RunRules.evaluate(RunRules.java:20)
	at org.apache.lucene.util.AbstractBeforeAfterRule$1.evaluate(AbstractBeforeAfterRule.java:43)
	at com.carrotsearch.randomizedtesting.rules.StatementAdapter.evaluate(StatementAdapter.java:36)
	at org.apache.lucene.util.TestRuleStoreClassName$1.evaluate(TestRuleStoreClassName.java:38)
	at com.carrotsearch.randomizedtesting.rules.NoShadowingOrOverridesOnMethodsRule$1.evaluate(NoShadowingOrOverridesOnMethodsRule.java:40)
	at com.carrotsearch.randomizedtesting.rules.NoShadowingOrOverridesOnMethodsRule$1.evaluate(NoShadowingOrOverridesOnMethodsRule.java:40)
	at com.carrotsearch.randomizedtesting.rules.StatementAdapter.evaluate(StatementAdapter.java:36)
	at com.carrotsearch.randomizedtesting.rules.StatementAdapter.evaluate(StatementAdapter.java:36)
	at org.apache.lucene.util.TestRuleAssertionsRequired$1.evaluate(TestRuleAssertionsRequired.java:53)
	at org.apache.lucene.util.AbstractBeforeAfterRule$1.evaluate(AbstractBeforeAfterRule.java:43)
	at org.apache.lucene.util.TestRuleMarkFailure$1.evaluate(TestRuleMarkFailure.java:44)
	at org.apache.lucene.util.TestRuleIgnoreAfterMaxFailures$1.evaluate(TestRuleIgnoreAfterMaxFailures.java:60)
	at org.apache.lucene.util.TestRuleIgnoreTestSuites$1.evaluate(TestRuleIgnoreTestSuites.java:47)
	at org.junit.rules.RunRules.evaluate(RunRules.java:20)
	at com.carrotsearch.randomizedtesting.rules.StatementAdapter.evaluate(StatementAdapter.java:36)
	at com.carrotsearch.randomizedtesting.ThreadLeakControl$StatementRunner.run(ThreadLeakControl.java:370)
	at com.carrotsearch.randomizedtesting.ThreadLeakControl.lambda$forkTimeoutingTask$0(ThreadLeakControl.java:826)
	at java.base/java.lang.Thread.run(Thread.java:833)


FAILED:  org.apache.solr.prometheus.exporter.SolrExporterIntegrationTest.collectionMetrics

Error Message:
java.lang.AssertionError: Metric must have name and value: solr_metrics_jvm_buffers{pool="mapped - 'non-volatile memory'",base_url="http://127.0.0.1:53669/solr",} 0.0 expected:<2> but was:<5>

Stack Trace:
java.lang.AssertionError: Metric must have name and value: solr_metrics_jvm_buffers{pool="mapped - 'non-volatile memory'",base_url="http://127.0.0.1:53669/solr",} 0.0 expected:<2> but was:<5>
	at __randomizedtesting.SeedInfo.seed([65DC64655136B86:7002B903687743C5]:0)
	at org.junit.Assert.fail(Assert.java:89)
	at org.junit.Assert.failNotEquals(Assert.java:835)
	at org.junit.Assert.assertEquals(Assert.java:647)
	at org.apache.solr.prometheus.exporter.SolrExporterTestBase.getAllMetrics(SolrExporterTestBase.java:110)
	at org.apache.solr.prometheus.exporter.SolrExporterTestBase.startMetricsExporterWithConfiguration(SolrExporterTestBase.java:79)
	at org.apache.solr.prometheus.exporter.SolrExporterIntegrationTest.setUp(SolrExporterIntegrationTest.java:34)
	at java.base/jdk.internal.reflect.NativeMethodAccessorImpl.invoke0(Native Method)
	at java.base/jdk.internal.reflect.NativeMethodAccessorImpl.invoke(NativeMethodAccessorImpl.java:77)
	at java.base/jdk.internal.reflect.DelegatingMethodAccessorImpl.invoke(DelegatingMethodAccessorImpl.java:43)
	at java.base/java.lang.reflect.Method.invoke(Method.java:568)
	at com.carrotsearch.randomizedtesting.RandomizedRunner.invoke(RandomizedRunner.java:1754)
	at com.carrotsearch.randomizedtesting.RandomizedRunner$9.evaluate(RandomizedRunner.java:976)
	at com.carrotsearch.randomizedtesting.RandomizedRunner$10.evaluate(RandomizedRunner.java:992)
	at com.carrotsearch.randomizedtesting.rules.SystemPropertiesRestoreRule$1.evaluate(SystemPropertiesRestoreRule.java:57)
	at org.junit.rules.RunRules.evaluate(RunRules.java:20)
	at org.apache.lucene.util.TestRuleSetupTeardownChained$1.evaluate(TestRuleSetupTeardownChained.java:44)
	at org.apache.lucene.util.AbstractBeforeAfterRule$1.evaluate(AbstractBeforeAfterRule.java:43)
	at org.apache.lucene.util.TestRuleThreadAndTestName$1.evaluate(TestRuleThreadAndTestName.java:45)
	at org.apache.lucene.util.TestRuleIgnoreAfterMaxFailures$1.evaluate(TestRuleIgnoreAfterMaxFailures.java:60)
	at org.apache.lucene.util.TestRuleMarkFailure$1.evaluate(TestRuleMarkFailure.java:44)
	at org.junit.rules.RunRules.evaluate(RunRules.java:20)
	at com.carrotsearch.randomizedtesting.rules.StatementAdapter.evaluate(StatementAdapter.java:36)
	at com.carrotsearch.randomizedtesting.ThreadLeakControl$StatementRunner.run(ThreadLeakControl.java:370)
	at com.carrotsearch.randomizedtesting.ThreadLeakControl.forkTimeoutingTask(ThreadLeakControl.java:819)
	at com.carrotsearch.randomizedtesting.ThreadLeakControl$3.evaluate(ThreadLeakControl.java:470)
	at com.carrotsearch.randomizedtesting.RandomizedRunner.runSingleTest(RandomizedRunner.java:951)
	at com.carrotsearch.randomizedtesting.RandomizedRunner$5.evaluate(RandomizedRunner.java:836)
	at com.carrotsearch.randomizedtesting.RandomizedRunner$6.evaluate(RandomizedRunner.java:887)
	at com.carrotsearch.randomizedtesting.RandomizedRunner$7.evaluate(RandomizedRunner.java:898)
	at com.carrotsearch.randomizedtesting.rules.StatementAdapter.evaluate(StatementAdapter.java:36)
	at org.apache.lucene.util.AbstractBeforeAfterRule$1.evaluate(AbstractBeforeAfterRule.java:43)
	at org.apache.lucene.util.AbstractBeforeAfterRule$1.evaluate(AbstractBeforeAfterRule.java:43)
	at com.carrotsearch.randomizedtesting.rules.SystemPropertiesRestoreRule$1.evaluate(SystemPropertiesRestoreRule.java:57)
	at org.junit.rules.RunRules.evaluate(RunRules.java:20)
	at org.apache.lucene.util.AbstractBeforeAfterRule$1.evaluate(AbstractBeforeAfterRule.java:43)
	at com.carrotsearch.randomizedtesting.rules.StatementAdapter.evaluate(StatementAdapter.java:36)
	at org.apache.lucene.util.TestRuleStoreClassName$1.evaluate(TestRuleStoreClassName.java:38)
	at com.carrotsearch.randomizedtesting.rules.NoShadowingOrOverridesOnMethodsRule$1.evaluate(NoShadowingOrOverridesOnMethodsRule.java:40)
	at com.carrotsearch.randomizedtesting.rules.NoShadowingOrOverridesOnMethodsRule$1.evaluate(NoShadowingOrOverridesOnMethodsRule.java:40)
	at com.carrotsearch.randomizedtesting.rules.StatementAdapter.evaluate(StatementAdapter.java:36)
	at com.carrotsearch.randomizedtesting.rules.StatementAdapter.evaluate(StatementAdapter.java:36)
	at org.apache.lucene.util.TestRuleAssertionsRequired$1.evaluate(TestRuleAssertionsRequired.java:53)
	at org.apache.lucene.util.AbstractBeforeAfterRule$1.evaluate(AbstractBeforeAfterRule.java:43)
	at org.apache.lucene.util.TestRuleMarkFailure$1.evaluate(TestRuleMarkFailure.java:44)
	at org.apache.lucene.util.TestRuleIgnoreAfterMaxFailures$1.evaluate(TestRuleIgnoreAfterMaxFailures.java:60)
	at org.apache.lucene.util.TestRuleIgnoreTestSuites$1.evaluate(TestRuleIgnoreTestSuites.java:47)
	at org.junit.rules.RunRules.evaluate(RunRules.java:20)
	at com.carrotsearch.randomizedtesting.rules.StatementAdapter.evaluate(StatementAdapter.java:36)
	at com.carrotsearch.randomizedtesting.ThreadLeakControl$StatementRunner.run(ThreadLeakControl.java:370)
	at com.carrotsearch.randomizedtesting.ThreadLeakControl.lambda$forkTimeoutingTask$0(ThreadLeakControl.java:826)
	at java.base/java.lang.Thread.run(Thread.java:833)


FAILED:  org.apache.solr.prometheus.exporter.SolrExporterIntegrationTest.solrExporterDurationMetric

Error Message:
java.lang.AssertionError: Metric must have name and value: solr_metrics_jvm_buffers{pool="mapped - 'non-volatile memory'",base_url="http://127.0.0.1:53669/solr",} 0.0 expected:<2> but was:<5>

Stack Trace:
java.lang.AssertionError: Metric must have name and value: solr_metrics_jvm_buffers{pool="mapped - 'non-volatile memory'",base_url="http://127.0.0.1:53669/solr",} 0.0 expected:<2> but was:<5>
	at __randomizedtesting.SeedInfo.seed([65DC64655136B86:BD58BD0ACB8E5E75]:0)
	at org.junit.Assert.fail(Assert.java:89)
	at org.junit.Assert.failNotEquals(Assert.java:835)
	at org.junit.Assert.assertEquals(Assert.java:647)
	at org.apache.solr.prometheus.exporter.SolrExporterTestBase.getAllMetrics(SolrExporterTestBase.java:110)
	at org.apache.solr.prometheus.exporter.SolrExporterTestBase.startMetricsExporterWithConfiguration(SolrExporterTestBase.java:79)
	at org.apache.solr.prometheus.exporter.SolrExporterIntegrationTest.setUp(SolrExporterIntegrationTest.java:34)
	at java.base/jdk.internal.reflect.NativeMethodAccessorImpl.invoke0(Native Method)
	at java.base/jdk.internal.reflect.NativeMethodAccessorImpl.invoke(NativeMethodAccessorImpl.java:77)
	at java.base/jdk.internal.reflect.DelegatingMethodAccessorImpl.invoke(DelegatingMethodAccessorImpl.java:43)
	at java.base/java.lang.reflect.Method.invoke(Method.java:568)
	at com.carrotsearch.randomizedtesting.RandomizedRunner.invoke(RandomizedRunner.java:1754)
	at com.carrotsearch.randomizedtesting.RandomizedRunner$9.evaluate(RandomizedRunner.java:976)
	at com.carrotsearch.randomizedtesting.RandomizedRunner$10.evaluate(RandomizedRunner.java:992)
	at com.carrotsearch.randomizedtesting.rules.SystemPropertiesRestoreRule$1.evaluate(SystemPropertiesRestoreRule.java:57)
	at org.junit.rules.RunRules.evaluate(RunRules.java:20)
	at org.apache.lucene.util.TestRuleSetupTeardownChained$1.evaluate(TestRuleSetupTeardownChained.java:44)
	at org.apache.lucene.util.AbstractBeforeAfterRule$1.evaluate(AbstractBeforeAfterRule.java:43)
	at org.apache.lucene.util.TestRuleThreadAndTestName$1.evaluate(TestRuleThreadAndTestName.java:45)
	at org.apache.lucene.util.TestRuleIgnoreAfterMaxFailures$1.evaluate(TestRuleIgnoreAfterMaxFailures.java:60)
	at org.apache.lucene.util.TestRuleMarkFailure$1.evaluate(TestRuleMarkFailure.java:44)
	at org.junit.rules.RunRules.evaluate(RunRules.java:20)
	at com.carrotsearch.randomizedtesting.rules.StatementAdapter.evaluate(StatementAdapter.java:36)
	at com.carrotsearch.randomizedtesting.ThreadLeakControl$StatementRunner.run(ThreadLeakControl.java:370)
	at com.carrotsearch.randomizedtesting.ThreadLeakControl.forkTimeoutingTask(ThreadLeakControl.java:819)
	at com.carrotsearch.randomizedtesting.ThreadLeakControl$3.evaluate(ThreadLeakControl.java:470)
	at com.carrotsearch.randomizedtesting.RandomizedRunner.runSingleTest(RandomizedRunner.java:951)
	at com.carrotsearch.randomizedtesting.RandomizedRunner$5.evaluate(RandomizedRunner.java:836)
	at com.carrotsearch.randomizedtesting.RandomizedRunner$6.evaluate(RandomizedRunner.java:887)
	at com.carrotsearch.randomizedtesting.RandomizedRunner$7.evaluate(RandomizedRunner.java:898)
	at com.carrotsearch.randomizedtesting.rules.StatementAdapter.evaluate(StatementAdapter.java:36)
	at org.apache.lucene.util.AbstractBeforeAfterRule$1.evaluate(AbstractBeforeAfterRule.java:43)
	at org.apache.lucene.util.AbstractBeforeAfterRule$1.evaluate(AbstractBeforeAfterRule.java:43)
	at com.carrotsearch.randomizedtesting.rules.SystemPropertiesRestoreRule$1.evaluate(SystemPropertiesRestoreRule.java:57)
	at org.junit.rules.RunRules.evaluate(RunRules.java:20)
	at org.apache.lucene.util.AbstractBeforeAfterRule$1.evaluate(AbstractBeforeAfterRule.java:43)
	at com.carrotsearch.randomizedtesting.rules.StatementAdapter.evaluate(StatementAdapter.java:36)
	at org.apache.lucene.util.TestRuleStoreClassName$1.evaluate(TestRuleStoreClassName.java:38)
	at com.carrotsearch.randomizedtesting.rules.NoShadowingOrOverridesOnMethodsRule$1.evaluate(NoShadowingOrOverridesOnMethodsRule.java:40)
	at com.carrotsearch.randomizedtesting.rules.NoShadowingOrOverridesOnMethodsRule$1.evaluate(NoShadowingOrOverridesOnMethodsRule.java:40)
	at com.carrotsearch.randomizedtesting.rules.StatementAdapter.evaluate(StatementAdapter.java:36)
	at com.carrotsearch.randomizedtesting.rules.StatementAdapter.evaluate(StatementAdapter.java:36)
	at org.apache.lucene.util.TestRuleAssertionsRequired$1.evaluate(TestRuleAssertionsRequired.java:53)
	at org.apache.lucene.util.AbstractBeforeAfterRule$1.evaluate(AbstractBeforeAfterRule.java:43)
	at org.apache.lucene.util.TestRuleMarkFailure$1.evaluate(TestRuleMarkFailure.java:44)
	at org.apache.lucene.util.TestRuleIgnoreAfterMaxFailures$1.evaluate(TestRuleIgnoreAfterMaxFailures.java:60)
	at org.apache.lucene.util.TestRuleIgnoreTestSuites$1.evaluate(TestRuleIgnoreTestSuites.java:47)
	at org.junit.rules.RunRules.evaluate(RunRules.java:20)
	at com.carrotsearch.randomizedtesting.rules.StatementAdapter.evaluate(StatementAdapter.java:36)
	at com.carrotsearch.randomizedtesting.ThreadLeakControl$StatementRunner.run(ThreadLeakControl.java:370)
	at com.carrotsearch.randomizedtesting.ThreadLeakControl.lambda$forkTimeoutingTask$0(ThreadLeakControl.java:826)
	at java.base/java.lang.Thread.run(Thread.java:833)


FAILED:  org.apache.solr.prometheus.exporter.SolrExporterIntegrationTest.jvmMetrics

Error Message:
java.lang.AssertionError: Metric must have name and value: solr_metrics_jvm_buffers{pool="mapped - 'non-volatile memory'",base_url="http://127.0.0.1:53669/solr",} 0.0 expected:<2> but was:<5>

Stack Trace:
java.lang.AssertionError: Metric must have name and value: solr_metrics_jvm_buffers{pool="mapped - 'non-volatile memory'",base_url="http://127.0.0.1:53669/solr",} 0.0 expected:<2> but was:<5>
	at __randomizedtesting.SeedInfo.seed([65DC64655136B86:D5E9FBA940FDA712]:0)
	at org.junit.Assert.fail(Assert.java:89)
	at org.junit.Assert.failNotEquals(Assert.java:835)
	at org.junit.Assert.assertEquals(Assert.java:647)
	at org.apache.solr.prometheus.exporter.SolrExporterTestBase.getAllMetrics(SolrExporterTestBase.java:110)
	at org.apache.solr.prometheus.exporter.SolrExporterTestBase.startMetricsExporterWithConfiguration(SolrExporterTestBase.java:79)
	at org.apache.solr.prometheus.exporter.SolrExporterIntegrationTest.setUp(SolrExporterIntegrationTest.java:34)
	at java.base/jdk.internal.reflect.NativeMethodAccessorImpl.invoke0(Native Method)
	at java.base/jdk.internal.reflect.NativeMethodAccessorImpl.invoke(NativeMethodAccessorImpl.java:77)
	at java.base/jdk.internal.reflect.DelegatingMethodAccessorImpl.invoke(DelegatingMethodAccessorImpl.java:43)
	at java.base/java.lang.reflect.Method.invoke(Method.java:568)
	at com.carrotsearch.randomizedtesting.RandomizedRunner.invoke(RandomizedRunner.java:1754)
	at com.carrotsearch.randomizedtesting.RandomizedRunner$9.evaluate(RandomizedRunner.java:976)
	at com.carrotsearch.randomizedtesting.RandomizedRunner$10.evaluate(RandomizedRunner.java:992)
	at com.carrotsearch.randomizedtesting.rules.SystemPropertiesRestoreRule$1.evaluate(SystemPropertiesRestoreRule.java:57)
	at org.junit.rules.RunRules.evaluate(RunRules.java:20)
	at org.apache.lucene.util.TestRuleSetupTeardownChained$1.evaluate(TestRuleSetupTeardownChained.java:44)
	at org.apache.lucene.util.AbstractBeforeAfterRule$1.evaluate(AbstractBeforeAfterRule.java:43)
	at org.apache.lucene.util.TestRuleThreadAndTestName$1.evaluate(TestRuleThreadAndTestName.java:45)
	at org.apache.lucene.util.TestRuleIgnoreAfterMaxFailures$1.evaluate(TestRuleIgnoreAfterMaxFailures.java:60)
	at org.apache.lucene.util.TestRuleMarkFailure$1.evaluate(TestRuleMarkFailure.java:44)
	at org.junit.rules.RunRules.evaluate(RunRules.java:20)
	at com.carrotsearch.randomizedtesting.rules.StatementAdapter.evaluate(StatementAdapter.java:36)
	at com.carrotsearch.randomizedtesting.ThreadLeakControl$StatementRunner.run(ThreadLeakControl.java:370)
	at com.carrotsearch.randomizedtesting.ThreadLeakControl.forkTimeoutingTask(ThreadLeakControl.java:819)
	at com.carrotsearch.randomizedtesting.ThreadLeakControl$3.evaluate(ThreadLeakControl.java:470)
	at com.carrotsearch.randomizedtesting.RandomizedRunner.runSingleTest(RandomizedRunner.java:951)
	at com.carrotsearch.randomizedtesting.RandomizedRunner$5.evaluate(RandomizedRunner.java:836)
	at com.carrotsearch.randomizedtesting.RandomizedRunner$6.evaluate(RandomizedRunner.java:887)
	at com.carrotsearch.randomizedtesting.RandomizedRunner$7.evaluate(RandomizedRunner.java:898)
	at com.carrotsearch.randomizedtesting.rules.StatementAdapter.evaluate(StatementAdapter.java:36)
	at org.apache.lucene.util.AbstractBeforeAfterRule$1.evaluate(AbstractBeforeAfterRule.java:43)
	at org.apache.lucene.util.AbstractBeforeAfterRule$1.evaluate(AbstractBeforeAfterRule.java:43)
	at com.carrotsearch.randomizedtesting.rules.SystemPropertiesRestoreRule$1.evaluate(SystemPropertiesRestoreRule.java:57)
	at org.junit.rules.RunRules.evaluate(RunRules.java:20)
	at org.apache.lucene.util.AbstractBeforeAfterRule$1.evaluate(AbstractBeforeAfterRule.java:43)
	at com.carrotsearch.randomizedtesting.rules.StatementAdapter.evaluate(StatementAdapter.java:36)
	at org.apache.lucene.util.TestRuleStoreClassName$1.evaluate(TestRuleStoreClassName.java:38)
	at com.carrotsearch.randomizedtesting.rules.NoShadowingOrOverridesOnMethodsRule$1.evaluate(NoShadowingOrOverridesOnMethodsRule.java:40)
	at com.carrotsearch.randomizedtesting.rules.NoShadowingOrOverridesOnMethodsRule$1.evaluate(NoShadowingOrOverridesOnMethodsRule.java:40)
	at com.carrotsearch.randomizedtesting.rules.StatementAdapter.evaluate(StatementAdapter.java:36)
	at com.carrotsearch.randomizedtesting.rules.StatementAdapter.evaluate(StatementAdapter.java:36)
	at org.apache.lucene.util.TestRuleAssertionsRequired$1.evaluate(TestRuleAssertionsRequired.java:53)
	at org.apache.lucene.util.AbstractBeforeAfterRule$1.evaluate(AbstractBeforeAfterRule.java:43)
	at org.apache.lucene.util.TestRuleMarkFailure$1.evaluate(TestRuleMarkFailure.java:44)
	at org.apache.lucene.util.TestRuleIgnoreAfterMaxFailures$1.evaluate(TestRuleIgnoreAfterMaxFailures.java:60)
	at org.apache.lucene.util.TestRuleIgnoreTestSuites$1.evaluate(TestRuleIgnoreTestSuites.java:47)
	at org.junit.rules.RunRules.evaluate(RunRules.java:20)
	at com.carrotsearch.randomizedtesting.rules.StatementAdapter.evaluate(StatementAdapter.java:36)
	at com.carrotsearch.randomizedtesting.ThreadLeakControl$StatementRunner.run(ThreadLeakControl.java:370)
	at com.carrotsearch.randomizedtesting.ThreadLeakControl.lambda$forkTimeoutingTask$0(ThreadLeakControl.java:826)
	at java.base/java.lang.Thread.run(Thread.java:833)


FAILED:  org.apache.solr.prometheus.exporter.SolrExporterIntegrationTest.pingAllCollectionsAndCoresAreAvailable

Error Message:
java.lang.AssertionError: Metric must have name and value: solr_metrics_jvm_buffers{pool="mapped - 'non-volatile memory'",base_url="http://127.0.0.1:53669/solr",} 0.0 expected:<2> but was:<5>

Stack Trace:
java.lang.AssertionError: Metric must have name and value: solr_metrics_jvm_buffers{pool="mapped - 'non-volatile memory'",base_url="http://127.0.0.1:53669/solr",} 0.0 expected:<2> but was:<5>
	at __randomizedtesting.SeedInfo.seed([65DC64655136B86:EEC6A869945D2B54]:0)
	at org.junit.Assert.fail(Assert.java:89)
	at org.junit.Assert.failNotEquals(Assert.java:835)
	at org.junit.Assert.assertEquals(Assert.java:647)
	at org.apache.solr.prometheus.exporter.SolrExporterTestBase.getAllMetrics(SolrExporterTestBase.java:110)
	at org.apache.solr.prometheus.exporter.SolrExporterTestBase.startMetricsExporterWithConfiguration(SolrExporterTestBase.java:79)
	at org.apache.solr.prometheus.exporter.SolrExporterIntegrationTest.setUp(SolrExporterIntegrationTest.java:34)
	at java.base/jdk.internal.reflect.NativeMethodAccessorImpl.invoke0(Native Method)
	at java.base/jdk.internal.reflect.NativeMethodAccessorImpl.invoke(NativeMethodAccessorImpl.java:77)
	at java.base/jdk.internal.reflect.DelegatingMethodAccessorImpl.invoke(DelegatingMethodAccessorImpl.java:43)
	at java.base/java.lang.reflect.Method.invoke(Method.java:568)
	at com.carrotsearch.randomizedtesting.RandomizedRunner.invoke(RandomizedRunner.java:1754)
	at com.carrotsearch.randomizedtesting.RandomizedRunner$9.evaluate(RandomizedRunner.java:976)
	at com.carrotsearch.randomizedtesting.RandomizedRunner$10.evaluate(RandomizedRunner.java:992)
	at com.carrotsearch.randomizedtesting.rules.SystemPropertiesRestoreRule$1.evaluate(SystemPropertiesRestoreRule.java:57)
	at org.junit.rules.RunRules.evaluate(RunRules.java:20)
	at org.apache.lucene.util.TestRuleSetupTeardownChained$1.evaluate(TestRuleSetupTeardownChained.java:44)
	at org.apache.lucene.util.AbstractBeforeAfterRule$1.evaluate(AbstractBeforeAfterRule.java:43)
	at org.apache.lucene.util.TestRuleThreadAndTestName$1.evaluate(TestRuleThreadAndTestName.java:45)
	at org.apache.lucene.util.TestRuleIgnoreAfterMaxFailures$1.evaluate(TestRuleIgnoreAfterMaxFailures.java:60)
	at org.apache.lucene.util.TestRuleMarkFailure$1.evaluate(TestRuleMarkFailure.java:44)
	at org.junit.rules.RunRules.evaluate(RunRules.java:20)
	at com.carrotsearch.randomizedtesting.rules.StatementAdapter.evaluate(StatementAdapter.java:36)
	at com.carrotsearch.randomizedtesting.ThreadLeakControl$StatementRunner.run(ThreadLeakControl.java:370)
	at com.carrotsearch.randomizedtesting.ThreadLeakControl.forkTimeoutingTask(ThreadLeakControl.java:819)
	at com.carrotsearch.randomizedtesting.ThreadLeakControl$3.evaluate(ThreadLeakControl.java:470)
	at com.carrotsearch.randomizedtesting.RandomizedRunner.runSingleTest(RandomizedRunner.java:951)
	at com.carrotsearch.randomizedtesting.RandomizedRunner$5.evaluate(RandomizedRunner.java:836)
	at com.carrotsearch.randomizedtesting.RandomizedRunner$6.evaluate(RandomizedRunner.java:887)
	at com.carrotsearch.randomizedtesting.RandomizedRunner$7.evaluate(RandomizedRunner.java:898)
	at com.carrotsearch.randomizedtesting.rules.StatementAdapter.evaluate(StatementAdapter.java:36)
	at org.apache.lucene.util.AbstractBeforeAfterRule$1.evaluate(AbstractBeforeAfterRule.java:43)
	at org.apache.lucene.util.AbstractBeforeAfterRule$1.evaluate(AbstractBeforeAfterRule.java:43)
	at com.carrotsearch.randomizedtesting.rules.SystemPropertiesRestoreRule$1.evaluate(SystemPropertiesRestoreRule.java:57)
	at org.junit.rules.RunRules.evaluate(RunRules.java:20)
	at org.apache.lucene.util.AbstractBeforeAfterRule$1.evaluate(AbstractBeforeAfterRule.java:43)
	at com.carrotsearch.randomizedtesting.rules.StatementAdapter.evaluate(StatementAdapter.java:36)
	at org.apache.lucene.util.TestRuleStoreClassName$1.evaluate(TestRuleStoreClassName.java:38)
	at com.carrotsearch.randomizedtesting.rules.NoShadowingOrOverridesOnMethodsRule$1.evaluate(NoShadowingOrOverridesOnMethodsRule.java:40)
	at com.carrotsearch.randomizedtesting.rules.NoShadowingOrOverridesOnMethodsRule$1.evaluate(NoShadowingOrOverridesOnMethodsRule.java:40)
	at com.carrotsearch.randomizedtesting.rules.StatementAdapter.evaluate(StatementAdapter.java:36)
	at com.carrotsearch.randomizedtesting.rules.StatementAdapter.evaluate(StatementAdapter.java:36)
	at org.apache.lucene.util.TestRuleAssertionsRequired$1.evaluate(TestRuleAssertionsRequired.java:53)
	at org.apache.lucene.util.AbstractBeforeAfterRule$1.evaluate(AbstractBeforeAfterRule.java:43)
	at org.apache.lucene.util.TestRuleMarkFailure$1.evaluate(TestRuleMarkFailure.java:44)
	at org.apache.lucene.util.TestRuleIgnoreAfterMaxFailures$1.evaluate(TestRuleIgnoreAfterMaxFailures.java:60)
	at org.apache.lucene.util.TestRuleIgnoreTestSuites$1.evaluate(TestRuleIgnoreTestSuites.java:47)
	at org.junit.rules.RunRules.evaluate(RunRules.java:20)
	at com.carrotsearch.randomizedtesting.rules.StatementAdapter.evaluate(StatementAdapter.java:36)
	at com.carrotsearch.randomizedtesting.ThreadLeakControl$StatementRunner.run(ThreadLeakControl.java:370)
	at com.carrotsearch.randomizedtesting.ThreadLeakControl.lambda$forkTimeoutingTask$0(ThreadLeakControl.java:826)
	at java.base/java.lang.Thread.run(Thread.java:833)

[JENKINS] Solr-main-MacOSX (64bit/jdk-17) - Build # 477 - Failure!

Posted by Policeman Jenkins Server <je...@thetaphi.de>.
Build: https://jenkins.thetaphi.de/job/Solr-main-MacOSX/477/
Java: 64bit/jdk-17 -XX:+UseCompressedOops -XX:+UseParallelGC

6 tests failed.
FAILED:  org.apache.solr.schema.TestBulkSchemaConcurrent.classMethod

Error Message:
com.carrotsearch.randomizedtesting.ThreadLeakError: 6 threads leaked from SUITE scope at org.apache.solr.schema.TestBulkSchemaConcurrent: 
   1) Thread[id=7365, name=searcherExecutor-5926-thread-1, state=WAITING, group=TGRP-TestBulkSchemaConcurrent]
        at java.base@17/jdk.internal.misc.Unsafe.park(Native Method)
        at java.base@17/java.util.concurrent.locks.LockSupport.park(LockSupport.java:341)
        at java.base@17/java.util.concurrent.locks.AbstractQueuedSynchronizer$ConditionNode.block(AbstractQueuedSynchronizer.java:506)
        at java.base@17/java.util.concurrent.ForkJoinPool.unmanagedBlock(ForkJoinPool.java:3463)
        at java.base@17/java.util.concurrent.ForkJoinPool.managedBlock(ForkJoinPool.java:3434)
        at java.base@17/java.util.concurrent.locks.AbstractQueuedSynchronizer$ConditionObject.await(AbstractQueuedSynchronizer.java:1623)
        at java.base@17/java.util.concurrent.LinkedBlockingQueue.take(LinkedBlockingQueue.java:435)
        at java.base@17/java.util.concurrent.ThreadPoolExecutor.getTask(ThreadPoolExecutor.java:1062)
        at java.base@17/java.util.concurrent.ThreadPoolExecutor.runWorker(ThreadPoolExecutor.java:1122)
        at java.base@17/java.util.concurrent.ThreadPoolExecutor$Worker.run(ThreadPoolExecutor.java:635)
        at java.base@17/java.lang.Thread.run(Thread.java:833)
   2) Thread[id=7366, name=searcherExecutor-5928-thread-1, state=WAITING, group=TGRP-TestBulkSchemaConcurrent]
        at java.base@17/jdk.internal.misc.Unsafe.park(Native Method)
        at java.base@17/java.util.concurrent.locks.LockSupport.park(LockSupport.java:341)
        at java.base@17/java.util.concurrent.locks.AbstractQueuedSynchronizer$ConditionNode.block(AbstractQueuedSynchronizer.java:506)
        at java.base@17/java.util.concurrent.ForkJoinPool.unmanagedBlock(ForkJoinPool.java:3463)
        at java.base@17/java.util.concurrent.ForkJoinPool.managedBlock(ForkJoinPool.java:3434)
        at java.base@17/java.util.concurrent.locks.AbstractQueuedSynchronizer$ConditionObject.await(AbstractQueuedSynchronizer.java:1623)
        at java.base@17/java.util.concurrent.LinkedBlockingQueue.take(LinkedBlockingQueue.java:435)
        at java.base@17/java.util.concurrent.ThreadPoolExecutor.getTask(ThreadPoolExecutor.java:1062)
        at java.base@17/java.util.concurrent.ThreadPoolExecutor.runWorker(ThreadPoolExecutor.java:1122)
        at java.base@17/java.util.concurrent.ThreadPoolExecutor$Worker.run(ThreadPoolExecutor.java:635)
        at java.base@17/java.lang.Thread.run(Thread.java:833)
   3) Thread[id=7266, name=ZKEventListenerThread, state=WAITING, group=TGRP-TestBulkSchemaConcurrent]
        at java.base@17/jdk.internal.misc.Unsafe.park(Native Method)
        at java.base@17/java.util.concurrent.locks.LockSupport.park(LockSupport.java:211)
        at java.base@17/java.util.concurrent.locks.AbstractQueuedSynchronizer.acquire(AbstractQueuedSynchronizer.java:715)
        at java.base@17/java.util.concurrent.locks.AbstractQueuedSynchronizer.acquire(AbstractQueuedSynchronizer.java:938)
        at java.base@17/java.util.concurrent.locks.ReentrantReadWriteLock$WriteLock.lock(ReentrantReadWriteLock.java:959)
        at java.management@17/com.sun.jmx.mbeanserver.Repository.remove(Repository.java:619)
        at java.management@17/com.sun.jmx.interceptor.DefaultMBeanServerInterceptor.unregisterFromRepository(DefaultMBeanServerInterceptor.java:1906)
        at java.management@17/com.sun.jmx.interceptor.DefaultMBeanServerInterceptor.exclusiveUnregisterMBean(DefaultMBeanServerInterceptor.java:444)
        at java.management@17/com.sun.jmx.interceptor.DefaultMBeanServerInterceptor.unregisterMBean(DefaultMBeanServerInterceptor.java:411)
        at java.management@17/com.sun.jmx.mbeanserver.JmxMBeanServer.unregisterMBean(JmxMBeanServer.java:547)
        at app//org.apache.solr.metrics.reporters.jmx.JmxMetricsReporter$JmxListener.unregisterMBean(JmxMetricsReporter.java:560)
        at app//org.apache.solr.metrics.reporters.jmx.JmxMetricsReporter$JmxListener.unregisterAll(JmxMetricsReporter.java:709)
        at app//org.apache.solr.metrics.reporters.jmx.JmxMetricsReporter.close(JmxMetricsReporter.java:759)
        at app//org.apache.solr.metrics.reporters.SolrJmxReporter.close(SolrJmxReporter.java:129)
        at app//org.apache.solr.metrics.SolrMetricManager.lambda$closeReporters$5(SolrMetricManager.java:1157)
        at app//org.apache.solr.metrics.SolrMetricManager$$Lambda$390/0x00000008010a68d0.accept(Unknown Source)
        at java.base@17/java.lang.Iterable.forEach(Iterable.java:75)
        at app//org.apache.solr.metrics.SolrMetricManager.closeReporters(SolrMetricManager.java:1151)
        at app//org.apache.solr.metrics.SolrCoreMetricManager.close(SolrCoreMetricManager.java:145)
        at app//org.apache.solr.core.SolrCore.close(SolrCore.java:1597)
        at app//org.apache.solr.core.SolrCore.<init>(SolrCore.java:1107)
        at app//org.apache.solr.core.SolrCore.reload(SolrCore.java:746)
        at app//org.apache.solr.core.CoreContainer.reload(CoreContainer.java:1712)
        at app//org.apache.solr.core.SolrCore.lambda$getConfListener$21(SolrCore.java:3140)
        at app//org.apache.solr.core.SolrCore$$Lambda$716/0x0000000801300b30.run(Unknown Source)
        at app//org.apache.solr.cloud.ZkController.lambda$fireEventListeners$17(ZkController.java:2473)
        at app//org.apache.solr.cloud.ZkController$$Lambda$816/0x0000000801343328.run(Unknown Source)
        at java.base@17/java.lang.Thread.run(Thread.java:833)
   4) Thread[id=7359, name=searcherExecutor-5924-thread-1, state=WAITING, group=TGRP-TestBulkSchemaConcurrent]
        at java.base@17/jdk.internal.misc.Unsafe.park(Native Method)
        at java.base@17/java.util.concurrent.locks.LockSupport.park(LockSupport.java:341)
        at java.base@17/java.util.concurrent.locks.AbstractQueuedSynchronizer$ConditionNode.block(AbstractQueuedSynchronizer.java:506)
        at java.base@17/java.util.concurrent.ForkJoinPool.unmanagedBlock(ForkJoinPool.java:3463)
        at java.base@17/java.util.concurrent.ForkJoinPool.managedBlock(ForkJoinPool.java:3434)
        at java.base@17/java.util.concurrent.locks.AbstractQueuedSynchronizer$ConditionObject.await(AbstractQueuedSynchronizer.java:1623)
        at java.base@17/java.util.concurrent.LinkedBlockingQueue.take(LinkedBlockingQueue.java:435)
        at java.base@17/java.util.concurrent.ThreadPoolExecutor.getTask(ThreadPoolExecutor.java:1062)
        at java.base@17/java.util.concurrent.ThreadPoolExecutor.runWorker(ThreadPoolExecutor.java:1122)
        at java.base@17/java.util.concurrent.ThreadPoolExecutor$Worker.run(ThreadPoolExecutor.java:635)
        at java.base@17/java.lang.Thread.run(Thread.java:833)
   5) Thread[id=7264, name=ZKEventListenerThread, state=RUNNABLE, group=TGRP-TestBulkSchemaConcurrent]
        at java.base@17/java.security.AccessController.getStackAccessControlContext(Native Method)
        at java.base@17/java.security.AccessController.checkPermission(AccessController.java:1042)
        at java.base@17/java.lang.SecurityManager.checkPermission(SecurityManager.java:416)
        at java.management@17/com.sun.jmx.interceptor.DefaultMBeanServerInterceptor.checkMBeanPermission(DefaultMBeanServerInterceptor.java:1794)
        at java.management@17/com.sun.jmx.interceptor.DefaultMBeanServerInterceptor.checkMBeanPermission(DefaultMBeanServerInterceptor.java:1776)
        at java.management@17/com.sun.jmx.interceptor.DefaultMBeanServerInterceptor.exclusiveUnregisterMBean(DefaultMBeanServerInterceptor.java:426)
        at java.management@17/com.sun.jmx.interceptor.DefaultMBeanServerInterceptor.unregisterMBean(DefaultMBeanServerInterceptor.java:411)
        at java.management@17/com.sun.jmx.mbeanserver.JmxMBeanServer.unregisterMBean(JmxMBeanServer.java:547)
        at app//org.apache.solr.metrics.reporters.jmx.JmxMetricsReporter$JmxListener.unregisterMBean(JmxMetricsReporter.java:560)
        at app//org.apache.solr.metrics.reporters.jmx.JmxMetricsReporter$JmxListener.unregisterAll(JmxMetricsReporter.java:709)
        at app//org.apache.solr.metrics.reporters.jmx.JmxMetricsReporter.close(JmxMetricsReporter.java:759)
        at app//org.apache.solr.metrics.reporters.SolrJmxReporter.close(SolrJmxReporter.java:129)
        at app//org.apache.solr.metrics.SolrMetricManager.lambda$closeReporters$5(SolrMetricManager.java:1157)
        at app//org.apache.solr.metrics.SolrMetricManager$$Lambda$390/0x00000008010a68d0.accept(Unknown Source)
        at java.base@17/java.lang.Iterable.forEach(Iterable.java:75)
        at app//org.apache.solr.metrics.SolrMetricManager.closeReporters(SolrMetricManager.java:1151)
        at app//org.apache.solr.metrics.SolrCoreMetricManager.close(SolrCoreMetricManager.java:145)
        at app//org.apache.solr.core.SolrCore.close(SolrCore.java:1597)
        at app//org.apache.solr.core.SolrCore.<init>(SolrCore.java:1107)
        at app//org.apache.solr.core.SolrCore.reload(SolrCore.java:746)
        at app//org.apache.solr.core.CoreContainer.reload(CoreContainer.java:1712)
        at app//org.apache.solr.core.SolrCore.lambda$getConfListener$21(SolrCore.java:3140)
        at app//org.apache.solr.core.SolrCore$$Lambda$716/0x0000000801300b30.run(Unknown Source)
        at app//org.apache.solr.cloud.ZkController.lambda$fireEventListeners$17(ZkController.java:2473)
        at app//org.apache.solr.cloud.ZkController$$Lambda$816/0x0000000801343328.run(Unknown Source)
        at java.base@17/java.lang.Thread.run(Thread.java:833)
   6) Thread[id=7268, name=ZKEventListenerThread, state=WAITING, group=TGRP-TestBulkSchemaConcurrent]
        at java.base@17/jdk.internal.misc.Unsafe.park(Native Method)
        at java.base@17/java.util.concurrent.locks.LockSupport.park(LockSupport.java:211)
        at java.base@17/java.util.concurrent.locks.AbstractQueuedSynchronizer.acquire(AbstractQueuedSynchronizer.java:715)
        at java.base@17/java.util.concurrent.locks.AbstractQueuedSynchronizer.acquireShared(AbstractQueuedSynchronizer.java:1027)
        at java.base@17/java.util.concurrent.locks.ReentrantReadWriteLock$ReadLock.lock(ReentrantReadWriteLock.java:738)
        at java.management@17/com.sun.jmx.mbeanserver.Repository.query(Repository.java:525)
        at java.management@17/com.sun.jmx.interceptor.DefaultMBeanServerInterceptor.queryMBeansImpl(DefaultMBeanServerInterceptor.java:508)
        at java.management@17/com.sun.jmx.interceptor.DefaultMBeanServerInterceptor.queryMBeans(DefaultMBeanServerInterceptor.java:477)
        at java.management@17/com.sun.jmx.mbeanserver.JmxMBeanServer.queryMBeans(JmxMBeanServer.java:593)
        at app//org.apache.solr.metrics.reporters.jmx.JmxMetricsReporter$JmxListener.unregisterMBean(JmxMetricsReporter.java:555)
        at app//org.apache.solr.metrics.reporters.jmx.JmxMetricsReporter$JmxListener.unregisterAll(JmxMetricsReporter.java:709)
        at app//org.apache.solr.metrics.reporters.jmx.JmxMetricsReporter.close(JmxMetricsReporter.java:759)
        at app//org.apache.solr.metrics.reporters.SolrJmxReporter.close(SolrJmxReporter.java:129)
        at app//org.apache.solr.metrics.SolrMetricManager.lambda$closeReporters$5(SolrMetricManager.java:1157)
        at app//org.apache.solr.metrics.SolrMetricManager$$Lambda$390/0x00000008010a68d0.accept(Unknown Source)
        at java.base@17/java.lang.Iterable.forEach(Iterable.java:75)
        at app//org.apache.solr.metrics.SolrMetricManager.closeReporters(SolrMetricManager.java:1151)
        at app//org.apache.solr.metrics.SolrCoreMetricManager.close(SolrCoreMetricManager.java:145)
        at app//org.apache.solr.core.SolrCore.close(SolrCore.java:1597)
        at app//org.apache.solr.core.SolrCore.<init>(SolrCore.java:1107)
        at app//org.apache.solr.core.SolrCore.reload(SolrCore.java:746)
        at app//org.apache.solr.core.CoreContainer.reload(CoreContainer.java:1712)
        at app//org.apache.solr.core.SolrCore.lambda$getConfListener$21(SolrCore.java:3140)
        at app//org.apache.solr.core.SolrCore$$Lambda$716/0x0000000801300b30.run(Unknown Source)
        at app//org.apache.solr.cloud.ZkController.lambda$fireEventListeners$17(ZkController.java:2473)
        at app//org.apache.solr.cloud.ZkController$$Lambda$816/0x0000000801343328.run(Unknown Source)
        at java.base@17/java.lang.Thread.run(Thread.java:833)

Stack Trace:
com.carrotsearch.randomizedtesting.ThreadLeakError: 6 threads leaked from SUITE scope at org.apache.solr.schema.TestBulkSchemaConcurrent: 
   1) Thread[id=7365, name=searcherExecutor-5926-thread-1, state=WAITING, group=TGRP-TestBulkSchemaConcurrent]
        at java.base@17/jdk.internal.misc.Unsafe.park(Native Method)
        at java.base@17/java.util.concurrent.locks.LockSupport.park(LockSupport.java:341)
        at java.base@17/java.util.concurrent.locks.AbstractQueuedSynchronizer$ConditionNode.block(AbstractQueuedSynchronizer.java:506)
        at java.base@17/java.util.concurrent.ForkJoinPool.unmanagedBlock(ForkJoinPool.java:3463)
        at java.base@17/java.util.concurrent.ForkJoinPool.managedBlock(ForkJoinPool.java:3434)
        at java.base@17/java.util.concurrent.locks.AbstractQueuedSynchronizer$ConditionObject.await(AbstractQueuedSynchronizer.java:1623)
        at java.base@17/java.util.concurrent.LinkedBlockingQueue.take(LinkedBlockingQueue.java:435)
        at java.base@17/java.util.concurrent.ThreadPoolExecutor.getTask(ThreadPoolExecutor.java:1062)
        at java.base@17/java.util.concurrent.ThreadPoolExecutor.runWorker(ThreadPoolExecutor.java:1122)
        at java.base@17/java.util.concurrent.ThreadPoolExecutor$Worker.run(ThreadPoolExecutor.java:635)
        at java.base@17/java.lang.Thread.run(Thread.java:833)
   2) Thread[id=7366, name=searcherExecutor-5928-thread-1, state=WAITING, group=TGRP-TestBulkSchemaConcurrent]
        at java.base@17/jdk.internal.misc.Unsafe.park(Native Method)
        at java.base@17/java.util.concurrent.locks.LockSupport.park(LockSupport.java:341)
        at java.base@17/java.util.concurrent.locks.AbstractQueuedSynchronizer$ConditionNode.block(AbstractQueuedSynchronizer.java:506)
        at java.base@17/java.util.concurrent.ForkJoinPool.unmanagedBlock(ForkJoinPool.java:3463)
        at java.base@17/java.util.concurrent.ForkJoinPool.managedBlock(ForkJoinPool.java:3434)
        at java.base@17/java.util.concurrent.locks.AbstractQueuedSynchronizer$ConditionObject.await(AbstractQueuedSynchronizer.java:1623)
        at java.base@17/java.util.concurrent.LinkedBlockingQueue.take(LinkedBlockingQueue.java:435)
        at java.base@17/java.util.concurrent.ThreadPoolExecutor.getTask(ThreadPoolExecutor.java:1062)
        at java.base@17/java.util.concurrent.ThreadPoolExecutor.runWorker(ThreadPoolExecutor.java:1122)
        at java.base@17/java.util.concurrent.ThreadPoolExecutor$Worker.run(ThreadPoolExecutor.java:635)
        at java.base@17/java.lang.Thread.run(Thread.java:833)
   3) Thread[id=7266, name=ZKEventListenerThread, state=WAITING, group=TGRP-TestBulkSchemaConcurrent]
        at java.base@17/jdk.internal.misc.Unsafe.park(Native Method)
        at java.base@17/java.util.concurrent.locks.LockSupport.park(LockSupport.java:211)
        at java.base@17/java.util.concurrent.locks.AbstractQueuedSynchronizer.acquire(AbstractQueuedSynchronizer.java:715)
        at java.base@17/java.util.concurrent.locks.AbstractQueuedSynchronizer.acquire(AbstractQueuedSynchronizer.java:938)
        at java.base@17/java.util.concurrent.locks.ReentrantReadWriteLock$WriteLock.lock(ReentrantReadWriteLock.java:959)
        at java.management@17/com.sun.jmx.mbeanserver.Repository.remove(Repository.java:619)
        at java.management@17/com.sun.jmx.interceptor.DefaultMBeanServerInterceptor.unregisterFromRepository(DefaultMBeanServerInterceptor.java:1906)
        at java.management@17/com.sun.jmx.interceptor.DefaultMBeanServerInterceptor.exclusiveUnregisterMBean(DefaultMBeanServerInterceptor.java:444)
        at java.management@17/com.sun.jmx.interceptor.DefaultMBeanServerInterceptor.unregisterMBean(DefaultMBeanServerInterceptor.java:411)
        at java.management@17/com.sun.jmx.mbeanserver.JmxMBeanServer.unregisterMBean(JmxMBeanServer.java:547)
        at app//org.apache.solr.metrics.reporters.jmx.JmxMetricsReporter$JmxListener.unregisterMBean(JmxMetricsReporter.java:560)
        at app//org.apache.solr.metrics.reporters.jmx.JmxMetricsReporter$JmxListener.unregisterAll(JmxMetricsReporter.java:709)
        at app//org.apache.solr.metrics.reporters.jmx.JmxMetricsReporter.close(JmxMetricsReporter.java:759)
        at app//org.apache.solr.metrics.reporters.SolrJmxReporter.close(SolrJmxReporter.java:129)
        at app//org.apache.solr.metrics.SolrMetricManager.lambda$closeReporters$5(SolrMetricManager.java:1157)
        at app//org.apache.solr.metrics.SolrMetricManager$$Lambda$390/0x00000008010a68d0.accept(Unknown Source)
        at java.base@17/java.lang.Iterable.forEach(Iterable.java:75)
        at app//org.apache.solr.metrics.SolrMetricManager.closeReporters(SolrMetricManager.java:1151)
        at app//org.apache.solr.metrics.SolrCoreMetricManager.close(SolrCoreMetricManager.java:145)
        at app//org.apache.solr.core.SolrCore.close(SolrCore.java:1597)
        at app//org.apache.solr.core.SolrCore.<init>(SolrCore.java:1107)
        at app//org.apache.solr.core.SolrCore.reload(SolrCore.java:746)
        at app//org.apache.solr.core.CoreContainer.reload(CoreContainer.java:1712)
        at app//org.apache.solr.core.SolrCore.lambda$getConfListener$21(SolrCore.java:3140)
        at app//org.apache.solr.core.SolrCore$$Lambda$716/0x0000000801300b30.run(Unknown Source)
        at app//org.apache.solr.cloud.ZkController.lambda$fireEventListeners$17(ZkController.java:2473)
        at app//org.apache.solr.cloud.ZkController$$Lambda$816/0x0000000801343328.run(Unknown Source)
        at java.base@17/java.lang.Thread.run(Thread.java:833)
   4) Thread[id=7359, name=searcherExecutor-5924-thread-1, state=WAITING, group=TGRP-TestBulkSchemaConcurrent]
        at java.base@17/jdk.internal.misc.Unsafe.park(Native Method)
        at java.base@17/java.util.concurrent.locks.LockSupport.park(LockSupport.java:341)
        at java.base@17/java.util.concurrent.locks.AbstractQueuedSynchronizer$ConditionNode.block(AbstractQueuedSynchronizer.java:506)
        at java.base@17/java.util.concurrent.ForkJoinPool.unmanagedBlock(ForkJoinPool.java:3463)
        at java.base@17/java.util.concurrent.ForkJoinPool.managedBlock(ForkJoinPool.java:3434)
        at java.base@17/java.util.concurrent.locks.AbstractQueuedSynchronizer$ConditionObject.await(AbstractQueuedSynchronizer.java:1623)
        at java.base@17/java.util.concurrent.LinkedBlockingQueue.take(LinkedBlockingQueue.java:435)
        at java.base@17/java.util.concurrent.ThreadPoolExecutor.getTask(ThreadPoolExecutor.java:1062)
        at java.base@17/java.util.concurrent.ThreadPoolExecutor.runWorker(ThreadPoolExecutor.java:1122)
        at java.base@17/java.util.concurrent.ThreadPoolExecutor$Worker.run(ThreadPoolExecutor.java:635)
        at java.base@17/java.lang.Thread.run(Thread.java:833)
   5) Thread[id=7264, name=ZKEventListenerThread, state=RUNNABLE, group=TGRP-TestBulkSchemaConcurrent]
        at java.base@17/java.security.AccessController.getStackAccessControlContext(Native Method)
        at java.base@17/java.security.AccessController.checkPermission(AccessController.java:1042)
        at java.base@17/java.lang.SecurityManager.checkPermission(SecurityManager.java:416)
        at java.management@17/com.sun.jmx.interceptor.DefaultMBeanServerInterceptor.checkMBeanPermission(DefaultMBeanServerInterceptor.java:1794)
        at java.management@17/com.sun.jmx.interceptor.DefaultMBeanServerInterceptor.checkMBeanPermission(DefaultMBeanServerInterceptor.java:1776)
        at java.management@17/com.sun.jmx.interceptor.DefaultMBeanServerInterceptor.exclusiveUnregisterMBean(DefaultMBeanServerInterceptor.java:426)
        at java.management@17/com.sun.jmx.interceptor.DefaultMBeanServerInterceptor.unregisterMBean(DefaultMBeanServerInterceptor.java:411)
        at java.management@17/com.sun.jmx.mbeanserver.JmxMBeanServer.unregisterMBean(JmxMBeanServer.java:547)
        at app//org.apache.solr.metrics.reporters.jmx.JmxMetricsReporter$JmxListener.unregisterMBean(JmxMetricsReporter.java:560)
        at app//org.apache.solr.metrics.reporters.jmx.JmxMetricsReporter$JmxListener.unregisterAll(JmxMetricsReporter.java:709)
        at app//org.apache.solr.metrics.reporters.jmx.JmxMetricsReporter.close(JmxMetricsReporter.java:759)
        at app//org.apache.solr.metrics.reporters.SolrJmxReporter.close(SolrJmxReporter.java:129)
        at app//org.apache.solr.metrics.SolrMetricManager.lambda$closeReporters$5(SolrMetricManager.java:1157)
        at app//org.apache.solr.metrics.SolrMetricManager$$Lambda$390/0x00000008010a68d0.accept(Unknown Source)
        at java.base@17/java.lang.Iterable.forEach(Iterable.java:75)
        at app//org.apache.solr.metrics.SolrMetricManager.closeReporters(SolrMetricManager.java:1151)
        at app//org.apache.solr.metrics.SolrCoreMetricManager.close(SolrCoreMetricManager.java:145)
        at app//org.apache.solr.core.SolrCore.close(SolrCore.java:1597)
        at app//org.apache.solr.core.SolrCore.<init>(SolrCore.java:1107)
        at app//org.apache.solr.core.SolrCore.reload(SolrCore.java:746)
        at app//org.apache.solr.core.CoreContainer.reload(CoreContainer.java:1712)
        at app//org.apache.solr.core.SolrCore.lambda$getConfListener$21(SolrCore.java:3140)
        at app//org.apache.solr.core.SolrCore$$Lambda$716/0x0000000801300b30.run(Unknown Source)
        at app//org.apache.solr.cloud.ZkController.lambda$fireEventListeners$17(ZkController.java:2473)
        at app//org.apache.solr.cloud.ZkController$$Lambda$816/0x0000000801343328.run(Unknown Source)
        at java.base@17/java.lang.Thread.run(Thread.java:833)
   6) Thread[id=7268, name=ZKEventListenerThread, state=WAITING, group=TGRP-TestBulkSchemaConcurrent]
        at java.base@17/jdk.internal.misc.Unsafe.park(Native Method)
        at java.base@17/java.util.concurrent.locks.LockSupport.park(LockSupport.java:211)
        at java.base@17/java.util.concurrent.locks.AbstractQueuedSynchronizer.acquire(AbstractQueuedSynchronizer.java:715)
        at java.base@17/java.util.concurrent.locks.AbstractQueuedSynchronizer.acquireShared(AbstractQueuedSynchronizer.java:1027)
        at java.base@17/java.util.concurrent.locks.ReentrantReadWriteLock$ReadLock.lock(ReentrantReadWriteLock.java:738)
        at java.management@17/com.sun.jmx.mbeanserver.Repository.query(Repository.java:525)
        at java.management@17/com.sun.jmx.interceptor.DefaultMBeanServerInterceptor.queryMBeansImpl(DefaultMBeanServerInterceptor.java:508)
        at java.management@17/com.sun.jmx.interceptor.DefaultMBeanServerInterceptor.queryMBeans(DefaultMBeanServerInterceptor.java:477)
        at java.management@17/com.sun.jmx.mbeanserver.JmxMBeanServer.queryMBeans(JmxMBeanServer.java:593)
        at app//org.apache.solr.metrics.reporters.jmx.JmxMetricsReporter$JmxListener.unregisterMBean(JmxMetricsReporter.java:555)
        at app//org.apache.solr.metrics.reporters.jmx.JmxMetricsReporter$JmxListener.unregisterAll(JmxMetricsReporter.java:709)
        at app//org.apache.solr.metrics.reporters.jmx.JmxMetricsReporter.close(JmxMetricsReporter.java:759)
        at app//org.apache.solr.metrics.reporters.SolrJmxReporter.close(SolrJmxReporter.java:129)
        at app//org.apache.solr.metrics.SolrMetricManager.lambda$closeReporters$5(SolrMetricManager.java:1157)
        at app//org.apache.solr.metrics.SolrMetricManager$$Lambda$390/0x00000008010a68d0.accept(Unknown Source)
        at java.base@17/java.lang.Iterable.forEach(Iterable.java:75)
        at app//org.apache.solr.metrics.SolrMetricManager.closeReporters(SolrMetricManager.java:1151)
        at app//org.apache.solr.metrics.SolrCoreMetricManager.close(SolrCoreMetricManager.java:145)
        at app//org.apache.solr.core.SolrCore.close(SolrCore.java:1597)
        at app//org.apache.solr.core.SolrCore.<init>(SolrCore.java:1107)
        at app//org.apache.solr.core.SolrCore.reload(SolrCore.java:746)
        at app//org.apache.solr.core.CoreContainer.reload(CoreContainer.java:1712)
        at app//org.apache.solr.core.SolrCore.lambda$getConfListener$21(SolrCore.java:3140)
        at app//org.apache.solr.core.SolrCore$$Lambda$716/0x0000000801300b30.run(Unknown Source)
        at app//org.apache.solr.cloud.ZkController.lambda$fireEventListeners$17(ZkController.java:2473)
        at app//org.apache.solr.cloud.ZkController$$Lambda$816/0x0000000801343328.run(Unknown Source)
        at java.base@17/java.lang.Thread.run(Thread.java:833)
	at __randomizedtesting.SeedInfo.seed([BA85AA8120AFA9B5]:0)


FAILED:  org.apache.solr.prometheus.exporter.SolrExporterIntegrationTest.pingAllCollectionsAndCoresAreAvailable

Error Message:
java.lang.AssertionError: Metric must have name and value: solr_metrics_jvm_buffers{pool="mapped - 'non-volatile memory'",base_url="http://127.0.0.1:49226/solr",} 0.0 expected:<2> but was:<5>

Stack Trace:
java.lang.AssertionError: Metric must have name and value: solr_metrics_jvm_buffers{pool="mapped - 'non-volatile memory'",base_url="http://127.0.0.1:49226/solr",} 0.0 expected:<2> but was:<5>
	at __randomizedtesting.SeedInfo.seed([BA85AA8120AFA9B5:521EC4AEE1E1E967]:0)
	at org.junit.Assert.fail(Assert.java:89)
	at org.junit.Assert.failNotEquals(Assert.java:835)
	at org.junit.Assert.assertEquals(Assert.java:647)
	at org.apache.solr.prometheus.exporter.SolrExporterTestBase.getAllMetrics(SolrExporterTestBase.java:110)
	at org.apache.solr.prometheus.exporter.SolrExporterTestBase.startMetricsExporterWithConfiguration(SolrExporterTestBase.java:79)
	at org.apache.solr.prometheus.exporter.SolrExporterIntegrationTest.setUp(SolrExporterIntegrationTest.java:34)
	at java.base/jdk.internal.reflect.NativeMethodAccessorImpl.invoke0(Native Method)
	at java.base/jdk.internal.reflect.NativeMethodAccessorImpl.invoke(NativeMethodAccessorImpl.java:77)
	at java.base/jdk.internal.reflect.DelegatingMethodAccessorImpl.invoke(DelegatingMethodAccessorImpl.java:43)
	at java.base/java.lang.reflect.Method.invoke(Method.java:568)
	at com.carrotsearch.randomizedtesting.RandomizedRunner.invoke(RandomizedRunner.java:1754)
	at com.carrotsearch.randomizedtesting.RandomizedRunner$9.evaluate(RandomizedRunner.java:976)
	at com.carrotsearch.randomizedtesting.RandomizedRunner$10.evaluate(RandomizedRunner.java:992)
	at com.carrotsearch.randomizedtesting.rules.SystemPropertiesRestoreRule$1.evaluate(SystemPropertiesRestoreRule.java:57)
	at org.junit.rules.RunRules.evaluate(RunRules.java:20)
	at org.apache.lucene.util.TestRuleSetupTeardownChained$1.evaluate(TestRuleSetupTeardownChained.java:44)
	at org.apache.lucene.util.AbstractBeforeAfterRule$1.evaluate(AbstractBeforeAfterRule.java:43)
	at org.apache.lucene.util.TestRuleThreadAndTestName$1.evaluate(TestRuleThreadAndTestName.java:45)
	at org.apache.lucene.util.TestRuleIgnoreAfterMaxFailures$1.evaluate(TestRuleIgnoreAfterMaxFailures.java:60)
	at org.apache.lucene.util.TestRuleMarkFailure$1.evaluate(TestRuleMarkFailure.java:44)
	at org.junit.rules.RunRules.evaluate(RunRules.java:20)
	at com.carrotsearch.randomizedtesting.rules.StatementAdapter.evaluate(StatementAdapter.java:36)
	at com.carrotsearch.randomizedtesting.ThreadLeakControl$StatementRunner.run(ThreadLeakControl.java:370)
	at com.carrotsearch.randomizedtesting.ThreadLeakControl.forkTimeoutingTask(ThreadLeakControl.java:819)
	at com.carrotsearch.randomizedtesting.ThreadLeakControl$3.evaluate(ThreadLeakControl.java:470)
	at com.carrotsearch.randomizedtesting.RandomizedRunner.runSingleTest(RandomizedRunner.java:951)
	at com.carrotsearch.randomizedtesting.RandomizedRunner$5.evaluate(RandomizedRunner.java:836)
	at com.carrotsearch.randomizedtesting.RandomizedRunner$6.evaluate(RandomizedRunner.java:887)
	at com.carrotsearch.randomizedtesting.RandomizedRunner$7.evaluate(RandomizedRunner.java:898)
	at com.carrotsearch.randomizedtesting.rules.StatementAdapter.evaluate(StatementAdapter.java:36)
	at org.apache.lucene.util.AbstractBeforeAfterRule$1.evaluate(AbstractBeforeAfterRule.java:43)
	at org.apache.lucene.util.AbstractBeforeAfterRule$1.evaluate(AbstractBeforeAfterRule.java:43)
	at com.carrotsearch.randomizedtesting.rules.SystemPropertiesRestoreRule$1.evaluate(SystemPropertiesRestoreRule.java:57)
	at org.junit.rules.RunRules.evaluate(RunRules.java:20)
	at org.apache.lucene.util.AbstractBeforeAfterRule$1.evaluate(AbstractBeforeAfterRule.java:43)
	at com.carrotsearch.randomizedtesting.rules.StatementAdapter.evaluate(StatementAdapter.java:36)
	at org.apache.lucene.util.TestRuleStoreClassName$1.evaluate(TestRuleStoreClassName.java:38)
	at com.carrotsearch.randomizedtesting.rules.NoShadowingOrOverridesOnMethodsRule$1.evaluate(NoShadowingOrOverridesOnMethodsRule.java:40)
	at com.carrotsearch.randomizedtesting.rules.NoShadowingOrOverridesOnMethodsRule$1.evaluate(NoShadowingOrOverridesOnMethodsRule.java:40)
	at com.carrotsearch.randomizedtesting.rules.StatementAdapter.evaluate(StatementAdapter.java:36)
	at com.carrotsearch.randomizedtesting.rules.StatementAdapter.evaluate(StatementAdapter.java:36)
	at org.apache.lucene.util.TestRuleAssertionsRequired$1.evaluate(TestRuleAssertionsRequired.java:53)
	at org.apache.lucene.util.AbstractBeforeAfterRule$1.evaluate(AbstractBeforeAfterRule.java:43)
	at org.apache.lucene.util.TestRuleMarkFailure$1.evaluate(TestRuleMarkFailure.java:44)
	at org.apache.lucene.util.TestRuleIgnoreAfterMaxFailures$1.evaluate(TestRuleIgnoreAfterMaxFailures.java:60)
	at org.apache.lucene.util.TestRuleIgnoreTestSuites$1.evaluate(TestRuleIgnoreTestSuites.java:47)
	at org.junit.rules.RunRules.evaluate(RunRules.java:20)
	at com.carrotsearch.randomizedtesting.rules.StatementAdapter.evaluate(StatementAdapter.java:36)
	at com.carrotsearch.randomizedtesting.ThreadLeakControl$StatementRunner.run(ThreadLeakControl.java:370)
	at com.carrotsearch.randomizedtesting.ThreadLeakControl.lambda$forkTimeoutingTask$0(ThreadLeakControl.java:826)
	at java.base/java.lang.Thread.run(Thread.java:833)


FAILED:  org.apache.solr.prometheus.exporter.SolrExporterIntegrationTest.collectionMetrics

Error Message:
java.lang.AssertionError: Metric must have name and value: solr_metrics_jvm_buffers{pool="mapped - 'non-volatile memory'",base_url="http://127.0.0.1:49226/solr",} 0.0 expected:<2> but was:<5>

Stack Trace:
java.lang.AssertionError: Metric must have name and value: solr_metrics_jvm_buffers{pool="mapped - 'non-volatile memory'",base_url="http://127.0.0.1:49226/solr",} 0.0 expected:<2> but was:<5>
	at __randomizedtesting.SeedInfo.seed([BA85AA8120AFA9B5:CCDAD5C41DCB81F6]:0)
	at org.junit.Assert.fail(Assert.java:89)
	at org.junit.Assert.failNotEquals(Assert.java:835)
	at org.junit.Assert.assertEquals(Assert.java:647)
	at org.apache.solr.prometheus.exporter.SolrExporterTestBase.getAllMetrics(SolrExporterTestBase.java:110)
	at org.apache.solr.prometheus.exporter.SolrExporterTestBase.startMetricsExporterWithConfiguration(SolrExporterTestBase.java:79)
	at org.apache.solr.prometheus.exporter.SolrExporterIntegrationTest.setUp(SolrExporterIntegrationTest.java:34)
	at java.base/jdk.internal.reflect.NativeMethodAccessorImpl.invoke0(Native Method)
	at java.base/jdk.internal.reflect.NativeMethodAccessorImpl.invoke(NativeMethodAccessorImpl.java:77)
	at java.base/jdk.internal.reflect.DelegatingMethodAccessorImpl.invoke(DelegatingMethodAccessorImpl.java:43)
	at java.base/java.lang.reflect.Method.invoke(Method.java:568)
	at com.carrotsearch.randomizedtesting.RandomizedRunner.invoke(RandomizedRunner.java:1754)
	at com.carrotsearch.randomizedtesting.RandomizedRunner$9.evaluate(RandomizedRunner.java:976)
	at com.carrotsearch.randomizedtesting.RandomizedRunner$10.evaluate(RandomizedRunner.java:992)
	at com.carrotsearch.randomizedtesting.rules.SystemPropertiesRestoreRule$1.evaluate(SystemPropertiesRestoreRule.java:57)
	at org.junit.rules.RunRules.evaluate(RunRules.java:20)
	at org.apache.lucene.util.TestRuleSetupTeardownChained$1.evaluate(TestRuleSetupTeardownChained.java:44)
	at org.apache.lucene.util.AbstractBeforeAfterRule$1.evaluate(AbstractBeforeAfterRule.java:43)
	at org.apache.lucene.util.TestRuleThreadAndTestName$1.evaluate(TestRuleThreadAndTestName.java:45)
	at org.apache.lucene.util.TestRuleIgnoreAfterMaxFailures$1.evaluate(TestRuleIgnoreAfterMaxFailures.java:60)
	at org.apache.lucene.util.TestRuleMarkFailure$1.evaluate(TestRuleMarkFailure.java:44)
	at org.junit.rules.RunRules.evaluate(RunRules.java:20)
	at com.carrotsearch.randomizedtesting.rules.StatementAdapter.evaluate(StatementAdapter.java:36)
	at com.carrotsearch.randomizedtesting.ThreadLeakControl$StatementRunner.run(ThreadLeakControl.java:370)
	at com.carrotsearch.randomizedtesting.ThreadLeakControl.forkTimeoutingTask(ThreadLeakControl.java:819)
	at com.carrotsearch.randomizedtesting.ThreadLeakControl$3.evaluate(ThreadLeakControl.java:470)
	at com.carrotsearch.randomizedtesting.RandomizedRunner.runSingleTest(RandomizedRunner.java:951)
	at com.carrotsearch.randomizedtesting.RandomizedRunner$5.evaluate(RandomizedRunner.java:836)
	at com.carrotsearch.randomizedtesting.RandomizedRunner$6.evaluate(RandomizedRunner.java:887)
	at com.carrotsearch.randomizedtesting.RandomizedRunner$7.evaluate(RandomizedRunner.java:898)
	at com.carrotsearch.randomizedtesting.rules.StatementAdapter.evaluate(StatementAdapter.java:36)
	at org.apache.lucene.util.AbstractBeforeAfterRule$1.evaluate(AbstractBeforeAfterRule.java:43)
	at org.apache.lucene.util.AbstractBeforeAfterRule$1.evaluate(AbstractBeforeAfterRule.java:43)
	at com.carrotsearch.randomizedtesting.rules.SystemPropertiesRestoreRule$1.evaluate(SystemPropertiesRestoreRule.java:57)
	at org.junit.rules.RunRules.evaluate(RunRules.java:20)
	at org.apache.lucene.util.AbstractBeforeAfterRule$1.evaluate(AbstractBeforeAfterRule.java:43)
	at com.carrotsearch.randomizedtesting.rules.StatementAdapter.evaluate(StatementAdapter.java:36)
	at org.apache.lucene.util.TestRuleStoreClassName$1.evaluate(TestRuleStoreClassName.java:38)
	at com.carrotsearch.randomizedtesting.rules.NoShadowingOrOverridesOnMethodsRule$1.evaluate(NoShadowingOrOverridesOnMethodsRule.java:40)
	at com.carrotsearch.randomizedtesting.rules.NoShadowingOrOverridesOnMethodsRule$1.evaluate(NoShadowingOrOverridesOnMethodsRule.java:40)
	at com.carrotsearch.randomizedtesting.rules.StatementAdapter.evaluate(StatementAdapter.java:36)
	at com.carrotsearch.randomizedtesting.rules.StatementAdapter.evaluate(StatementAdapter.java:36)
	at org.apache.lucene.util.TestRuleAssertionsRequired$1.evaluate(TestRuleAssertionsRequired.java:53)
	at org.apache.lucene.util.AbstractBeforeAfterRule$1.evaluate(AbstractBeforeAfterRule.java:43)
	at org.apache.lucene.util.TestRuleMarkFailure$1.evaluate(TestRuleMarkFailure.java:44)
	at org.apache.lucene.util.TestRuleIgnoreAfterMaxFailures$1.evaluate(TestRuleIgnoreAfterMaxFailures.java:60)
	at org.apache.lucene.util.TestRuleIgnoreTestSuites$1.evaluate(TestRuleIgnoreTestSuites.java:47)
	at org.junit.rules.RunRules.evaluate(RunRules.java:20)
	at com.carrotsearch.randomizedtesting.rules.StatementAdapter.evaluate(StatementAdapter.java:36)
	at com.carrotsearch.randomizedtesting.ThreadLeakControl$StatementRunner.run(ThreadLeakControl.java:370)
	at com.carrotsearch.randomizedtesting.ThreadLeakControl.lambda$forkTimeoutingTask$0(ThreadLeakControl.java:826)
	at java.base/java.lang.Thread.run(Thread.java:833)


FAILED:  org.apache.solr.prometheus.exporter.SolrExporterIntegrationTest.jsonFacetMetrics

Error Message:
java.lang.AssertionError: Metric must have name and value: solr_metrics_jvm_buffers{pool="mapped - 'non-volatile memory'",base_url="http://127.0.0.1:49226/solr",} 0.0 expected:<2> but was:<5>

Stack Trace:
java.lang.AssertionError: Metric must have name and value: solr_metrics_jvm_buffers{pool="mapped - 'non-volatile memory'",base_url="http://127.0.0.1:49226/solr",} 0.0 expected:<2> but was:<5>
	at __randomizedtesting.SeedInfo.seed([BA85AA8120AFA9B5:89D05D0F76742F8B]:0)
	at org.junit.Assert.fail(Assert.java:89)
	at org.junit.Assert.failNotEquals(Assert.java:835)
	at org.junit.Assert.assertEquals(Assert.java:647)
	at org.apache.solr.prometheus.exporter.SolrExporterTestBase.getAllMetrics(SolrExporterTestBase.java:110)
	at org.apache.solr.prometheus.exporter.SolrExporterTestBase.startMetricsExporterWithConfiguration(SolrExporterTestBase.java:79)
	at org.apache.solr.prometheus.exporter.SolrExporterIntegrationTest.setUp(SolrExporterIntegrationTest.java:34)
	at java.base/jdk.internal.reflect.NativeMethodAccessorImpl.invoke0(Native Method)
	at java.base/jdk.internal.reflect.NativeMethodAccessorImpl.invoke(NativeMethodAccessorImpl.java:77)
	at java.base/jdk.internal.reflect.DelegatingMethodAccessorImpl.invoke(DelegatingMethodAccessorImpl.java:43)
	at java.base/java.lang.reflect.Method.invoke(Method.java:568)
	at com.carrotsearch.randomizedtesting.RandomizedRunner.invoke(RandomizedRunner.java:1754)
	at com.carrotsearch.randomizedtesting.RandomizedRunner$9.evaluate(RandomizedRunner.java:976)
	at com.carrotsearch.randomizedtesting.RandomizedRunner$10.evaluate(RandomizedRunner.java:992)
	at com.carrotsearch.randomizedtesting.rules.SystemPropertiesRestoreRule$1.evaluate(SystemPropertiesRestoreRule.java:57)
	at org.junit.rules.RunRules.evaluate(RunRules.java:20)
	at org.apache.lucene.util.TestRuleSetupTeardownChained$1.evaluate(TestRuleSetupTeardownChained.java:44)
	at org.apache.lucene.util.AbstractBeforeAfterRule$1.evaluate(AbstractBeforeAfterRule.java:43)
	at org.apache.lucene.util.TestRuleThreadAndTestName$1.evaluate(TestRuleThreadAndTestName.java:45)
	at org.apache.lucene.util.TestRuleIgnoreAfterMaxFailures$1.evaluate(TestRuleIgnoreAfterMaxFailures.java:60)
	at org.apache.lucene.util.TestRuleMarkFailure$1.evaluate(TestRuleMarkFailure.java:44)
	at org.junit.rules.RunRules.evaluate(RunRules.java:20)
	at com.carrotsearch.randomizedtesting.rules.StatementAdapter.evaluate(StatementAdapter.java:36)
	at com.carrotsearch.randomizedtesting.ThreadLeakControl$StatementRunner.run(ThreadLeakControl.java:370)
	at com.carrotsearch.randomizedtesting.ThreadLeakControl.forkTimeoutingTask(ThreadLeakControl.java:819)
	at com.carrotsearch.randomizedtesting.ThreadLeakControl$3.evaluate(ThreadLeakControl.java:470)
	at com.carrotsearch.randomizedtesting.RandomizedRunner.runSingleTest(RandomizedRunner.java:951)
	at com.carrotsearch.randomizedtesting.RandomizedRunner$5.evaluate(RandomizedRunner.java:836)
	at com.carrotsearch.randomizedtesting.RandomizedRunner$6.evaluate(RandomizedRunner.java:887)
	at com.carrotsearch.randomizedtesting.RandomizedRunner$7.evaluate(RandomizedRunner.java:898)
	at com.carrotsearch.randomizedtesting.rules.StatementAdapter.evaluate(StatementAdapter.java:36)
	at org.apache.lucene.util.AbstractBeforeAfterRule$1.evaluate(AbstractBeforeAfterRule.java:43)
	at org.apache.lucene.util.AbstractBeforeAfterRule$1.evaluate(AbstractBeforeAfterRule.java:43)
	at com.carrotsearch.randomizedtesting.rules.SystemPropertiesRestoreRule$1.evaluate(SystemPropertiesRestoreRule.java:57)
	at org.junit.rules.RunRules.evaluate(RunRules.java:20)
	at org.apache.lucene.util.AbstractBeforeAfterRule$1.evaluate(AbstractBeforeAfterRule.java:43)
	at com.carrotsearch.randomizedtesting.rules.StatementAdapter.evaluate(StatementAdapter.java:36)
	at org.apache.lucene.util.TestRuleStoreClassName$1.evaluate(TestRuleStoreClassName.java:38)
	at com.carrotsearch.randomizedtesting.rules.NoShadowingOrOverridesOnMethodsRule$1.evaluate(NoShadowingOrOverridesOnMethodsRule.java:40)
	at com.carrotsearch.randomizedtesting.rules.NoShadowingOrOverridesOnMethodsRule$1.evaluate(NoShadowingOrOverridesOnMethodsRule.java:40)
	at com.carrotsearch.randomizedtesting.rules.StatementAdapter.evaluate(StatementAdapter.java:36)
	at com.carrotsearch.randomizedtesting.rules.StatementAdapter.evaluate(StatementAdapter.java:36)
	at org.apache.lucene.util.TestRuleAssertionsRequired$1.evaluate(TestRuleAssertionsRequired.java:53)
	at org.apache.lucene.util.AbstractBeforeAfterRule$1.evaluate(AbstractBeforeAfterRule.java:43)
	at org.apache.lucene.util.TestRuleMarkFailure$1.evaluate(TestRuleMarkFailure.java:44)
	at org.apache.lucene.util.TestRuleIgnoreAfterMaxFailures$1.evaluate(TestRuleIgnoreAfterMaxFailures.java:60)
	at org.apache.lucene.util.TestRuleIgnoreTestSuites$1.evaluate(TestRuleIgnoreTestSuites.java:47)
	at org.junit.rules.RunRules.evaluate(RunRules.java:20)
	at com.carrotsearch.randomizedtesting.rules.StatementAdapter.evaluate(StatementAdapter.java:36)
	at com.carrotsearch.randomizedtesting.ThreadLeakControl$StatementRunner.run(ThreadLeakControl.java:370)
	at com.carrotsearch.randomizedtesting.ThreadLeakControl.lambda$forkTimeoutingTask$0(ThreadLeakControl.java:826)
	at java.base/java.lang.Thread.run(Thread.java:833)


FAILED:  org.apache.solr.prometheus.exporter.SolrExporterIntegrationTest.jvmMetrics

Error Message:
java.lang.AssertionError: Metric must have name and value: solr_metrics_jvm_buffers{pool="mapped - 'non-volatile memory'",base_url="http://127.0.0.1:49224/solr",} 0.0 expected:<2> but was:<5>

Stack Trace:
java.lang.AssertionError: Metric must have name and value: solr_metrics_jvm_buffers{pool="mapped - 'non-volatile memory'",base_url="http://127.0.0.1:49224/solr",} 0.0 expected:<2> but was:<5>
	at __randomizedtesting.SeedInfo.seed([BA85AA8120AFA9B5:6931976E35416521]:0)
	at org.junit.Assert.fail(Assert.java:89)
	at org.junit.Assert.failNotEquals(Assert.java:835)
	at org.junit.Assert.assertEquals(Assert.java:647)
	at org.apache.solr.prometheus.exporter.SolrExporterTestBase.getAllMetrics(SolrExporterTestBase.java:110)
	at org.apache.solr.prometheus.exporter.SolrExporterTestBase.startMetricsExporterWithConfiguration(SolrExporterTestBase.java:79)
	at org.apache.solr.prometheus.exporter.SolrExporterIntegrationTest.setUp(SolrExporterIntegrationTest.java:34)
	at java.base/jdk.internal.reflect.NativeMethodAccessorImpl.invoke0(Native Method)
	at java.base/jdk.internal.reflect.NativeMethodAccessorImpl.invoke(NativeMethodAccessorImpl.java:77)
	at java.base/jdk.internal.reflect.DelegatingMethodAccessorImpl.invoke(DelegatingMethodAccessorImpl.java:43)
	at java.base/java.lang.reflect.Method.invoke(Method.java:568)
	at com.carrotsearch.randomizedtesting.RandomizedRunner.invoke(RandomizedRunner.java:1754)
	at com.carrotsearch.randomizedtesting.RandomizedRunner$9.evaluate(RandomizedRunner.java:976)
	at com.carrotsearch.randomizedtesting.RandomizedRunner$10.evaluate(RandomizedRunner.java:992)
	at com.carrotsearch.randomizedtesting.rules.SystemPropertiesRestoreRule$1.evaluate(SystemPropertiesRestoreRule.java:57)
	at org.junit.rules.RunRules.evaluate(RunRules.java:20)
	at org.apache.lucene.util.TestRuleSetupTeardownChained$1.evaluate(TestRuleSetupTeardownChained.java:44)
	at org.apache.lucene.util.AbstractBeforeAfterRule$1.evaluate(AbstractBeforeAfterRule.java:43)
	at org.apache.lucene.util.TestRuleThreadAndTestName$1.evaluate(TestRuleThreadAndTestName.java:45)
	at org.apache.lucene.util.TestRuleIgnoreAfterMaxFailures$1.evaluate(TestRuleIgnoreAfterMaxFailures.java:60)
	at org.apache.lucene.util.TestRuleMarkFailure$1.evaluate(TestRuleMarkFailure.java:44)
	at org.junit.rules.RunRules.evaluate(RunRules.java:20)
	at com.carrotsearch.randomizedtesting.rules.StatementAdapter.evaluate(StatementAdapter.java:36)
	at com.carrotsearch.randomizedtesting.ThreadLeakControl$StatementRunner.run(ThreadLeakControl.java:370)
	at com.carrotsearch.randomizedtesting.ThreadLeakControl.forkTimeoutingTask(ThreadLeakControl.java:819)
	at com.carrotsearch.randomizedtesting.ThreadLeakControl$3.evaluate(ThreadLeakControl.java:470)
	at com.carrotsearch.randomizedtesting.RandomizedRunner.runSingleTest(RandomizedRunner.java:951)
	at com.carrotsearch.randomizedtesting.RandomizedRunner$5.evaluate(RandomizedRunner.java:836)
	at com.carrotsearch.randomizedtesting.RandomizedRunner$6.evaluate(RandomizedRunner.java:887)
	at com.carrotsearch.randomizedtesting.RandomizedRunner$7.evaluate(RandomizedRunner.java:898)
	at com.carrotsearch.randomizedtesting.rules.StatementAdapter.evaluate(StatementAdapter.java:36)
	at org.apache.lucene.util.AbstractBeforeAfterRule$1.evaluate(AbstractBeforeAfterRule.java:43)
	at org.apache.lucene.util.AbstractBeforeAfterRule$1.evaluate(AbstractBeforeAfterRule.java:43)
	at com.carrotsearch.randomizedtesting.rules.SystemPropertiesRestoreRule$1.evaluate(SystemPropertiesRestoreRule.java:57)
	at org.junit.rules.RunRules.evaluate(RunRules.java:20)
	at org.apache.lucene.util.AbstractBeforeAfterRule$1.evaluate(AbstractBeforeAfterRule.java:43)
	at com.carrotsearch.randomizedtesting.rules.StatementAdapter.evaluate(StatementAdapter.java:36)
	at org.apache.lucene.util.TestRuleStoreClassName$1.evaluate(TestRuleStoreClassName.java:38)
	at com.carrotsearch.randomizedtesting.rules.NoShadowingOrOverridesOnMethodsRule$1.evaluate(NoShadowingOrOverridesOnMethodsRule.java:40)
	at com.carrotsearch.randomizedtesting.rules.NoShadowingOrOverridesOnMethodsRule$1.evaluate(NoShadowingOrOverridesOnMethodsRule.java:40)
	at com.carrotsearch.randomizedtesting.rules.StatementAdapter.evaluate(StatementAdapter.java:36)
	at com.carrotsearch.randomizedtesting.rules.StatementAdapter.evaluate(StatementAdapter.java:36)
	at org.apache.lucene.util.TestRuleAssertionsRequired$1.evaluate(TestRuleAssertionsRequired.java:53)
	at org.apache.lucene.util.AbstractBeforeAfterRule$1.evaluate(AbstractBeforeAfterRule.java:43)
	at org.apache.lucene.util.TestRuleMarkFailure$1.evaluate(TestRuleMarkFailure.java:44)
	at org.apache.lucene.util.TestRuleIgnoreAfterMaxFailures$1.evaluate(TestRuleIgnoreAfterMaxFailures.java:60)
	at org.apache.lucene.util.TestRuleIgnoreTestSuites$1.evaluate(TestRuleIgnoreTestSuites.java:47)
	at org.junit.rules.RunRules.evaluate(RunRules.java:20)
	at com.carrotsearch.randomizedtesting.rules.StatementAdapter.evaluate(StatementAdapter.java:36)
	at com.carrotsearch.randomizedtesting.ThreadLeakControl$StatementRunner.run(ThreadLeakControl.java:370)
	at com.carrotsearch.randomizedtesting.ThreadLeakControl.lambda$forkTimeoutingTask$0(ThreadLeakControl.java:826)
	at java.base/java.lang.Thread.run(Thread.java:833)


FAILED:  org.apache.solr.prometheus.exporter.SolrExporterIntegrationTest.solrExporterDurationMetric

Error Message:
java.lang.AssertionError: Metric must have name and value: solr_metrics_jvm_buffers{pool="mapped - 'non-volatile memory'",base_url="http://127.0.0.1:49226/solr",} 0.0 expected:<2> but was:<5>

Stack Trace:
java.lang.AssertionError: Metric must have name and value: solr_metrics_jvm_buffers{pool="mapped - 'non-volatile memory'",base_url="http://127.0.0.1:49226/solr",} 0.0 expected:<2> but was:<5>
	at __randomizedtesting.SeedInfo.seed([BA85AA8120AFA9B5:180D1CDBE329C46]:0)
	at org.junit.Assert.fail(Assert.java:89)
	at org.junit.Assert.failNotEquals(Assert.java:835)
	at org.junit.Assert.assertEquals(Assert.java:647)
	at org.apache.solr.prometheus.exporter.SolrExporterTestBase.getAllMetrics(SolrExporterTestBase.java:110)
	at org.apache.solr.prometheus.exporter.SolrExporterTestBase.startMetricsExporterWithConfiguration(SolrExporterTestBase.java:79)
	at org.apache.solr.prometheus.exporter.SolrExporterIntegrationTest.setUp(SolrExporterIntegrationTest.java:34)
	at java.base/jdk.internal.reflect.NativeMethodAccessorImpl.invoke0(Native Method)
	at java.base/jdk.internal.reflect.NativeMethodAccessorImpl.invoke(NativeMethodAccessorImpl.java:77)
	at java.base/jdk.internal.reflect.DelegatingMethodAccessorImpl.invoke(DelegatingMethodAccessorImpl.java:43)
	at java.base/java.lang.reflect.Method.invoke(Method.java:568)
	at com.carrotsearch.randomizedtesting.RandomizedRunner.invoke(RandomizedRunner.java:1754)
	at com.carrotsearch.randomizedtesting.RandomizedRunner$9.evaluate(RandomizedRunner.java:976)
	at com.carrotsearch.randomizedtesting.RandomizedRunner$10.evaluate(RandomizedRunner.java:992)
	at com.carrotsearch.randomizedtesting.rules.SystemPropertiesRestoreRule$1.evaluate(SystemPropertiesRestoreRule.java:57)
	at org.junit.rules.RunRules.evaluate(RunRules.java:20)
	at org.apache.lucene.util.TestRuleSetupTeardownChained$1.evaluate(TestRuleSetupTeardownChained.java:44)
	at org.apache.lucene.util.AbstractBeforeAfterRule$1.evaluate(AbstractBeforeAfterRule.java:43)
	at org.apache.lucene.util.TestRuleThreadAndTestName$1.evaluate(TestRuleThreadAndTestName.java:45)
	at org.apache.lucene.util.TestRuleIgnoreAfterMaxFailures$1.evaluate(TestRuleIgnoreAfterMaxFailures.java:60)
	at org.apache.lucene.util.TestRuleMarkFailure$1.evaluate(TestRuleMarkFailure.java:44)
	at org.junit.rules.RunRules.evaluate(RunRules.java:20)
	at com.carrotsearch.randomizedtesting.rules.StatementAdapter.evaluate(StatementAdapter.java:36)
	at com.carrotsearch.randomizedtesting.ThreadLeakControl$StatementRunner.run(ThreadLeakControl.java:370)
	at com.carrotsearch.randomizedtesting.ThreadLeakControl.forkTimeoutingTask(ThreadLeakControl.java:819)
	at com.carrotsearch.randomizedtesting.ThreadLeakControl$3.evaluate(ThreadLeakControl.java:470)
	at com.carrotsearch.randomizedtesting.RandomizedRunner.runSingleTest(RandomizedRunner.java:951)
	at com.carrotsearch.randomizedtesting.RandomizedRunner$5.evaluate(RandomizedRunner.java:836)
	at com.carrotsearch.randomizedtesting.RandomizedRunner$6.evaluate(RandomizedRunner.java:887)
	at com.carrotsearch.randomizedtesting.RandomizedRunner$7.evaluate(RandomizedRunner.java:898)
	at com.carrotsearch.randomizedtesting.rules.StatementAdapter.evaluate(StatementAdapter.java:36)
	at org.apache.lucene.util.AbstractBeforeAfterRule$1.evaluate(AbstractBeforeAfterRule.java:43)
	at org.apache.lucene.util.AbstractBeforeAfterRule$1.evaluate(AbstractBeforeAfterRule.java:43)
	at com.carrotsearch.randomizedtesting.rules.SystemPropertiesRestoreRule$1.evaluate(SystemPropertiesRestoreRule.java:57)
	at org.junit.rules.RunRules.evaluate(RunRules.java:20)
	at org.apache.lucene.util.AbstractBeforeAfterRule$1.evaluate(AbstractBeforeAfterRule.java:43)
	at com.carrotsearch.randomizedtesting.rules.StatementAdapter.evaluate(StatementAdapter.java:36)
	at org.apache.lucene.util.TestRuleStoreClassName$1.evaluate(TestRuleStoreClassName.java:38)
	at com.carrotsearch.randomizedtesting.rules.NoShadowingOrOverridesOnMethodsRule$1.evaluate(NoShadowingOrOverridesOnMethodsRule.java:40)
	at com.carrotsearch.randomizedtesting.rules.NoShadowingOrOverridesOnMethodsRule$1.evaluate(NoShadowingOrOverridesOnMethodsRule.java:40)
	at com.carrotsearch.randomizedtesting.rules.StatementAdapter.evaluate(StatementAdapter.java:36)
	at com.carrotsearch.randomizedtesting.rules.StatementAdapter.evaluate(StatementAdapter.java:36)
	at org.apache.lucene.util.TestRuleAssertionsRequired$1.evaluate(TestRuleAssertionsRequired.java:53)
	at org.apache.lucene.util.AbstractBeforeAfterRule$1.evaluate(AbstractBeforeAfterRule.java:43)
	at org.apache.lucene.util.TestRuleMarkFailure$1.evaluate(TestRuleMarkFailure.java:44)
	at org.apache.lucene.util.TestRuleIgnoreAfterMaxFailures$1.evaluate(TestRuleIgnoreAfterMaxFailures.java:60)
	at org.apache.lucene.util.TestRuleIgnoreTestSuites$1.evaluate(TestRuleIgnoreTestSuites.java:47)
	at org.junit.rules.RunRules.evaluate(RunRules.java:20)
	at com.carrotsearch.randomizedtesting.rules.StatementAdapter.evaluate(StatementAdapter.java:36)
	at com.carrotsearch.randomizedtesting.ThreadLeakControl$StatementRunner.run(ThreadLeakControl.java:370)
	at com.carrotsearch.randomizedtesting.ThreadLeakControl.lambda$forkTimeoutingTask$0(ThreadLeakControl.java:826)
	at java.base/java.lang.Thread.run(Thread.java:833)

[JENKINS] Solr-main-MacOSX (64bit/jdk-17) - Build # 476 - Still Unstable!

Posted by Policeman Jenkins Server <je...@thetaphi.de>.
Build: https://jenkins.thetaphi.de/job/Solr-main-MacOSX/476/
Java: 64bit/jdk-17 -XX:+UseCompressedOops -XX:+UseG1GC

6 tests failed.
FAILED:  org.apache.solr.cloud.OverseerTaskQueueTest.testDistributedQueueBlocking

Error Message:
java.util.concurrent.TimeoutException: Could not connect to ZooKeeper 127.0.0.1:54055/solr within 10000 ms

Stack Trace:
java.util.concurrent.TimeoutException: Could not connect to ZooKeeper 127.0.0.1:54055/solr within 10000 ms
	at __randomizedtesting.SeedInfo.seed([83E2FCEB630BBB34:C6488E9227590740]:0)
	at org.apache.solr.common.cloud.ConnectionManager.waitForConnected(ConnectionManager.java:255)
	at org.apache.solr.cloud.DistributedQueueTest.forceSessionExpire(DistributedQueueTest.java:285)
	at org.apache.solr.cloud.DistributedQueueTest.testDistributedQueueBlocking(DistributedQueueTest.java:161)
	at java.base/jdk.internal.reflect.NativeMethodAccessorImpl.invoke0(Native Method)
	at java.base/jdk.internal.reflect.NativeMethodAccessorImpl.invoke(NativeMethodAccessorImpl.java:77)
	at java.base/jdk.internal.reflect.DelegatingMethodAccessorImpl.invoke(DelegatingMethodAccessorImpl.java:43)
	at java.base/java.lang.reflect.Method.invoke(Method.java:568)
	at com.carrotsearch.randomizedtesting.RandomizedRunner.invoke(RandomizedRunner.java:1754)
	at com.carrotsearch.randomizedtesting.RandomizedRunner$8.evaluate(RandomizedRunner.java:942)
	at com.carrotsearch.randomizedtesting.RandomizedRunner$9.evaluate(RandomizedRunner.java:978)
	at com.carrotsearch.randomizedtesting.RandomizedRunner$10.evaluate(RandomizedRunner.java:992)
	at com.carrotsearch.randomizedtesting.rules.SystemPropertiesRestoreRule$1.evaluate(SystemPropertiesRestoreRule.java:57)
	at org.junit.rules.RunRules.evaluate(RunRules.java:20)
	at org.apache.lucene.util.TestRuleSetupTeardownChained$1.evaluate(TestRuleSetupTeardownChained.java:44)
	at org.apache.lucene.util.AbstractBeforeAfterRule$1.evaluate(AbstractBeforeAfterRule.java:43)
	at org.apache.lucene.util.TestRuleThreadAndTestName$1.evaluate(TestRuleThreadAndTestName.java:45)
	at org.apache.lucene.util.TestRuleIgnoreAfterMaxFailures$1.evaluate(TestRuleIgnoreAfterMaxFailures.java:60)
	at org.apache.lucene.util.TestRuleMarkFailure$1.evaluate(TestRuleMarkFailure.java:44)
	at org.junit.rules.RunRules.evaluate(RunRules.java:20)
	at com.carrotsearch.randomizedtesting.rules.StatementAdapter.evaluate(StatementAdapter.java:36)
	at com.carrotsearch.randomizedtesting.ThreadLeakControl$StatementRunner.run(ThreadLeakControl.java:370)
	at com.carrotsearch.randomizedtesting.ThreadLeakControl.forkTimeoutingTask(ThreadLeakControl.java:819)
	at com.carrotsearch.randomizedtesting.ThreadLeakControl$3.evaluate(ThreadLeakControl.java:470)
	at com.carrotsearch.randomizedtesting.RandomizedRunner.runSingleTest(RandomizedRunner.java:951)
	at com.carrotsearch.randomizedtesting.RandomizedRunner$5.evaluate(RandomizedRunner.java:836)
	at com.carrotsearch.randomizedtesting.RandomizedRunner$6.evaluate(RandomizedRunner.java:887)
	at com.carrotsearch.randomizedtesting.RandomizedRunner$7.evaluate(RandomizedRunner.java:898)
	at com.carrotsearch.randomizedtesting.rules.StatementAdapter.evaluate(StatementAdapter.java:36)
	at org.apache.lucene.util.AbstractBeforeAfterRule$1.evaluate(AbstractBeforeAfterRule.java:43)
	at org.apache.lucene.util.AbstractBeforeAfterRule$1.evaluate(AbstractBeforeAfterRule.java:43)
	at com.carrotsearch.randomizedtesting.rules.SystemPropertiesRestoreRule$1.evaluate(SystemPropertiesRestoreRule.java:57)
	at org.junit.rules.RunRules.evaluate(RunRules.java:20)
	at org.apache.lucene.util.AbstractBeforeAfterRule$1.evaluate(AbstractBeforeAfterRule.java:43)
	at com.carrotsearch.randomizedtesting.rules.StatementAdapter.evaluate(StatementAdapter.java:36)
	at org.apache.lucene.util.TestRuleStoreClassName$1.evaluate(TestRuleStoreClassName.java:38)
	at com.carrotsearch.randomizedtesting.rules.NoShadowingOrOverridesOnMethodsRule$1.evaluate(NoShadowingOrOverridesOnMethodsRule.java:40)
	at com.carrotsearch.randomizedtesting.rules.NoShadowingOrOverridesOnMethodsRule$1.evaluate(NoShadowingOrOverridesOnMethodsRule.java:40)
	at com.carrotsearch.randomizedtesting.rules.StatementAdapter.evaluate(StatementAdapter.java:36)
	at com.carrotsearch.randomizedtesting.rules.StatementAdapter.evaluate(StatementAdapter.java:36)
	at org.apache.lucene.util.TestRuleAssertionsRequired$1.evaluate(TestRuleAssertionsRequired.java:53)
	at org.apache.lucene.util.AbstractBeforeAfterRule$1.evaluate(AbstractBeforeAfterRule.java:43)
	at org.apache.lucene.util.TestRuleMarkFailure$1.evaluate(TestRuleMarkFailure.java:44)
	at org.apache.lucene.util.TestRuleIgnoreAfterMaxFailures$1.evaluate(TestRuleIgnoreAfterMaxFailures.java:60)
	at org.apache.lucene.util.TestRuleIgnoreTestSuites$1.evaluate(TestRuleIgnoreTestSuites.java:47)
	at org.junit.rules.RunRules.evaluate(RunRules.java:20)
	at com.carrotsearch.randomizedtesting.rules.StatementAdapter.evaluate(StatementAdapter.java:36)
	at com.carrotsearch.randomizedtesting.ThreadLeakControl$StatementRunner.run(ThreadLeakControl.java:370)
	at com.carrotsearch.randomizedtesting.ThreadLeakControl.lambda$forkTimeoutingTask$0(ThreadLeakControl.java:826)
	at java.base/java.lang.Thread.run(Thread.java:833)


FAILED:  org.apache.solr.prometheus.exporter.SolrExporterIntegrationTest.collectionMetrics

Error Message:
java.lang.AssertionError: Metric must have name and value: solr_metrics_jvm_buffers{pool="mapped - 'non-volatile memory'",base_url="http://127.0.0.1:51562/solr",} 0.0 expected:<2> but was:<5>

Stack Trace:
java.lang.AssertionError: Metric must have name and value: solr_metrics_jvm_buffers{pool="mapped - 'non-volatile memory'",base_url="http://127.0.0.1:51562/solr",} 0.0 expected:<2> but was:<5>
	at __randomizedtesting.SeedInfo.seed([83E2FCEB630BBB34:F5BD83AE5E6F9377]:0)
	at org.junit.Assert.fail(Assert.java:89)
	at org.junit.Assert.failNotEquals(Assert.java:835)
	at org.junit.Assert.assertEquals(Assert.java:647)
	at org.apache.solr.prometheus.exporter.SolrExporterTestBase.getAllMetrics(SolrExporterTestBase.java:110)
	at org.apache.solr.prometheus.exporter.SolrExporterTestBase.startMetricsExporterWithConfiguration(SolrExporterTestBase.java:79)
	at org.apache.solr.prometheus.exporter.SolrExporterIntegrationTest.setUp(SolrExporterIntegrationTest.java:34)
	at java.base/jdk.internal.reflect.NativeMethodAccessorImpl.invoke0(Native Method)
	at java.base/jdk.internal.reflect.NativeMethodAccessorImpl.invoke(NativeMethodAccessorImpl.java:77)
	at java.base/jdk.internal.reflect.DelegatingMethodAccessorImpl.invoke(DelegatingMethodAccessorImpl.java:43)
	at java.base/java.lang.reflect.Method.invoke(Method.java:568)
	at com.carrotsearch.randomizedtesting.RandomizedRunner.invoke(RandomizedRunner.java:1754)
	at com.carrotsearch.randomizedtesting.RandomizedRunner$9.evaluate(RandomizedRunner.java:976)
	at com.carrotsearch.randomizedtesting.RandomizedRunner$10.evaluate(RandomizedRunner.java:992)
	at com.carrotsearch.randomizedtesting.rules.SystemPropertiesRestoreRule$1.evaluate(SystemPropertiesRestoreRule.java:57)
	at org.junit.rules.RunRules.evaluate(RunRules.java:20)
	at org.apache.lucene.util.TestRuleSetupTeardownChained$1.evaluate(TestRuleSetupTeardownChained.java:44)
	at org.apache.lucene.util.AbstractBeforeAfterRule$1.evaluate(AbstractBeforeAfterRule.java:43)
	at org.apache.lucene.util.TestRuleThreadAndTestName$1.evaluate(TestRuleThreadAndTestName.java:45)
	at org.apache.lucene.util.TestRuleIgnoreAfterMaxFailures$1.evaluate(TestRuleIgnoreAfterMaxFailures.java:60)
	at org.apache.lucene.util.TestRuleMarkFailure$1.evaluate(TestRuleMarkFailure.java:44)
	at org.junit.rules.RunRules.evaluate(RunRules.java:20)
	at com.carrotsearch.randomizedtesting.rules.StatementAdapter.evaluate(StatementAdapter.java:36)
	at com.carrotsearch.randomizedtesting.ThreadLeakControl$StatementRunner.run(ThreadLeakControl.java:370)
	at com.carrotsearch.randomizedtesting.ThreadLeakControl.forkTimeoutingTask(ThreadLeakControl.java:819)
	at com.carrotsearch.randomizedtesting.ThreadLeakControl$3.evaluate(ThreadLeakControl.java:470)
	at com.carrotsearch.randomizedtesting.RandomizedRunner.runSingleTest(RandomizedRunner.java:951)
	at com.carrotsearch.randomizedtesting.RandomizedRunner$5.evaluate(RandomizedRunner.java:836)
	at com.carrotsearch.randomizedtesting.RandomizedRunner$6.evaluate(RandomizedRunner.java:887)
	at com.carrotsearch.randomizedtesting.RandomizedRunner$7.evaluate(RandomizedRunner.java:898)
	at com.carrotsearch.randomizedtesting.rules.StatementAdapter.evaluate(StatementAdapter.java:36)
	at org.apache.lucene.util.AbstractBeforeAfterRule$1.evaluate(AbstractBeforeAfterRule.java:43)
	at org.apache.lucene.util.AbstractBeforeAfterRule$1.evaluate(AbstractBeforeAfterRule.java:43)
	at com.carrotsearch.randomizedtesting.rules.SystemPropertiesRestoreRule$1.evaluate(SystemPropertiesRestoreRule.java:57)
	at org.junit.rules.RunRules.evaluate(RunRules.java:20)
	at org.apache.lucene.util.AbstractBeforeAfterRule$1.evaluate(AbstractBeforeAfterRule.java:43)
	at com.carrotsearch.randomizedtesting.rules.StatementAdapter.evaluate(StatementAdapter.java:36)
	at org.apache.lucene.util.TestRuleStoreClassName$1.evaluate(TestRuleStoreClassName.java:38)
	at com.carrotsearch.randomizedtesting.rules.NoShadowingOrOverridesOnMethodsRule$1.evaluate(NoShadowingOrOverridesOnMethodsRule.java:40)
	at com.carrotsearch.randomizedtesting.rules.NoShadowingOrOverridesOnMethodsRule$1.evaluate(NoShadowingOrOverridesOnMethodsRule.java:40)
	at com.carrotsearch.randomizedtesting.rules.StatementAdapter.evaluate(StatementAdapter.java:36)
	at com.carrotsearch.randomizedtesting.rules.StatementAdapter.evaluate(StatementAdapter.java:36)
	at org.apache.lucene.util.TestRuleAssertionsRequired$1.evaluate(TestRuleAssertionsRequired.java:53)
	at org.apache.lucene.util.AbstractBeforeAfterRule$1.evaluate(AbstractBeforeAfterRule.java:43)
	at org.apache.lucene.util.TestRuleMarkFailure$1.evaluate(TestRuleMarkFailure.java:44)
	at org.apache.lucene.util.TestRuleIgnoreAfterMaxFailures$1.evaluate(TestRuleIgnoreAfterMaxFailures.java:60)
	at org.apache.lucene.util.TestRuleIgnoreTestSuites$1.evaluate(TestRuleIgnoreTestSuites.java:47)
	at org.junit.rules.RunRules.evaluate(RunRules.java:20)
	at com.carrotsearch.randomizedtesting.rules.StatementAdapter.evaluate(StatementAdapter.java:36)
	at com.carrotsearch.randomizedtesting.ThreadLeakControl$StatementRunner.run(ThreadLeakControl.java:370)
	at com.carrotsearch.randomizedtesting.ThreadLeakControl.lambda$forkTimeoutingTask$0(ThreadLeakControl.java:826)
	at java.base/java.lang.Thread.run(Thread.java:833)


FAILED:  org.apache.solr.prometheus.exporter.SolrExporterIntegrationTest.pingAllCollectionsAndCoresAreAvailable

Error Message:
java.lang.AssertionError: Metric must have name and value: solr_metrics_jvm_buffers{pool="mapped - 'non-volatile memory'",base_url="http://127.0.0.1:51562/solr",} 0.0 expected:<2> but was:<5>

Stack Trace:
java.lang.AssertionError: Metric must have name and value: solr_metrics_jvm_buffers{pool="mapped - 'non-volatile memory'",base_url="http://127.0.0.1:51562/solr",} 0.0 expected:<2> but was:<5>
	at __randomizedtesting.SeedInfo.seed([83E2FCEB630BBB34:6B7992C4A245FBE6]:0)
	at org.junit.Assert.fail(Assert.java:89)
	at org.junit.Assert.failNotEquals(Assert.java:835)
	at org.junit.Assert.assertEquals(Assert.java:647)
	at org.apache.solr.prometheus.exporter.SolrExporterTestBase.getAllMetrics(SolrExporterTestBase.java:110)
	at org.apache.solr.prometheus.exporter.SolrExporterTestBase.startMetricsExporterWithConfiguration(SolrExporterTestBase.java:79)
	at org.apache.solr.prometheus.exporter.SolrExporterIntegrationTest.setUp(SolrExporterIntegrationTest.java:34)
	at java.base/jdk.internal.reflect.NativeMethodAccessorImpl.invoke0(Native Method)
	at java.base/jdk.internal.reflect.NativeMethodAccessorImpl.invoke(NativeMethodAccessorImpl.java:77)
	at java.base/jdk.internal.reflect.DelegatingMethodAccessorImpl.invoke(DelegatingMethodAccessorImpl.java:43)
	at java.base/java.lang.reflect.Method.invoke(Method.java:568)
	at com.carrotsearch.randomizedtesting.RandomizedRunner.invoke(RandomizedRunner.java:1754)
	at com.carrotsearch.randomizedtesting.RandomizedRunner$9.evaluate(RandomizedRunner.java:976)
	at com.carrotsearch.randomizedtesting.RandomizedRunner$10.evaluate(RandomizedRunner.java:992)
	at com.carrotsearch.randomizedtesting.rules.SystemPropertiesRestoreRule$1.evaluate(SystemPropertiesRestoreRule.java:57)
	at org.junit.rules.RunRules.evaluate(RunRules.java:20)
	at org.apache.lucene.util.TestRuleSetupTeardownChained$1.evaluate(TestRuleSetupTeardownChained.java:44)
	at org.apache.lucene.util.AbstractBeforeAfterRule$1.evaluate(AbstractBeforeAfterRule.java:43)
	at org.apache.lucene.util.TestRuleThreadAndTestName$1.evaluate(TestRuleThreadAndTestName.java:45)
	at org.apache.lucene.util.TestRuleIgnoreAfterMaxFailures$1.evaluate(TestRuleIgnoreAfterMaxFailures.java:60)
	at org.apache.lucene.util.TestRuleMarkFailure$1.evaluate(TestRuleMarkFailure.java:44)
	at org.junit.rules.RunRules.evaluate(RunRules.java:20)
	at com.carrotsearch.randomizedtesting.rules.StatementAdapter.evaluate(StatementAdapter.java:36)
	at com.carrotsearch.randomizedtesting.ThreadLeakControl$StatementRunner.run(ThreadLeakControl.java:370)
	at com.carrotsearch.randomizedtesting.ThreadLeakControl.forkTimeoutingTask(ThreadLeakControl.java:819)
	at com.carrotsearch.randomizedtesting.ThreadLeakControl$3.evaluate(ThreadLeakControl.java:470)
	at com.carrotsearch.randomizedtesting.RandomizedRunner.runSingleTest(RandomizedRunner.java:951)
	at com.carrotsearch.randomizedtesting.RandomizedRunner$5.evaluate(RandomizedRunner.java:836)
	at com.carrotsearch.randomizedtesting.RandomizedRunner$6.evaluate(RandomizedRunner.java:887)
	at com.carrotsearch.randomizedtesting.RandomizedRunner$7.evaluate(RandomizedRunner.java:898)
	at com.carrotsearch.randomizedtesting.rules.StatementAdapter.evaluate(StatementAdapter.java:36)
	at org.apache.lucene.util.AbstractBeforeAfterRule$1.evaluate(AbstractBeforeAfterRule.java:43)
	at org.apache.lucene.util.AbstractBeforeAfterRule$1.evaluate(AbstractBeforeAfterRule.java:43)
	at com.carrotsearch.randomizedtesting.rules.SystemPropertiesRestoreRule$1.evaluate(SystemPropertiesRestoreRule.java:57)
	at org.junit.rules.RunRules.evaluate(RunRules.java:20)
	at org.apache.lucene.util.AbstractBeforeAfterRule$1.evaluate(AbstractBeforeAfterRule.java:43)
	at com.carrotsearch.randomizedtesting.rules.StatementAdapter.evaluate(StatementAdapter.java:36)
	at org.apache.lucene.util.TestRuleStoreClassName$1.evaluate(TestRuleStoreClassName.java:38)
	at com.carrotsearch.randomizedtesting.rules.NoShadowingOrOverridesOnMethodsRule$1.evaluate(NoShadowingOrOverridesOnMethodsRule.java:40)
	at com.carrotsearch.randomizedtesting.rules.NoShadowingOrOverridesOnMethodsRule$1.evaluate(NoShadowingOrOverridesOnMethodsRule.java:40)
	at com.carrotsearch.randomizedtesting.rules.StatementAdapter.evaluate(StatementAdapter.java:36)
	at com.carrotsearch.randomizedtesting.rules.StatementAdapter.evaluate(StatementAdapter.java:36)
	at org.apache.lucene.util.TestRuleAssertionsRequired$1.evaluate(TestRuleAssertionsRequired.java:53)
	at org.apache.lucene.util.AbstractBeforeAfterRule$1.evaluate(AbstractBeforeAfterRule.java:43)
	at org.apache.lucene.util.TestRuleMarkFailure$1.evaluate(TestRuleMarkFailure.java:44)
	at org.apache.lucene.util.TestRuleIgnoreAfterMaxFailures$1.evaluate(TestRuleIgnoreAfterMaxFailures.java:60)
	at org.apache.lucene.util.TestRuleIgnoreTestSuites$1.evaluate(TestRuleIgnoreTestSuites.java:47)
	at org.junit.rules.RunRules.evaluate(RunRules.java:20)
	at com.carrotsearch.randomizedtesting.rules.StatementAdapter.evaluate(StatementAdapter.java:36)
	at com.carrotsearch.randomizedtesting.ThreadLeakControl$StatementRunner.run(ThreadLeakControl.java:370)
	at com.carrotsearch.randomizedtesting.ThreadLeakControl.lambda$forkTimeoutingTask$0(ThreadLeakControl.java:826)
	at java.base/java.lang.Thread.run(Thread.java:833)


FAILED:  org.apache.solr.prometheus.exporter.SolrExporterIntegrationTest.jsonFacetMetrics

Error Message:
java.lang.AssertionError: Metric must have name and value: solr_metrics_jvm_buffers{pool="mapped - 'non-volatile memory'",base_url="http://127.0.0.1:51562/solr",} 0.0 expected:<2> but was:<5>

Stack Trace:
java.lang.AssertionError: Metric must have name and value: solr_metrics_jvm_buffers{pool="mapped - 'non-volatile memory'",base_url="http://127.0.0.1:51562/solr",} 0.0 expected:<2> but was:<5>
	at __randomizedtesting.SeedInfo.seed([83E2FCEB630BBB34:B0B70B6535D03D0A]:0)
	at org.junit.Assert.fail(Assert.java:89)
	at org.junit.Assert.failNotEquals(Assert.java:835)
	at org.junit.Assert.assertEquals(Assert.java:647)
	at org.apache.solr.prometheus.exporter.SolrExporterTestBase.getAllMetrics(SolrExporterTestBase.java:110)
	at org.apache.solr.prometheus.exporter.SolrExporterTestBase.startMetricsExporterWithConfiguration(SolrExporterTestBase.java:79)
	at org.apache.solr.prometheus.exporter.SolrExporterIntegrationTest.setUp(SolrExporterIntegrationTest.java:34)
	at java.base/jdk.internal.reflect.NativeMethodAccessorImpl.invoke0(Native Method)
	at java.base/jdk.internal.reflect.NativeMethodAccessorImpl.invoke(NativeMethodAccessorImpl.java:77)
	at java.base/jdk.internal.reflect.DelegatingMethodAccessorImpl.invoke(DelegatingMethodAccessorImpl.java:43)
	at java.base/java.lang.reflect.Method.invoke(Method.java:568)
	at com.carrotsearch.randomizedtesting.RandomizedRunner.invoke(RandomizedRunner.java:1754)
	at com.carrotsearch.randomizedtesting.RandomizedRunner$9.evaluate(RandomizedRunner.java:976)
	at com.carrotsearch.randomizedtesting.RandomizedRunner$10.evaluate(RandomizedRunner.java:992)
	at com.carrotsearch.randomizedtesting.rules.SystemPropertiesRestoreRule$1.evaluate(SystemPropertiesRestoreRule.java:57)
	at org.junit.rules.RunRules.evaluate(RunRules.java:20)
	at org.apache.lucene.util.TestRuleSetupTeardownChained$1.evaluate(TestRuleSetupTeardownChained.java:44)
	at org.apache.lucene.util.AbstractBeforeAfterRule$1.evaluate(AbstractBeforeAfterRule.java:43)
	at org.apache.lucene.util.TestRuleThreadAndTestName$1.evaluate(TestRuleThreadAndTestName.java:45)
	at org.apache.lucene.util.TestRuleIgnoreAfterMaxFailures$1.evaluate(TestRuleIgnoreAfterMaxFailures.java:60)
	at org.apache.lucene.util.TestRuleMarkFailure$1.evaluate(TestRuleMarkFailure.java:44)
	at org.junit.rules.RunRules.evaluate(RunRules.java:20)
	at com.carrotsearch.randomizedtesting.rules.StatementAdapter.evaluate(StatementAdapter.java:36)
	at com.carrotsearch.randomizedtesting.ThreadLeakControl$StatementRunner.run(ThreadLeakControl.java:370)
	at com.carrotsearch.randomizedtesting.ThreadLeakControl.forkTimeoutingTask(ThreadLeakControl.java:819)
	at com.carrotsearch.randomizedtesting.ThreadLeakControl$3.evaluate(ThreadLeakControl.java:470)
	at com.carrotsearch.randomizedtesting.RandomizedRunner.runSingleTest(RandomizedRunner.java:951)
	at com.carrotsearch.randomizedtesting.RandomizedRunner$5.evaluate(RandomizedRunner.java:836)
	at com.carrotsearch.randomizedtesting.RandomizedRunner$6.evaluate(RandomizedRunner.java:887)
	at com.carrotsearch.randomizedtesting.RandomizedRunner$7.evaluate(RandomizedRunner.java:898)
	at com.carrotsearch.randomizedtesting.rules.StatementAdapter.evaluate(StatementAdapter.java:36)
	at org.apache.lucene.util.AbstractBeforeAfterRule$1.evaluate(AbstractBeforeAfterRule.java:43)
	at org.apache.lucene.util.AbstractBeforeAfterRule$1.evaluate(AbstractBeforeAfterRule.java:43)
	at com.carrotsearch.randomizedtesting.rules.SystemPropertiesRestoreRule$1.evaluate(SystemPropertiesRestoreRule.java:57)
	at org.junit.rules.RunRules.evaluate(RunRules.java:20)
	at org.apache.lucene.util.AbstractBeforeAfterRule$1.evaluate(AbstractBeforeAfterRule.java:43)
	at com.carrotsearch.randomizedtesting.rules.StatementAdapter.evaluate(StatementAdapter.java:36)
	at org.apache.lucene.util.TestRuleStoreClassName$1.evaluate(TestRuleStoreClassName.java:38)
	at com.carrotsearch.randomizedtesting.rules.NoShadowingOrOverridesOnMethodsRule$1.evaluate(NoShadowingOrOverridesOnMethodsRule.java:40)
	at com.carrotsearch.randomizedtesting.rules.NoShadowingOrOverridesOnMethodsRule$1.evaluate(NoShadowingOrOverridesOnMethodsRule.java:40)
	at com.carrotsearch.randomizedtesting.rules.StatementAdapter.evaluate(StatementAdapter.java:36)
	at com.carrotsearch.randomizedtesting.rules.StatementAdapter.evaluate(StatementAdapter.java:36)
	at org.apache.lucene.util.TestRuleAssertionsRequired$1.evaluate(TestRuleAssertionsRequired.java:53)
	at org.apache.lucene.util.AbstractBeforeAfterRule$1.evaluate(AbstractBeforeAfterRule.java:43)
	at org.apache.lucene.util.TestRuleMarkFailure$1.evaluate(TestRuleMarkFailure.java:44)
	at org.apache.lucene.util.TestRuleIgnoreAfterMaxFailures$1.evaluate(TestRuleIgnoreAfterMaxFailures.java:60)
	at org.apache.lucene.util.TestRuleIgnoreTestSuites$1.evaluate(TestRuleIgnoreTestSuites.java:47)
	at org.junit.rules.RunRules.evaluate(RunRules.java:20)
	at com.carrotsearch.randomizedtesting.rules.StatementAdapter.evaluate(StatementAdapter.java:36)
	at com.carrotsearch.randomizedtesting.ThreadLeakControl$StatementRunner.run(ThreadLeakControl.java:370)
	at com.carrotsearch.randomizedtesting.ThreadLeakControl.lambda$forkTimeoutingTask$0(ThreadLeakControl.java:826)
	at java.base/java.lang.Thread.run(Thread.java:833)


FAILED:  org.apache.solr.prometheus.exporter.SolrExporterIntegrationTest.jvmMetrics

Error Message:
java.lang.AssertionError: Metric must have name and value: solr_metrics_jvm_buffers{pool="mapped - 'non-volatile memory'",base_url="http://127.0.0.1:51562/solr",} 0.0 expected:<2> but was:<5>

Stack Trace:
java.lang.AssertionError: Metric must have name and value: solr_metrics_jvm_buffers{pool="mapped - 'non-volatile memory'",base_url="http://127.0.0.1:51562/solr",} 0.0 expected:<2> but was:<5>
	at __randomizedtesting.SeedInfo.seed([83E2FCEB630BBB34:5056C10476E577A0]:0)
	at org.junit.Assert.fail(Assert.java:89)
	at org.junit.Assert.failNotEquals(Assert.java:835)
	at org.junit.Assert.assertEquals(Assert.java:647)
	at org.apache.solr.prometheus.exporter.SolrExporterTestBase.getAllMetrics(SolrExporterTestBase.java:110)
	at org.apache.solr.prometheus.exporter.SolrExporterTestBase.startMetricsExporterWithConfiguration(SolrExporterTestBase.java:79)
	at org.apache.solr.prometheus.exporter.SolrExporterIntegrationTest.setUp(SolrExporterIntegrationTest.java:34)
	at java.base/jdk.internal.reflect.NativeMethodAccessorImpl.invoke0(Native Method)
	at java.base/jdk.internal.reflect.NativeMethodAccessorImpl.invoke(NativeMethodAccessorImpl.java:77)
	at java.base/jdk.internal.reflect.DelegatingMethodAccessorImpl.invoke(DelegatingMethodAccessorImpl.java:43)
	at java.base/java.lang.reflect.Method.invoke(Method.java:568)
	at com.carrotsearch.randomizedtesting.RandomizedRunner.invoke(RandomizedRunner.java:1754)
	at com.carrotsearch.randomizedtesting.RandomizedRunner$9.evaluate(RandomizedRunner.java:976)
	at com.carrotsearch.randomizedtesting.RandomizedRunner$10.evaluate(RandomizedRunner.java:992)
	at com.carrotsearch.randomizedtesting.rules.SystemPropertiesRestoreRule$1.evaluate(SystemPropertiesRestoreRule.java:57)
	at org.junit.rules.RunRules.evaluate(RunRules.java:20)
	at org.apache.lucene.util.TestRuleSetupTeardownChained$1.evaluate(TestRuleSetupTeardownChained.java:44)
	at org.apache.lucene.util.AbstractBeforeAfterRule$1.evaluate(AbstractBeforeAfterRule.java:43)
	at org.apache.lucene.util.TestRuleThreadAndTestName$1.evaluate(TestRuleThreadAndTestName.java:45)
	at org.apache.lucene.util.TestRuleIgnoreAfterMaxFailures$1.evaluate(TestRuleIgnoreAfterMaxFailures.java:60)
	at org.apache.lucene.util.TestRuleMarkFailure$1.evaluate(TestRuleMarkFailure.java:44)
	at org.junit.rules.RunRules.evaluate(RunRules.java:20)
	at com.carrotsearch.randomizedtesting.rules.StatementAdapter.evaluate(StatementAdapter.java:36)
	at com.carrotsearch.randomizedtesting.ThreadLeakControl$StatementRunner.run(ThreadLeakControl.java:370)
	at com.carrotsearch.randomizedtesting.ThreadLeakControl.forkTimeoutingTask(ThreadLeakControl.java:819)
	at com.carrotsearch.randomizedtesting.ThreadLeakControl$3.evaluate(ThreadLeakControl.java:470)
	at com.carrotsearch.randomizedtesting.RandomizedRunner.runSingleTest(RandomizedRunner.java:951)
	at com.carrotsearch.randomizedtesting.RandomizedRunner$5.evaluate(RandomizedRunner.java:836)
	at com.carrotsearch.randomizedtesting.RandomizedRunner$6.evaluate(RandomizedRunner.java:887)
	at com.carrotsearch.randomizedtesting.RandomizedRunner$7.evaluate(RandomizedRunner.java:898)
	at com.carrotsearch.randomizedtesting.rules.StatementAdapter.evaluate(StatementAdapter.java:36)
	at org.apache.lucene.util.AbstractBeforeAfterRule$1.evaluate(AbstractBeforeAfterRule.java:43)
	at org.apache.lucene.util.AbstractBeforeAfterRule$1.evaluate(AbstractBeforeAfterRule.java:43)
	at com.carrotsearch.randomizedtesting.rules.SystemPropertiesRestoreRule$1.evaluate(SystemPropertiesRestoreRule.java:57)
	at org.junit.rules.RunRules.evaluate(RunRules.java:20)
	at org.apache.lucene.util.AbstractBeforeAfterRule$1.evaluate(AbstractBeforeAfterRule.java:43)
	at com.carrotsearch.randomizedtesting.rules.StatementAdapter.evaluate(StatementAdapter.java:36)
	at org.apache.lucene.util.TestRuleStoreClassName$1.evaluate(TestRuleStoreClassName.java:38)
	at com.carrotsearch.randomizedtesting.rules.NoShadowingOrOverridesOnMethodsRule$1.evaluate(NoShadowingOrOverridesOnMethodsRule.java:40)
	at com.carrotsearch.randomizedtesting.rules.NoShadowingOrOverridesOnMethodsRule$1.evaluate(NoShadowingOrOverridesOnMethodsRule.java:40)
	at com.carrotsearch.randomizedtesting.rules.StatementAdapter.evaluate(StatementAdapter.java:36)
	at com.carrotsearch.randomizedtesting.rules.StatementAdapter.evaluate(StatementAdapter.java:36)
	at org.apache.lucene.util.TestRuleAssertionsRequired$1.evaluate(TestRuleAssertionsRequired.java:53)
	at org.apache.lucene.util.AbstractBeforeAfterRule$1.evaluate(AbstractBeforeAfterRule.java:43)
	at org.apache.lucene.util.TestRuleMarkFailure$1.evaluate(TestRuleMarkFailure.java:44)
	at org.apache.lucene.util.TestRuleIgnoreAfterMaxFailures$1.evaluate(TestRuleIgnoreAfterMaxFailures.java:60)
	at org.apache.lucene.util.TestRuleIgnoreTestSuites$1.evaluate(TestRuleIgnoreTestSuites.java:47)
	at org.junit.rules.RunRules.evaluate(RunRules.java:20)
	at com.carrotsearch.randomizedtesting.rules.StatementAdapter.evaluate(StatementAdapter.java:36)
	at com.carrotsearch.randomizedtesting.ThreadLeakControl$StatementRunner.run(ThreadLeakControl.java:370)
	at com.carrotsearch.randomizedtesting.ThreadLeakControl.lambda$forkTimeoutingTask$0(ThreadLeakControl.java:826)
	at java.base/java.lang.Thread.run(Thread.java:833)


FAILED:  org.apache.solr.prometheus.exporter.SolrExporterIntegrationTest.solrExporterDurationMetric

Error Message:
java.lang.AssertionError: Metric must have name and value: solr_metrics_jvm_buffers{pool="mapped - 'non-volatile memory'",base_url="http://127.0.0.1:51562/solr",} 0.0 expected:<2> but was:<5>

Stack Trace:
java.lang.AssertionError: Metric must have name and value: solr_metrics_jvm_buffers{pool="mapped - 'non-volatile memory'",base_url="http://127.0.0.1:51562/solr",} 0.0 expected:<2> but was:<5>
	at __randomizedtesting.SeedInfo.seed([83E2FCEB630BBB34:38E787A7FD968EC7]:0)
	at org.junit.Assert.fail(Assert.java:89)
	at org.junit.Assert.failNotEquals(Assert.java:835)
	at org.junit.Assert.assertEquals(Assert.java:647)
	at org.apache.solr.prometheus.exporter.SolrExporterTestBase.getAllMetrics(SolrExporterTestBase.java:110)
	at org.apache.solr.prometheus.exporter.SolrExporterTestBase.startMetricsExporterWithConfiguration(SolrExporterTestBase.java:79)
	at org.apache.solr.prometheus.exporter.SolrExporterIntegrationTest.setUp(SolrExporterIntegrationTest.java:34)
	at java.base/jdk.internal.reflect.NativeMethodAccessorImpl.invoke0(Native Method)
	at java.base/jdk.internal.reflect.NativeMethodAccessorImpl.invoke(NativeMethodAccessorImpl.java:77)
	at java.base/jdk.internal.reflect.DelegatingMethodAccessorImpl.invoke(DelegatingMethodAccessorImpl.java:43)
	at java.base/java.lang.reflect.Method.invoke(Method.java:568)
	at com.carrotsearch.randomizedtesting.RandomizedRunner.invoke(RandomizedRunner.java:1754)
	at com.carrotsearch.randomizedtesting.RandomizedRunner$9.evaluate(RandomizedRunner.java:976)
	at com.carrotsearch.randomizedtesting.RandomizedRunner$10.evaluate(RandomizedRunner.java:992)
	at com.carrotsearch.randomizedtesting.rules.SystemPropertiesRestoreRule$1.evaluate(SystemPropertiesRestoreRule.java:57)
	at org.junit.rules.RunRules.evaluate(RunRules.java:20)
	at org.apache.lucene.util.TestRuleSetupTeardownChained$1.evaluate(TestRuleSetupTeardownChained.java:44)
	at org.apache.lucene.util.AbstractBeforeAfterRule$1.evaluate(AbstractBeforeAfterRule.java:43)
	at org.apache.lucene.util.TestRuleThreadAndTestName$1.evaluate(TestRuleThreadAndTestName.java:45)
	at org.apache.lucene.util.TestRuleIgnoreAfterMaxFailures$1.evaluate(TestRuleIgnoreAfterMaxFailures.java:60)
	at org.apache.lucene.util.TestRuleMarkFailure$1.evaluate(TestRuleMarkFailure.java:44)
	at org.junit.rules.RunRules.evaluate(RunRules.java:20)
	at com.carrotsearch.randomizedtesting.rules.StatementAdapter.evaluate(StatementAdapter.java:36)
	at com.carrotsearch.randomizedtesting.ThreadLeakControl$StatementRunner.run(ThreadLeakControl.java:370)
	at com.carrotsearch.randomizedtesting.ThreadLeakControl.forkTimeoutingTask(ThreadLeakControl.java:819)
	at com.carrotsearch.randomizedtesting.ThreadLeakControl$3.evaluate(ThreadLeakControl.java:470)
	at com.carrotsearch.randomizedtesting.RandomizedRunner.runSingleTest(RandomizedRunner.java:951)
	at com.carrotsearch.randomizedtesting.RandomizedRunner$5.evaluate(RandomizedRunner.java:836)
	at com.carrotsearch.randomizedtesting.RandomizedRunner$6.evaluate(RandomizedRunner.java:887)
	at com.carrotsearch.randomizedtesting.RandomizedRunner$7.evaluate(RandomizedRunner.java:898)
	at com.carrotsearch.randomizedtesting.rules.StatementAdapter.evaluate(StatementAdapter.java:36)
	at org.apache.lucene.util.AbstractBeforeAfterRule$1.evaluate(AbstractBeforeAfterRule.java:43)
	at org.apache.lucene.util.AbstractBeforeAfterRule$1.evaluate(AbstractBeforeAfterRule.java:43)
	at com.carrotsearch.randomizedtesting.rules.SystemPropertiesRestoreRule$1.evaluate(SystemPropertiesRestoreRule.java:57)
	at org.junit.rules.RunRules.evaluate(RunRules.java:20)
	at org.apache.lucene.util.AbstractBeforeAfterRule$1.evaluate(AbstractBeforeAfterRule.java:43)
	at com.carrotsearch.randomizedtesting.rules.StatementAdapter.evaluate(StatementAdapter.java:36)
	at org.apache.lucene.util.TestRuleStoreClassName$1.evaluate(TestRuleStoreClassName.java:38)
	at com.carrotsearch.randomizedtesting.rules.NoShadowingOrOverridesOnMethodsRule$1.evaluate(NoShadowingOrOverridesOnMethodsRule.java:40)
	at com.carrotsearch.randomizedtesting.rules.NoShadowingOrOverridesOnMethodsRule$1.evaluate(NoShadowingOrOverridesOnMethodsRule.java:40)
	at com.carrotsearch.randomizedtesting.rules.StatementAdapter.evaluate(StatementAdapter.java:36)
	at com.carrotsearch.randomizedtesting.rules.StatementAdapter.evaluate(StatementAdapter.java:36)
	at org.apache.lucene.util.TestRuleAssertionsRequired$1.evaluate(TestRuleAssertionsRequired.java:53)
	at org.apache.lucene.util.AbstractBeforeAfterRule$1.evaluate(AbstractBeforeAfterRule.java:43)
	at org.apache.lucene.util.TestRuleMarkFailure$1.evaluate(TestRuleMarkFailure.java:44)
	at org.apache.lucene.util.TestRuleIgnoreAfterMaxFailures$1.evaluate(TestRuleIgnoreAfterMaxFailures.java:60)
	at org.apache.lucene.util.TestRuleIgnoreTestSuites$1.evaluate(TestRuleIgnoreTestSuites.java:47)
	at org.junit.rules.RunRules.evaluate(RunRules.java:20)
	at com.carrotsearch.randomizedtesting.rules.StatementAdapter.evaluate(StatementAdapter.java:36)
	at com.carrotsearch.randomizedtesting.ThreadLeakControl$StatementRunner.run(ThreadLeakControl.java:370)
	at com.carrotsearch.randomizedtesting.ThreadLeakControl.lambda$forkTimeoutingTask$0(ThreadLeakControl.java:826)
	at java.base/java.lang.Thread.run(Thread.java:833)