You are viewing a plain text version of this content. The canonical link for it is here.
Posted to dev@zookeeper.apache.org by Apache Jenkins Server <je...@builds.apache.org> on 2015/02/25 03:51:05 UTC
Failed: ZOOKEEPER-1846 PreCommit Build #2532
Jira: https://issues.apache.org/jira/browse/ZOOKEEPER-1846
Build: https://builds.apache.org/job/PreCommit-ZOOKEEPER-Build/2532/
###################################################################################
########################## LAST 60 LINES OF THE CONSOLE ###########################
[...truncated 89 lines...]
[exec]
[exec]
[exec] PATCH APPLICATION FAILED
[exec]
[exec]
[exec]
[exec]
[exec] -1 overall. Here are the results of testing the latest attachment
[exec] http://issues.apache.org/jira/secure/attachment/12700663/QuorumCnxManager.java
[exec] against trunk revision 1662055.
[exec]
[exec] +1 @author. The patch does not contain any @author tags.
[exec]
[exec] -1 tests included. The patch doesn't appear to include any new or modified tests.
[exec] Please justify why no new tests are needed for this patch.
[exec] Also please list what manual steps were performed to verify this patch.
[exec]
[exec] -1 patch. The patch command could not apply the patch.
[exec]
[exec] Console output: https://builds.apache.org/job/PreCommit-ZOOKEEPER-Build/2532//console
[exec]
[exec] This message is automatically generated.
[exec]
[exec]
[exec] ======================================================================
[exec] ======================================================================
[exec] Adding comment to Jira.
[exec] ======================================================================
[exec] ======================================================================
[exec]
[exec]
[exec] Comment added.
[exec] b677cd528d12c50e0929cf85456034f9d74bedb9 logged out
[exec]
[exec]
[exec] ======================================================================
[exec] ======================================================================
[exec] Finished build.
[exec] ======================================================================
[exec] ======================================================================
[exec]
[exec]
BUILD FAILED
/home/jenkins/jenkins-slave/workspace/PreCommit-ZOOKEEPER-Build/trunk/build.xml:1714: exec returned: 1
Total time: 41 seconds
Build step 'Execute shell' marked build as failure
Archiving artifacts
Sending artifact delta relative to PreCommit-ZOOKEEPER-Build #2489
Archived 6 artifacts
Archive block size is 32768
Received 3 blocks and 456459 bytes
Compression is 17.7%
Took 0.9 sec
Recording test results
Description set: ZOOKEEPER-1846
Email was triggered for: Failure
Sending email for trigger: Failure
###################################################################################
############################## FAILED TESTS (if any) ##############################
No tests ran.
Failed: ZOOKEEPER-1621 PreCommit Build #2538
Posted by Apache Jenkins Server <je...@builds.apache.org>.
Jira: https://issues.apache.org/jira/browse/ZOOKEEPER-1621
Build: https://builds.apache.org/job/PreCommit-ZOOKEEPER-Build/2538/
###################################################################################
########################## LAST 60 LINES OF THE CONSOLE ###########################
[...truncated 349863 lines...]
[exec]
[exec] +1 @author. The patch does not contain any @author tags.
[exec]
[exec] +1 tests included. The patch appears to include 3 new or modified tests.
[exec]
[exec] +1 javadoc. The javadoc tool did not generate any warning messages.
[exec]
[exec] +1 javac. The applied patch does not increase the total number of javac compiler warnings.
[exec]
[exec] +1 findbugs. The patch does not introduce any new Findbugs (version 2.0.3) warnings.
[exec]
[exec] +1 release audit. The applied patch does not increase the total number of release audit warnings.
[exec]
[exec] -1 core tests. The patch failed core unit tests.
[exec]
[exec] +1 contrib tests. The patch passed contrib unit tests.
[exec]
[exec] Test results: https://builds.apache.org/job/PreCommit-ZOOKEEPER-Build/2538//testReport/
[exec] Findbugs warnings: https://builds.apache.org/job/PreCommit-ZOOKEEPER-Build/2538//artifact/trunk/build/test/findbugs/newPatchFindbugsWarnings.html
[exec] Console output: https://builds.apache.org/job/PreCommit-ZOOKEEPER-Build/2538//console
[exec]
[exec] This message is automatically generated.
[exec]
[exec]
[exec] ======================================================================
[exec] ======================================================================
[exec] Adding comment to Jira.
[exec] ======================================================================
[exec] ======================================================================
[exec]
[exec]
[exec] Comment added.
[exec] 471afd92f3af5c8622e46d55edd0419379e93409 logged out
[exec]
[exec]
[exec] ======================================================================
[exec] ======================================================================
[exec] Finished build.
[exec] ======================================================================
[exec] ======================================================================
[exec]
[exec]
BUILD FAILED
/home/jenkins/jenkins-slave/workspace/PreCommit-ZOOKEEPER-Build/trunk/build.xml:1714: exec returned: 1
Total time: 46 minutes 30 seconds
Build step 'Execute shell' marked build as failure
Archiving artifacts
Sending artifact delta relative to PreCommit-ZOOKEEPER-Build #2489
Archived 7 artifacts
Archive block size is 32768
Received 3 blocks and 459484 bytes
Compression is 17.6%
Took 1 sec
Recording test results
Description set: ZOOKEEPER-1621
Email was triggered for: Failure
Sending email for trigger: Failure
###################################################################################
############################## FAILED TESTS (if any) ##############################
2 tests failed.
REGRESSION: org.apache.zookeeper.server.quorum.ReconfigRecoveryTest.testCurrentObserverIsParticipantInNewConfig
Error Message:
waiting for server 2 being up
Stack Trace:
junit.framework.AssertionFailedError: waiting for server 2 being up
at org.apache.zookeeper.server.quorum.ReconfigRecoveryTest.testCurrentObserverIsParticipantInNewConfig(ReconfigRecoveryTest.java:529)
at org.apache.zookeeper.JUnit4ZKTestRunner$LoggedInvokeMethod.evaluate(JUnit4ZKTestRunner.java:52)
REGRESSION: org.apache.zookeeper.test.AsyncHammerTest.testHammer
Error Message:
null
Stack Trace:
junit.framework.AssertionFailedError
at org.apache.zookeeper.test.AsyncHammerTest.testHammer(AsyncHammerTest.java:186)
at org.apache.zookeeper.JUnit4ZKTestRunner$LoggedInvokeMethod.evaluate(JUnit4ZKTestRunner.java:52)
Failed: ZOOKEEPER-2115 PreCommit Build #2537
Posted by Apache Jenkins Server <je...@builds.apache.org>.
Jira: https://issues.apache.org/jira/browse/ZOOKEEPER-2115
Build: https://builds.apache.org/job/PreCommit-ZOOKEEPER-Build/2537/
###################################################################################
########################## LAST 60 LINES OF THE CONSOLE ###########################
[...truncated 113 lines...]
[exec] Skipping patch.
[exec] 1 out of 1 hunk ignored
[exec] PATCH APPLICATION FAILED
[exec]
[exec]
[exec]
[exec]
[exec] -1 overall. Here are the results of testing the latest attachment
[exec] http://issues.apache.org/jira/secure/attachment/12700846/ZOOKEEPER-2115-1.patch
[exec] against trunk revision 1662055.
[exec]
[exec] +1 @author. The patch does not contain any @author tags.
[exec]
[exec] -1 tests included. The patch doesn't appear to include any new or modified tests.
[exec] Please justify why no new tests are needed for this patch.
[exec] Also please list what manual steps were performed to verify this patch.
[exec]
[exec] -1 patch. The patch command could not apply the patch.
[exec]
[exec] Console output: https://builds.apache.org/job/PreCommit-ZOOKEEPER-Build/2537//console
[exec]
[exec] This message is automatically generated.
[exec]
[exec]
[exec] ======================================================================
[exec] ======================================================================
[exec] Adding comment to Jira.
[exec] ======================================================================
[exec] ======================================================================
[exec]
[exec]
[exec] Comment added.
[exec] ef8414b699467451a86b6ed6fba2e5e711c5328f logged out
[exec]
[exec]
[exec] ======================================================================
[exec] ======================================================================
[exec] Finished build.
[exec] ======================================================================
[exec] ======================================================================
[exec]
[exec]
BUILD FAILED
/home/jenkins/jenkins-slave/workspace/PreCommit-ZOOKEEPER-Build/trunk/build.xml:1714: exec returned: 1
Total time: 47 seconds
Build step 'Execute shell' marked build as failure
Archiving artifacts
Sending artifact delta relative to PreCommit-ZOOKEEPER-Build #2489
Archived 1 artifacts
Archive block size is 32768
Received 0 blocks and 60691 bytes
Compression is 0.0%
Took 1.3 sec
Recording test results
Description set: ZOOKEEPER-2115
Email was triggered for: Failure
Sending email for trigger: Failure
###################################################################################
############################## FAILED TESTS (if any) ##############################
No tests ran.
Failed: ZOOKEEPER-2125 PreCommit Build #2536
Posted by Apache Jenkins Server <je...@builds.apache.org>.
Jira: https://issues.apache.org/jira/browse/ZOOKEEPER-2125
Build: https://builds.apache.org/job/PreCommit-ZOOKEEPER-Build/2536/
###################################################################################
########################## LAST 60 LINES OF THE CONSOLE ###########################
[...truncated 349667 lines...]
[exec]
[exec] +1 @author. The patch does not contain any @author tags.
[exec]
[exec] +1 tests included. The patch appears to include 14 new or modified tests.
[exec]
[exec] +1 javadoc. The javadoc tool did not generate any warning messages.
[exec]
[exec] +1 javac. The applied patch does not increase the total number of javac compiler warnings.
[exec]
[exec] +1 findbugs. The patch does not introduce any new Findbugs (version 2.0.3) warnings.
[exec]
[exec] +1 release audit. The applied patch does not increase the total number of release audit warnings.
[exec]
[exec] -1 core tests. The patch failed core unit tests.
[exec]
[exec] +1 contrib tests. The patch passed contrib unit tests.
[exec]
[exec] Test results: https://builds.apache.org/job/PreCommit-ZOOKEEPER-Build/2536//testReport/
[exec] Findbugs warnings: https://builds.apache.org/job/PreCommit-ZOOKEEPER-Build/2536//artifact/trunk/build/test/findbugs/newPatchFindbugsWarnings.html
[exec] Console output: https://builds.apache.org/job/PreCommit-ZOOKEEPER-Build/2536//console
[exec]
[exec] This message is automatically generated.
[exec]
[exec]
[exec] ======================================================================
[exec] ======================================================================
[exec] Adding comment to Jira.
[exec] ======================================================================
[exec] ======================================================================
[exec]
[exec]
[exec] Comment added.
[exec] 4519f0c3c4d76f13b4de14a6b113876dd81ec992 logged out
[exec]
[exec]
[exec] ======================================================================
[exec] ======================================================================
[exec] Finished build.
[exec] ======================================================================
[exec] ======================================================================
[exec]
[exec]
BUILD FAILED
/home/jenkins/jenkins-slave/workspace/PreCommit-ZOOKEEPER-Build/trunk/build.xml:1714: exec returned: 1
Total time: 45 minutes 36 seconds
Build step 'Execute shell' marked build as failure
Archiving artifacts
Sending artifact delta relative to PreCommit-ZOOKEEPER-Build #2489
Archived 7 artifacts
Archive block size is 32768
Received 2 blocks and 492349 bytes
Compression is 11.7%
Took 1.7 sec
Recording test results
Description set: ZOOKEEPER-2125
Email was triggered for: Failure
Sending email for trigger: Failure
###################################################################################
############################## FAILED TESTS (if any) ##############################
1 tests failed.
FAILED: org.apache.zookeeper.test.ReconfigTest.testPortChange
Error Message:
expected:<test[1]> but was:<test[0]>
Stack Trace:
junit.framework.AssertionFailedError: expected:<test[1]> but was:<test[0]>
at org.apache.zookeeper.test.ReconfigTest.testNormalOperation(ReconfigTest.java:151)
at org.apache.zookeeper.test.ReconfigTest.testPortChange(ReconfigTest.java:600)
at org.apache.zookeeper.JUnit4ZKTestRunner$LoggedInvokeMethod.evaluate(JUnit4ZKTestRunner.java:52)
Failed: ZOOKEEPER-2125 PreCommit Build #2535
Posted by Apache Jenkins Server <je...@builds.apache.org>.
Jira: https://issues.apache.org/jira/browse/ZOOKEEPER-2125
Build: https://builds.apache.org/job/PreCommit-ZOOKEEPER-Build/2535/
###################################################################################
########################## LAST 60 LINES OF THE CONSOLE ###########################
[...truncated 344842 lines...]
[exec] +1 @author. The patch does not contain any @author tags.
[exec]
[exec] +1 tests included. The patch appears to include 17 new or modified tests.
[exec]
[exec] +1 javadoc. The javadoc tool did not generate any warning messages.
[exec]
[exec] +1 javac. The applied patch does not increase the total number of javac compiler warnings.
[exec]
[exec] +1 findbugs. The patch does not introduce any new Findbugs (version 2.0.3) warnings.
[exec]
[exec] -1 release audit. The applied patch generated 1 release audit warnings (more than the trunk's current 0 warnings).
[exec]
[exec] -1 core tests. The patch failed core unit tests.
[exec]
[exec] +1 contrib tests. The patch passed contrib unit tests.
[exec]
[exec] Test results: https://builds.apache.org/job/PreCommit-ZOOKEEPER-Build/2535//testReport/
[exec] Release audit warnings: https://builds.apache.org/job/PreCommit-ZOOKEEPER-Build/2535//artifact/trunk/patchprocess/patchReleaseAuditProblems.txt
[exec] Findbugs warnings: https://builds.apache.org/job/PreCommit-ZOOKEEPER-Build/2535//artifact/trunk/build/test/findbugs/newPatchFindbugsWarnings.html
[exec] Console output: https://builds.apache.org/job/PreCommit-ZOOKEEPER-Build/2535//console
[exec]
[exec] This message is automatically generated.
[exec]
[exec]
[exec] ======================================================================
[exec] ======================================================================
[exec] Adding comment to Jira.
[exec] ======================================================================
[exec] ======================================================================
[exec]
[exec]
[exec] Comment added.
[exec] 1d183d7802d1bf46a9fccfdb5d969336751db909 logged out
[exec]
[exec]
[exec] ======================================================================
[exec] ======================================================================
[exec] Finished build.
[exec] ======================================================================
[exec] ======================================================================
[exec]
[exec]
BUILD FAILED
/home/jenkins/jenkins-slave/workspace/PreCommit-ZOOKEEPER-Build/trunk/build.xml:1714: exec returned: 2
Total time: 45 minutes 1 second
Build step 'Execute shell' marked build as failure
Archiving artifacts
Sending artifact delta relative to PreCommit-ZOOKEEPER-Build #2489
Archived 8 artifacts
Archive block size is 32768
Received 2 blocks and 496177 bytes
Compression is 11.7%
Took 0.96 sec
Recording test results
Description set: ZOOKEEPER-2125
Email was triggered for: Failure
Sending email for trigger: Failure
###################################################################################
############################## FAILED TESTS (if any) ##############################
2 tests failed.
REGRESSION: org.apache.zookeeper.test.AsyncHammerTest.testHammer
Error Message:
null
Stack Trace:
junit.framework.AssertionFailedError
at org.apache.zookeeper.test.AsyncHammerTest.testHammer(AsyncHammerTest.java:186)
at org.apache.zookeeper.JUnit4ZKTestRunner$LoggedInvokeMethod.evaluate(JUnit4ZKTestRunner.java:52)
REGRESSION: org.apache.zookeeper.test.ReconfigTest.testPortChange
Error Message:
expected:<test[1]> but was:<test[0]>
Stack Trace:
junit.framework.AssertionFailedError: expected:<test[1]> but was:<test[0]>
at org.apache.zookeeper.test.ReconfigTest.testNormalOperation(ReconfigTest.java:151)
at org.apache.zookeeper.test.ReconfigTest.testPortChange(ReconfigTest.java:600)
at org.apache.zookeeper.JUnit4ZKTestRunner$LoggedInvokeMethod.evaluate(JUnit4ZKTestRunner.java:52)
Failed: ZOOKEEPER-1846 PreCommit Build #2534
Posted by Apache Jenkins Server <je...@builds.apache.org>.
Jira: https://issues.apache.org/jira/browse/ZOOKEEPER-1846
Build: https://builds.apache.org/job/PreCommit-ZOOKEEPER-Build/2534/
###################################################################################
########################## LAST 60 LINES OF THE CONSOLE ###########################
[...truncated 94 lines...]
[exec] Hunk #1 FAILED at 120.
[exec] 1 out of 1 hunk FAILED -- saving rejects to file src/java/main/org/apache/zookeeper/server/quorum/QuorumPeer.java.rej
[exec] PATCH APPLICATION FAILED
[exec]
[exec]
[exec]
[exec]
[exec] -1 overall. Here are the results of testing the latest attachment
[exec] http://issues.apache.org/jira/secure/attachment/12700668/DynamicIP.java.patch
[exec] against trunk revision 1662055.
[exec]
[exec] +1 @author. The patch does not contain any @author tags.
[exec]
[exec] -1 tests included. The patch doesn't appear to include any new or modified tests.
[exec] Please justify why no new tests are needed for this patch.
[exec] Also please list what manual steps were performed to verify this patch.
[exec]
[exec] -1 patch. The patch command could not apply the patch.
[exec]
[exec] Console output: https://builds.apache.org/job/PreCommit-ZOOKEEPER-Build/2534//console
[exec]
[exec] This message is automatically generated.
[exec]
[exec]
[exec] ======================================================================
[exec] ======================================================================
[exec] Adding comment to Jira.
[exec] ======================================================================
[exec] ======================================================================
[exec]
[exec]
[exec] Comment added.
[exec] da05c093778e10895188ae22a129c9b4e9f4a149 logged out
[exec]
[exec]
[exec] ======================================================================
[exec] ======================================================================
[exec] Finished build.
[exec] ======================================================================
[exec] ======================================================================
[exec]
[exec]
BUILD FAILED
/home/jenkins/jenkins-slave/workspace/PreCommit-ZOOKEEPER-Build/trunk/build.xml:1714: exec returned: 1
Total time: 42 seconds
Build step 'Execute shell' marked build as failure
Archiving artifacts
Sending artifact delta relative to PreCommit-ZOOKEEPER-Build #2489
Archived 1 artifacts
Archive block size is 32768
Received 0 blocks and 60691 bytes
Compression is 0.0%
Took 0.6 sec
Recording test results
Description set: ZOOKEEPER-1846
Email was triggered for: Failure
Sending email for trigger: Failure
###################################################################################
############################## FAILED TESTS (if any) ##############################
No tests ran.
Failed: ZOOKEEPER-1846 PreCommit Build #2533
Posted by Apache Jenkins Server <je...@builds.apache.org>.
Jira: https://issues.apache.org/jira/browse/ZOOKEEPER-1846
Build: https://builds.apache.org/job/PreCommit-ZOOKEEPER-Build/2533/
###################################################################################
########################## LAST 60 LINES OF THE CONSOLE ###########################
[...truncated 129 lines...]
[exec] Skipping patch.
[exec] 1 out of 1 hunk ignored
[exec] PATCH APPLICATION FAILED
[exec]
[exec]
[exec]
[exec]
[exec] -1 overall. Here are the results of testing the latest attachment
[exec] http://issues.apache.org/jira/secure/attachment/12700667/DynamicIP.java.patch
[exec] against trunk revision 1662055.
[exec]
[exec] +1 @author. The patch does not contain any @author tags.
[exec]
[exec] -1 tests included. The patch doesn't appear to include any new or modified tests.
[exec] Please justify why no new tests are needed for this patch.
[exec] Also please list what manual steps were performed to verify this patch.
[exec]
[exec] -1 patch. The patch command could not apply the patch.
[exec]
[exec] Console output: https://builds.apache.org/job/PreCommit-ZOOKEEPER-Build/2533//console
[exec]
[exec] This message is automatically generated.
[exec]
[exec]
[exec] ======================================================================
[exec] ======================================================================
[exec] Adding comment to Jira.
[exec] ======================================================================
[exec] ======================================================================
[exec]
[exec]
[exec] Comment added.
[exec] c62bfe0e10084fa603825e0694f63bbdb3489510 logged out
[exec]
[exec]
[exec] ======================================================================
[exec] ======================================================================
[exec] Finished build.
[exec] ======================================================================
[exec] ======================================================================
[exec]
[exec]
BUILD FAILED
/home/jenkins/jenkins-slave/workspace/PreCommit-ZOOKEEPER-Build/trunk/build.xml:1714: exec returned: 1
Total time: 42 seconds
Build step 'Execute shell' marked build as failure
Archiving artifacts
Sending artifact delta relative to PreCommit-ZOOKEEPER-Build #2489
Archived 1 artifacts
Archive block size is 32768
Received 0 blocks and 60692 bytes
Compression is 0.0%
Took 0.76 sec
Recording test results
Description set: ZOOKEEPER-1846
Email was triggered for: Failure
Sending email for trigger: Failure
###################################################################################
############################## FAILED TESTS (if any) ##############################
No tests ran.