You are viewing a plain text version of this content. The canonical link for it is here.
Posted to commits@hc.apache.org by Apache Jenkins Server <je...@builds.apache.org> on 2026/07/21 12:29:04 UTC

Build failed in Jenkins: HttpComponents » HttpComponents Client 5.7.x Java11 #202

See <https://ci-builds.apache.org/job/HttpComponents/job/HttpComponents%20Client%205.7.x%20Java11/202/display/redirect?page=changes>

Changes:

[Arturo Bernal] Do not store a response when the request specifies Cache-Control: no-store

[Arturo Bernal] reject negative 64-bit payload length in WebSocketFrameReader

[github] HTTP cache support for the QUERY method (RFC 10008) (#852)


------------------------------------------
[...truncated 57.52 KiB...]
[INFO] 
[INFO] --- compiler:3.10.1:compile (default-compile) @ httpclient5-sse ---
[INFO] Changes detected - recompiling the module!
[INFO] Compiling 18 source files to <https://ci-builds.apache.org/job/HttpComponents/job/HttpComponents%20Client%205.7.x%20Java11/ws/httpclient5-sse/target/classes>
[WARNING] [options] bootstrap class path not set in conjunction with -source 8
[INFO] 
[INFO] --- resources:3.2.0:testResources (default-testResources) @ httpclient5-sse ---
[INFO] Using 'UTF-8' encoding to copy filtered resources.
[INFO] Using 'UTF-8' encoding to copy filtered properties files.
[INFO] Copying 2 resources
[INFO] Copying 3 resources
[INFO] 
[INFO] --- compiler:3.10.1:testCompile (default-testCompile) @ httpclient5-sse ---
[INFO] Changes detected - recompiling the module!
[INFO] Compiling 16 source files to <https://ci-builds.apache.org/job/HttpComponents/job/HttpComponents%20Client%205.7.x%20Java11/ws/httpclient5-sse/target/test-classes>
[WARNING] [options] bootstrap class path not set in conjunction with -source 8
[INFO] 
[INFO] --- animal-sniffer:1.24:check (checkAPIcompatibility) @ httpclient5-sse ---
[INFO] Checking unresolved references to org.codehaus.mojo.signature:java18:1.0
[INFO] 
[INFO] --- surefire:3.5.0:test (default-test) @ httpclient5-sse ---
[INFO] Using auto detected provider org.apache.maven.surefire.junitplatform.JUnitPlatformProvider
[INFO] 
[INFO] -------------------------------------------------------
[INFO]  T E S T S
[INFO] -------------------------------------------------------
[INFO] Running org.apache.hc.client5.http.sse.ServerSentEventReaderTest
[INFO] Tests run: 3, Failures: 0, Errors: 0, Skipped: 0, Time elapsed: 0.068 s -- in org.apache.hc.client5.http.sse.ServerSentEventReaderTest
[INFO] Running org.apache.hc.client5.http.sse.NoBackoffStrategyTest
[INFO] Tests run: 1, Failures: 0, Errors: 0, Skipped: 0, Time elapsed: 0.005 s -- in org.apache.hc.client5.http.sse.NoBackoffStrategyTest
[INFO] Running org.apache.hc.client5.http.sse.SseResponseConsumerTest
[INFO] Tests run: 2, Failures: 0, Errors: 0, Skipped: 0, Time elapsed: 0.013 s -- in org.apache.hc.client5.http.sse.SseResponseConsumerTest
[INFO] Running org.apache.hc.client5.http.sse.ExponentialJitterBackoffTest
[INFO] Tests run: 6, Failures: 0, Errors: 0, Skipped: 0, Time elapsed: 0.038 s -- in org.apache.hc.client5.http.sse.ExponentialJitterBackoffTest
[INFO] Running org.apache.hc.client5.http.sse.impl.DefaultEventSourceTest
[INFO] Tests run: 2, Failures: 0, Errors: 0, Skipped: 0, Time elapsed: 0.566 s -- in org.apache.hc.client5.http.sse.impl.DefaultEventSourceTest
[INFO] Running org.apache.hc.client5.http.sse.ByteSseEntityConsumerTest
[INFO] Tests run: 2, Failures: 0, Errors: 0, Skipped: 0, Time elapsed: 0.012 s -- in org.apache.hc.client5.http.sse.ByteSseEntityConsumerTest
[INFO] Running org.apache.hc.client5.http.sse.SseExecutorBuilderTest
[INFO] Tests run: 1, Failures: 0, Errors: 0, Skipped: 0, Time elapsed: 0.008 s -- in org.apache.hc.client5.http.sse.SseExecutorBuilderTest
[INFO] Running org.apache.hc.client5.http.sse.SseEntityConsumerTest
[INFO] Tests run: 2, Failures: 0, Errors: 0, Skipped: 0, Time elapsed: 0.006 s -- in org.apache.hc.client5.http.sse.SseEntityConsumerTest
[INFO] Running org.apache.hc.client5.http.sse.DefaultEventSourceIntegrationTest
[INFO] Tests run: 1, Failures: 0, Errors: 0, Skipped: 0, Time elapsed: 0.009 s -- in org.apache.hc.client5.http.sse.DefaultEventSourceIntegrationTest
[INFO] 
[INFO] Results:
[INFO] 
[INFO] Tests run: 20, Failures: 0, Errors: 0, Skipped: 0
[INFO] 
[JENKINS] Recording test results
[INFO] 
[INFO] --- jar:3.2.2:jar (default-jar) @ httpclient5-sse ---
[INFO] Building jar: <https://ci-builds.apache.org/job/HttpComponents/job/HttpComponents%20Client%205.7.x%20Java11/ws/httpclient5-sse/target/httpclient5-sse-5.7-alpha1-SNAPSHOT.jar>
[INFO] 
[INFO] --- site:3.12.1:attach-descriptor (attach-descriptor) @ httpclient5-sse ---
[INFO] Skipping because packaging 'jar' is not pom.
[INFO] 
[INFO] --- japicmp:0.26.1:cmp (default) @ httpclient5-sse ---
[INFO] japicmp skipped.
[INFO] 
[INFO] --- checkstyle:3.3.1:checkstyle (validate) @ httpclient5-sse ---
[INFO] Rendering content with org.apache.maven.skins:maven-default-skin:jar:1.3 skin.
[INFO] Starting audit...
Audit done.
[INFO] 
[INFO] --- checkstyle:3.3.1:checkstyle (validate-main) @ httpclient5-sse ---
[INFO] Rendering content with org.apache.maven.skins:maven-default-skin:jar:1.3 skin.
[INFO] Starting audit...
Audit done.
[INFO] 
[INFO] --- checkstyle:3.3.1:checkstyle (validate-test) @ httpclient5-sse ---
[INFO] Rendering content with org.apache.maven.skins:maven-default-skin:jar:1.3 skin.
[INFO] Starting audit...
Audit done.
[INFO] 
[INFO] --- enforcer:3.6.3:enforce (enforce-maven-version) @ httpclient5-sse ---
[INFO] 
[INFO] --- enforcer:3.6.3:enforce (enforce-java-version) @ httpclient5-sse ---
[INFO] 
[INFO] --- enforcer:3.6.3:enforce (enforce-java-runtime) @ httpclient5-sse ---
[INFO] 
[INFO] --- build-helper:3.2.0:parse-version (parse-version) @ httpclient5-sse ---
[INFO] 
[INFO] --- remote-resources:1.7.0:process (process-resource-bundles) @ httpclient5-sse ---
[INFO] Preparing remote bundle org.apache:apache-jar-resource-bundle:1.4
[INFO] Copying 3 resources from 1 bundle.
[INFO] 
[INFO] --- resources:3.2.0:resources (default-resources) @ httpclient5-sse ---
[INFO] Using 'UTF-8' encoding to copy filtered resources.
[INFO] Using 'UTF-8' encoding to copy filtered properties files.
[INFO] skip non existing resourceDirectory <https://ci-builds.apache.org/job/HttpComponents/job/HttpComponents%20Client%205.7.x%20Java11/ws/httpclient5-sse/src/main/resources>
[INFO] Copying 3 resources
[INFO] Copying 3 resources
[INFO] 
[INFO] --- compiler:3.10.1:compile (default-compile) @ httpclient5-sse ---
[INFO] Changes detected - recompiling the module!
[INFO] Compiling 18 source files to <https://ci-builds.apache.org/job/HttpComponents/job/HttpComponents%20Client%205.7.x%20Java11/ws/httpclient5-sse/target/classes>
[WARNING] [options] bootstrap class path not set in conjunction with -source 8
[INFO] 
[INFO] --- resources:3.2.0:testResources (default-testResources) @ httpclient5-sse ---
[INFO] Using 'UTF-8' encoding to copy filtered resources.
[INFO] Using 'UTF-8' encoding to copy filtered properties files.
[INFO] Copying 2 resources
[INFO] Copying 3 resources
[INFO] Copying 3 resources
[INFO] 
[INFO] --- compiler:3.10.1:testCompile (default-testCompile) @ httpclient5-sse ---
[INFO] Changes detected - recompiling the module!
[INFO] Compiling 16 source files to <https://ci-builds.apache.org/job/HttpComponents/job/HttpComponents%20Client%205.7.x%20Java11/ws/httpclient5-sse/target/test-classes>
[WARNING] [options] bootstrap class path not set in conjunction with -source 8
[INFO] 
[INFO] --- animal-sniffer:1.24:check (checkAPIcompatibility) @ httpclient5-sse ---
[INFO] Checking unresolved references to org.codehaus.mojo.signature:java18:1.0
[INFO] 
[INFO] --- surefire:3.5.0:test (default-test) @ httpclient5-sse ---
[INFO] Skipping execution of surefire because it has already been run for this configuration
[JENKINS] Recording test results
[INFO] 
[INFO] --- jar:3.2.2:jar (default-jar) @ httpclient5-sse ---
[INFO] Building jar: <https://ci-builds.apache.org/job/HttpComponents/job/HttpComponents%20Client%205.7.x%20Java11/ws/httpclient5-sse/target/httpclient5-sse-5.7-alpha1-SNAPSHOT.jar>
[INFO] 
[INFO] --- site:3.12.1:attach-descriptor (attach-descriptor) @ httpclient5-sse ---
[INFO] Skipping because packaging 'jar' is not pom.
[INFO] 
[INFO] --- japicmp:0.26.1:cmp (default) @ httpclient5-sse ---
[INFO] japicmp skipped.
[INFO] 
[INFO] --- install:2.5.2:install (default-install) @ httpclient5-sse ---
[INFO] Installing <https://ci-builds.apache.org/job/HttpComponents/job/HttpComponents%20Client%205.7.x%20Java11/ws/httpclient5-sse/target/httpclient5-sse-5.7-alpha1-SNAPSHOT.jar> to /home/jenkins/.m2/repository/org/apache/httpcomponents/client5/httpclient5-sse/5.7-alpha1-SNAPSHOT/httpclient5-sse-5.7-alpha1-SNAPSHOT.jar
[INFO] Installing <https://ci-builds.apache.org/job/HttpComponents/job/HttpComponents%20Client%205.7.x%20Java11/ws/httpclient5-sse/pom.xml> to /home/jenkins/.m2/repository/org/apache/httpcomponents/client5/httpclient5-sse/5.7-alpha1-SNAPSHOT/httpclient5-sse-5.7-alpha1-SNAPSHOT.pom
[INFO] 
[INFO] --------< org.apache.httpcomponents.client5:httpclient5-cache >---------
[INFO] Building Apache HttpClient Cache 5.7-alpha1-SNAPSHOT               [4/9]
[INFO]   from httpclient5-cache/pom.xml
[INFO] --------------------------------[ jar ]---------------------------------
[INFO] 
[INFO] --- clean:3.2.0:clean (default-clean) @ httpclient5-cache ---
[INFO] Deleting <https://ci-builds.apache.org/job/HttpComponents/job/HttpComponents%20Client%205.7.x%20Java11/ws/httpclient5-cache/target>
[INFO] 
[INFO] --- checkstyle:3.3.1:checkstyle (validate) @ httpclient5-cache ---
[INFO] Rendering content with org.apache.maven.skins:maven-default-skin:jar:1.3 skin.
[INFO] Starting audit...
Audit done.
[INFO] 
[INFO] --- checkstyle:3.3.1:checkstyle (validate-main) @ httpclient5-cache ---
[INFO] Rendering content with org.apache.maven.skins:maven-default-skin:jar:1.3 skin.
[INFO] Starting audit...
Audit done.
[INFO] 
[INFO] --- checkstyle:3.3.1:checkstyle (validate-test) @ httpclient5-cache ---
[INFO] Rendering content with org.apache.maven.skins:maven-default-skin:jar:1.3 skin.
[INFO] Starting audit...
Audit done.
[INFO] 
[INFO] --- enforcer:3.6.3:enforce (enforce-maven-version) @ httpclient5-cache ---
[INFO] 
[INFO] --- enforcer:3.6.3:enforce (enforce-java-version) @ httpclient5-cache ---
[INFO] 
[INFO] --- enforcer:3.6.3:enforce (enforce-java-runtime) @ httpclient5-cache ---
[INFO] 
[INFO] --- build-helper:3.2.0:parse-version (parse-version) @ httpclient5-cache ---
[INFO] 
[INFO] --- remote-resources:1.7.0:process (process-resource-bundles) @ httpclient5-cache ---
[INFO] Preparing remote bundle org.apache:apache-jar-resource-bundle:1.4
[INFO] Copying 3 resources from 1 bundle.
[INFO] 
[INFO] --- resources:3.2.0:resources (default-resources) @ httpclient5-cache ---
[INFO] Using 'UTF-8' encoding to copy filtered resources.
[INFO] Using 'UTF-8' encoding to copy filtered properties files.
[INFO] skip non existing resourceDirectory <https://ci-builds.apache.org/job/HttpComponents/job/HttpComponents%20Client%205.7.x%20Java11/ws/httpclient5-cache/src/main/resources>
[INFO] Copying 3 resources
[INFO] 
[INFO] --- compiler:3.10.1:compile (default-compile) @ httpclient5-cache ---
[INFO] Changes detected - recompiling the module!
[INFO] Compiling 92 source files to <https://ci-builds.apache.org/job/HttpComponents/job/HttpComponents%20Client%205.7.x%20Java11/ws/httpclient5-cache/target/classes>
[WARNING] [options] bootstrap class path not set in conjunction with -source 8
[INFO] 
[INFO] --- resources:3.2.0:testResources (default-testResources) @ httpclient5-cache ---
[INFO] Using 'UTF-8' encoding to copy filtered resources.
[INFO] Using 'UTF-8' encoding to copy filtered properties files.
[INFO] Copying 2 resources
[INFO] Copying 3 resources
[INFO] 
[INFO] --- compiler:3.10.1:testCompile (default-testCompile) @ httpclient5-cache ---
[INFO] Changes detected - recompiling the module!
[INFO] Compiling 52 source files to <https://ci-builds.apache.org/job/HttpComponents/job/HttpComponents%20Client%205.7.x%20Java11/ws/httpclient5-cache/target/test-classes>
[INFO] -------------------------------------------------------------
[WARNING] COMPILATION WARNING : 
[INFO] -------------------------------------------------------------
[WARNING] [options] bootstrap class path not set in conjunction with -source 8
[INFO] 1 warning
[INFO] -------------------------------------------------------------
[INFO] -------------------------------------------------------------
[ERROR] COMPILATION ERROR : 
[INFO] -------------------------------------------------------------
[ERROR] <https://ci-builds.apache.org/job/HttpComponents/job/HttpComponents%20Client%205.7.x%20Java11/ws/httpclient5-cache/src/test/java/org/apache/hc/client5/http/impl/cache/TestResponseCachingPolicy.java>:[100,36] error: method isResponseCacheable in class ResponseCachingPolicy cannot be applied to given types;
  required: RequestCacheControl,ResponseCacheControl,HttpRequest,HttpResponse
  found: ResponseCacheControl,HttpRequest,HttpResponse
  reason: actual and formal argument lists differ in length
[INFO] 1 error
[INFO] -------------------------------------------------------------
[INFO] ------------------------------------------------------------------------
[INFO] Reactor Summary for Apache HttpComponents Client 5.7-alpha1-SNAPSHOT:
[INFO] 
[INFO] Apache HttpComponents Client ....................... SUCCESS [ 40.111 s]
[INFO] Apache HttpClient .................................. SUCCESS [01:47 min]
[INFO] Apache HttpClient sse .............................. SUCCESS [ 38.097 s]
[INFO] Apache HttpClient Cache ............................ FAILURE [ 21.170 s]
[INFO] Apache HttpClient Observation ...................... SKIPPED
[INFO] Apache HttpClient Fluent ........................... SKIPPED
[INFO] Apache HttpClient WebSocket ........................ SKIPPED
[INFO] Jakarta REST Client for Apache HttpClient .......... SKIPPED
[INFO] Apache HttpClient Integration Tests ................ SKIPPED
[INFO] ------------------------------------------------------------------------
[INFO] BUILD FAILURE
[INFO] ------------------------------------------------------------------------
[INFO] Total time:  03:52 min
[INFO] Finished at: 2026-07-21T12:28:45Z
[INFO] ------------------------------------------------------------------------
Waiting for Jenkins to finish collecting data
[ERROR] Failed to execute goal org.apache.maven.plugins:maven-compiler-plugin:3.10.1:testCompile (default-testCompile) on project httpclient5-cache: Compilation failure
[ERROR] <https://ci-builds.apache.org/job/HttpComponents/job/HttpComponents%20Client%205.7.x%20Java11/ws/httpclient5-cache/src/test/java/org/apache/hc/client5/http/impl/cache/TestResponseCachingPolicy.java>:[100,36] error: method isResponseCacheable in class ResponseCachingPolicy cannot be applied to given types;
[ERROR] required: RequestCacheControl,ResponseCacheControl,HttpRequest,HttpResponse
[ERROR] found: ResponseCacheControl,HttpRequest,HttpResponse
[ERROR] reason: actual and formal argument lists differ in length
[ERROR] -> [Help 1]
[ERROR] 
[ERROR] To see the full stack trace of the errors, re-run Maven with the -e switch.
[ERROR] Re-run Maven using the -X switch to enable full debug logging.
[ERROR] 
[ERROR] For more information about the errors and possible solutions, please read the following articles:
[ERROR] [Help 1] http://cwiki.apache.org/confluence/display/MAVEN/MojoFailureException
[ERROR] 
[ERROR] After correcting the problems, you can resume the build with the command
[ERROR]   mvn <goals> -rf :httpclient5-cache
[JENKINS] Archiving <https://ci-builds.apache.org/job/HttpComponents/job/HttpComponents%20Client%205.7.x%20Java11/ws/httpclient5-cache/pom.xml> to org.apache.httpcomponents.client5/httpclient5-cache/5.7-alpha1-SNAPSHOT/httpclient5-cache-5.7-alpha1-SNAPSHOT.pom
[JENKINS] Archiving <https://ci-builds.apache.org/job/HttpComponents/job/HttpComponents%20Client%205.7.x%20Java11/ws/httpclient5-jakarta-rest-client/pom.xml> to org.apache.httpcomponents.client5/httpclient5-jakarta-rest-client/5.7-alpha1-SNAPSHOT/httpclient5-jakarta-rest-client-5.7-alpha1-SNAPSHOT.pom
[JENKINS] Archiving <https://ci-builds.apache.org/job/HttpComponents/job/HttpComponents%20Client%205.7.x%20Java11/ws/httpclient5/pom.xml> to org.apache.httpcomponents.client5/httpclient5/5.7-alpha1-SNAPSHOT/httpclient5-5.7-alpha1-SNAPSHOT.pom
[JENKINS] Archiving <https://ci-builds.apache.org/job/HttpComponents/job/HttpComponents%20Client%205.7.x%20Java11/ws/httpclient5/target/httpclient5-5.7-alpha1-SNAPSHOT.jar> to org.apache.httpcomponents.client5/httpclient5/5.7-alpha1-SNAPSHOT/httpclient5-5.7-alpha1-SNAPSHOT.jar
[JENKINS] Archiving <https://ci-builds.apache.org/job/HttpComponents/job/HttpComponents%20Client%205.7.x%20Java11/ws/httpclient5/target/httpclient5-5.7-alpha1-SNAPSHOT-tests.jar> to org.apache.httpcomponents.client5/httpclient5/5.7-alpha1-SNAPSHOT/httpclient5-5.7-alpha1-SNAPSHOT-tests.jar
[JENKINS] Archiving <https://ci-builds.apache.org/job/HttpComponents/job/HttpComponents%20Client%205.7.x%20Java11/ws/httpclient5-fluent/pom.xml> to org.apache.httpcomponents.client5/httpclient5-fluent/5.7-alpha1-SNAPSHOT/httpclient5-fluent-5.7-alpha1-SNAPSHOT.pom
[JENKINS] Archiving <https://ci-builds.apache.org/job/HttpComponents/job/HttpComponents%20Client%205.7.x%20Java11/ws/httpclient5-sse/pom.xml> to org.apache.httpcomponents.client5/httpclient5-sse/5.7-alpha1-SNAPSHOT/httpclient5-sse-5.7-alpha1-SNAPSHOT.pom
[JENKINS] Archiving <https://ci-builds.apache.org/job/HttpComponents/job/HttpComponents%20Client%205.7.x%20Java11/ws/httpclient5-sse/target/httpclient5-sse-5.7-alpha1-SNAPSHOT.jar> to org.apache.httpcomponents.client5/httpclient5-sse/5.7-alpha1-SNAPSHOT/httpclient5-sse-5.7-alpha1-SNAPSHOT.jar
[JENKINS] Archiving <https://ci-builds.apache.org/job/HttpComponents/job/HttpComponents%20Client%205.7.x%20Java11/ws/httpclient5-testing/pom.xml> to org.apache.httpcomponents.client5/httpclient5-testing/5.7-alpha1-SNAPSHOT/httpclient5-testing-5.7-alpha1-SNAPSHOT.pom
[JENKINS] Archiving <https://ci-builds.apache.org/job/HttpComponents/job/HttpComponents%20Client%205.7.x%20Java11/ws/httpclient5-websocket/pom.xml> to org.apache.httpcomponents.client5/httpclient5-websocket/5.7-alpha1-SNAPSHOT/httpclient5-websocket-5.7-alpha1-SNAPSHOT.pom
[JENKINS] Archiving <https://ci-builds.apache.org/job/HttpComponents/job/HttpComponents%20Client%205.7.x%20Java11/ws/pom.xml> to org.apache.httpcomponents.client5/httpclient5-parent/5.7-alpha1-SNAPSHOT/httpclient5-parent-5.7-alpha1-SNAPSHOT.pom
[JENKINS] Archiving <https://ci-builds.apache.org/job/HttpComponents/job/HttpComponents%20Client%205.7.x%20Java11/ws/target/httpclient5-parent-5.7-alpha1-SNAPSHOT-site.xml> to org.apache.httpcomponents.client5/httpclient5-parent/5.7-alpha1-SNAPSHOT/httpclient5-parent-5.7-alpha1-SNAPSHOT-site.xml
[JENKINS] Archiving <https://ci-builds.apache.org/job/HttpComponents/job/HttpComponents%20Client%205.7.x%20Java11/ws/httpclient5-observation/pom.xml> to org.apache.httpcomponents.client5/httpclient5-observation/5.7-alpha1-SNAPSHOT/httpclient5-observation-5.7-alpha1-SNAPSHOT.pom
channel stopped

Jenkins build is back to normal : HttpComponents » HttpComponents Client 5.7.x Java11 #203

Posted by Apache Jenkins Server <je...@builds.apache.org>.
See <https://ci-builds.apache.org/job/HttpComponents/job/HttpComponents%20Client%205.7.x%20Java11/203/display/redirect?page=changes>