You are viewing a plain text version of this content. The canonical link for it is here.
Posted to builds@solr.apache.org by Apache Jenkins Server <je...@builds.apache.org> on 2025/10/30 19:43:59 UTC
[JENKINS] Solr » Solr-Lint-main - Build # 354 - Still Failing!
Build: https://ci-builds.apache.org/job/Solr/job/Solr-Lint-main/354/
No tests ran.
Build Log:
[...truncated 1149 lines...]
BUILD FAILED in 9m 47s
618 actionable tasks: 618 executed
Publishing build scan...
https://develocity.apache.org/s/77yikexxabqos
Build step 'Invoke Gradle script' changed build result to FAILURE
Build step 'Invoke Gradle script' marked build as failure
Email was triggered for: Failure - Any
Sending email for trigger: Failure - Any
Re: [JENKINS] Solr » Solr-Lint-main - Build # 356 - Still Failing!
Posted by Ishan Chattopadhyaya <ic...@gmail.com>.
Ok, this is related to https://github.com/apache/solr/pull/3825
I'm looking into it.
On Sun, 2 Nov, 2025, 12:48 am Apache Jenkins Server, <
jenkins@builds.apache.org> wrote:
> Build: https://ci-builds.apache.org/job/Solr/job/Solr-Lint-main/356/
>
> No tests ran.
>
> Build Log:
> [...truncated 1148 lines...]
> BUILD FAILED in 10m 12s
> 618 actionable tasks: 618 executed
>
> Publishing build scan...
> https://develocity.apache.org/s/bfsymewofusji
>
> Build step 'Invoke Gradle script' changed build result to FAILURE
> Build step 'Invoke Gradle script' marked build as failure
> Email was triggered for: Failure - Any
> Sending email for trigger: Failure - Any
>
> ---------------------------------------------------------------------
> To unsubscribe, e-mail: builds-unsubscribe@solr.apache.org
> For additional commands, e-mail: builds-help@solr.apache.org
Re: [JENKINS] Solr » Solr-Lint-main - Build # 356 - Still Failing!
Posted by Ishan Chattopadhyaya <ic...@gmail.com>.
Ok, this is related to https://github.com/apache/solr/pull/3825
I'm looking into it.
On Sun, 2 Nov, 2025, 12:48 am Apache Jenkins Server, <
jenkins@builds.apache.org> wrote:
> Build: https://ci-builds.apache.org/job/Solr/job/Solr-Lint-main/356/
>
> No tests ran.
>
> Build Log:
> [...truncated 1148 lines...]
> BUILD FAILED in 10m 12s
> 618 actionable tasks: 618 executed
>
> Publishing build scan...
> https://develocity.apache.org/s/bfsymewofusji
>
> Build step 'Invoke Gradle script' changed build result to FAILURE
> Build step 'Invoke Gradle script' marked build as failure
> Email was triggered for: Failure - Any
> Sending email for trigger: Failure - Any
>
> ---------------------------------------------------------------------
> To unsubscribe, e-mail: builds-unsubscribe@solr.apache.org
> For additional commands, e-mail: builds-help@solr.apache.org
[JENKINS] Solr » Solr-Lint-main - Build # 356 - Still Failing!
Posted by Apache Jenkins Server <je...@builds.apache.org>.
Build: https://ci-builds.apache.org/job/Solr/job/Solr-Lint-main/356/
No tests ran.
Build Log:
[...truncated 1148 lines...]
BUILD FAILED in 10m 12s
618 actionable tasks: 618 executed
Publishing build scan...
https://develocity.apache.org/s/bfsymewofusji
Build step 'Invoke Gradle script' changed build result to FAILURE
Build step 'Invoke Gradle script' marked build as failure
Email was triggered for: Failure - Any
Sending email for trigger: Failure - Any
[JENKINS] Solr » Solr-Lint-main - Build # 355 - Still Failing!
Posted by Apache Jenkins Server <je...@builds.apache.org>.
Build: https://ci-builds.apache.org/job/Solr/job/Solr-Lint-main/355/
No tests ran.
Build Log:
[...truncated 1149 lines...]
BUILD FAILED in 10m 16s
618 actionable tasks: 618 executed
Publishing build scan...
https://develocity.apache.org/s/agvdq76hp6dfe
Build step 'Invoke Gradle script' changed build result to FAILURE
Build step 'Invoke Gradle script' marked build as failure
Email was triggered for: Failure - Any
Sending email for trigger: Failure - Any