You are viewing a plain text version of this content. The canonical link for it is here.
Posted to builds@lucene.apache.org by Apache Jenkins Server <je...@builds.apache.org> on 2026/01/27 04:23:10 UTC

[JENKINS] Lucene » Lucene-NightlyTests-main - Build # 1902 - Still Unstable!

Build: https://ci-builds.apache.org/job/Lucene/job/Lucene-NightlyTests-main/1902/

10 tests failed.
FAILED:  org.apache.lucene.backward_codecs.lucene50.TestLucene50StoredFieldsFormat.testMergeStability

Error Message:
java.lang.AssertionError: expected:<{fnm=77, fdt=79978, fdx=103, fdm=158}> but was:<{cfs=80378, cfe=150}>

Stack Trace:
java.lang.AssertionError: expected:<{fnm=77, fdt=79978, fdx=103, fdm=158}> but was:<{cfs=80378, cfe=150}>
	at __randomizedtesting.SeedInfo.seed([9268D9678FC9F149:E6249F488223F3FF]:0)
	at junit@4.13.2/org.junit.Assert.fail(Assert.java:89)
	at junit@4.13.2/org.junit.Assert.failNotEquals(Assert.java:835)
	at junit@4.13.2/org.junit.Assert.assertEquals(Assert.java:120)
	at junit@4.13.2/org.junit.Assert.assertEquals(Assert.java:146)
	at org.apache.lucene.test_framework@11.0.0-SNAPSHOT/org.apache.lucene.tests.index.BaseIndexFileFormatTestCase.testMergeStability(BaseIndexFileFormatTestCase.java:306)
	at java.base/jdk.internal.reflect.DirectMethodHandleAccessor.invoke(DirectMethodHandleAccessor.java:104)
	at java.base/java.lang.reflect.Method.invoke(Method.java:565)
	at randomizedtesting.runner@2.8.3/com.carrotsearch.randomizedtesting.RandomizedRunner.invoke(RandomizedRunner.java:1763)
	at randomizedtesting.runner@2.8.3/com.carrotsearch.randomizedtesting.RandomizedRunner$8.evaluate(RandomizedRunner.java:946)
	at randomizedtesting.runner@2.8.3/com.carrotsearch.randomizedtesting.RandomizedRunner$9.evaluate(RandomizedRunner.java:982)
	at randomizedtesting.runner@2.8.3/com.carrotsearch.randomizedtesting.RandomizedRunner$10.evaluate(RandomizedRunner.java:996)
	at org.apache.lucene.test_framework@11.0.0-SNAPSHOT/org.apache.lucene.tests.util.TestRuleSetupTeardownChained$1.evaluate(TestRuleSetupTeardownChained.java:48)
	at org.apache.lucene.test_framework@11.0.0-SNAPSHOT/org.apache.lucene.tests.util.AbstractBeforeAfterRule$1.evaluate(AbstractBeforeAfterRule.java:43)
	at org.apache.lucene.test_framework@11.0.0-SNAPSHOT/org.apache.lucene.tests.util.TestRuleThreadAndTestName$1.evaluate(TestRuleThreadAndTestName.java:45)
	at org.apache.lucene.test_framework@11.0.0-SNAPSHOT/org.apache.lucene.tests.util.TestRuleIgnoreAfterMaxFailures$1.evaluate(TestRuleIgnoreAfterMaxFailures.java:60)
	at org.apache.lucene.test_framework@11.0.0-SNAPSHOT/org.apache.lucene.tests.util.TestRuleMarkFailure$1.evaluate(TestRuleMarkFailure.java:44)
	at junit@4.13.2/org.junit.rules.RunRules.evaluate(RunRules.java:20)
	at randomizedtesting.runner@2.8.3/com.carrotsearch.randomizedtesting.rules.StatementAdapter.evaluate(StatementAdapter.java:36)
	at randomizedtesting.runner@2.8.3/com.carrotsearch.randomizedtesting.ThreadLeakControl$StatementRunner.run(ThreadLeakControl.java:390)
	at randomizedtesting.runner@2.8.3/com.carrotsearch.randomizedtesting.ThreadLeakControl.forkTimeoutingTask(ThreadLeakControl.java:843)
	at randomizedtesting.runner@2.8.3/com.carrotsearch.randomizedtesting.ThreadLeakControl$3.evaluate(ThreadLeakControl.java:490)
	at randomizedtesting.runner@2.8.3/com.carrotsearch.randomizedtesting.RandomizedRunner.runSingleTest(RandomizedRunner.java:955)
	at randomizedtesting.runner@2.8.3/com.carrotsearch.randomizedtesting.RandomizedRunner$5.evaluate(RandomizedRunner.java:840)
	at randomizedtesting.runner@2.8.3/com.carrotsearch.randomizedtesting.RandomizedRunner$6.evaluate(RandomizedRunner.java:891)
	at randomizedtesting.runner@2.8.3/com.carrotsearch.randomizedtesting.RandomizedRunner$7.evaluate(RandomizedRunner.java:902)
	at org.apache.lucene.test_framework@11.0.0-SNAPSHOT/org.apache.lucene.tests.util.AbstractBeforeAfterRule$1.evaluate(AbstractBeforeAfterRule.java:43)
	at randomizedtesting.runner@2.8.3/com.carrotsearch.randomizedtesting.rules.StatementAdapter.evaluate(StatementAdapter.java:36)
	at org.apache.lucene.test_framework@11.0.0-SNAPSHOT/org.apache.lucene.tests.util.TestRuleStoreClassName$1.evaluate(TestRuleStoreClassName.java:38)
	at randomizedtesting.runner@2.8.3/com.carrotsearch.randomizedtesting.rules.NoShadowingOrOverridesOnMethodsRule$1.evaluate(NoShadowingOrOverridesOnMethodsRule.java:40)
	at randomizedtesting.runner@2.8.3/com.carrotsearch.randomizedtesting.rules.NoShadowingOrOverridesOnMethodsRule$1.evaluate(NoShadowingOrOverridesOnMethodsRule.java:40)
	at randomizedtesting.runner@2.8.3/com.carrotsearch.randomizedtesting.rules.StatementAdapter.evaluate(StatementAdapter.java:36)
	at randomizedtesting.runner@2.8.3/com.carrotsearch.randomizedtesting.rules.StatementAdapter.evaluate(StatementAdapter.java:36)
	at org.apache.lucene.test_framework@11.0.0-SNAPSHOT/org.apache.lucene.tests.util.TestRuleAssertionsRequired$1.evaluate(TestRuleAssertionsRequired.java:52)
	at org.apache.lucene.test_framework@11.0.0-SNAPSHOT/org.apache.lucene.tests.util.AbstractBeforeAfterRule$1.evaluate(AbstractBeforeAfterRule.java:43)
	at org.apache.lucene.test_framework@11.0.0-SNAPSHOT/org.apache.lucene.tests.util.TestRuleMarkFailure$1.evaluate(TestRuleMarkFailure.java:44)
	at org.apache.lucene.test_framework@11.0.0-SNAPSHOT/org.apache.lucene.tests.util.TestRuleIgnoreAfterMaxFailures$1.evaluate(TestRuleIgnoreAfterMaxFailures.java:60)
	at org.apache.lucene.test_framework@11.0.0-SNAPSHOT/org.apache.lucene.tests.util.TestRuleIgnoreTestSuites$1.evaluate(TestRuleIgnoreTestSuites.java:47)
	at junit@4.13.2/org.junit.rules.RunRules.evaluate(RunRules.java:20)
	at randomizedtesting.runner@2.8.3/com.carrotsearch.randomizedtesting.rules.StatementAdapter.evaluate(StatementAdapter.java:36)
	at randomizedtesting.runner@2.8.3/com.carrotsearch.randomizedtesting.ThreadLeakControl$StatementRunner.run(ThreadLeakControl.java:390)
	at randomizedtesting.runner@2.8.3/com.carrotsearch.randomizedtesting.ThreadLeakControl.lambda$forkTimeoutingTask$0(ThreadLeakControl.java:850)
	at java.base/java.lang.Thread.run(Thread.java:1474)


FAILED:  org.apache.lucene.backward_codecs.lucene50.TestLucene50StoredFieldsFormatHighCompression.testMergeStability

Error Message:
java.lang.AssertionError: expected:<{fnm=77, fdt=52627, fdx=80, fdm=159}> but was:<{cfs=53005, cfe=150}>

Stack Trace:
java.lang.AssertionError: expected:<{fnm=77, fdt=52627, fdx=80, fdm=159}> but was:<{cfs=53005, cfe=150}>
	at __randomizedtesting.SeedInfo.seed([9268D9678FC9F149:E6249F488223F3FF]:0)
	at junit@4.13.2/org.junit.Assert.fail(Assert.java:89)
	at junit@4.13.2/org.junit.Assert.failNotEquals(Assert.java:835)
	at junit@4.13.2/org.junit.Assert.assertEquals(Assert.java:120)
	at junit@4.13.2/org.junit.Assert.assertEquals(Assert.java:146)
	at org.apache.lucene.test_framework@11.0.0-SNAPSHOT/org.apache.lucene.tests.index.BaseIndexFileFormatTestCase.testMergeStability(BaseIndexFileFormatTestCase.java:306)
	at java.base/jdk.internal.reflect.DirectMethodHandleAccessor.invoke(DirectMethodHandleAccessor.java:104)
	at java.base/java.lang.reflect.Method.invoke(Method.java:565)
	at randomizedtesting.runner@2.8.3/com.carrotsearch.randomizedtesting.RandomizedRunner.invoke(RandomizedRunner.java:1763)
	at randomizedtesting.runner@2.8.3/com.carrotsearch.randomizedtesting.RandomizedRunner$8.evaluate(RandomizedRunner.java:946)
	at randomizedtesting.runner@2.8.3/com.carrotsearch.randomizedtesting.RandomizedRunner$9.evaluate(RandomizedRunner.java:982)
	at randomizedtesting.runner@2.8.3/com.carrotsearch.randomizedtesting.RandomizedRunner$10.evaluate(RandomizedRunner.java:996)
	at org.apache.lucene.test_framework@11.0.0-SNAPSHOT/org.apache.lucene.tests.util.TestRuleSetupTeardownChained$1.evaluate(TestRuleSetupTeardownChained.java:48)
	at org.apache.lucene.test_framework@11.0.0-SNAPSHOT/org.apache.lucene.tests.util.AbstractBeforeAfterRule$1.evaluate(AbstractBeforeAfterRule.java:43)
	at org.apache.lucene.test_framework@11.0.0-SNAPSHOT/org.apache.lucene.tests.util.TestRuleThreadAndTestName$1.evaluate(TestRuleThreadAndTestName.java:45)
	at org.apache.lucene.test_framework@11.0.0-SNAPSHOT/org.apache.lucene.tests.util.TestRuleIgnoreAfterMaxFailures$1.evaluate(TestRuleIgnoreAfterMaxFailures.java:60)
	at org.apache.lucene.test_framework@11.0.0-SNAPSHOT/org.apache.lucene.tests.util.TestRuleMarkFailure$1.evaluate(TestRuleMarkFailure.java:44)
	at junit@4.13.2/org.junit.rules.RunRules.evaluate(RunRules.java:20)
	at randomizedtesting.runner@2.8.3/com.carrotsearch.randomizedtesting.rules.StatementAdapter.evaluate(StatementAdapter.java:36)
	at randomizedtesting.runner@2.8.3/com.carrotsearch.randomizedtesting.ThreadLeakControl$StatementRunner.run(ThreadLeakControl.java:390)
	at randomizedtesting.runner@2.8.3/com.carrotsearch.randomizedtesting.ThreadLeakControl.forkTimeoutingTask(ThreadLeakControl.java:843)
	at randomizedtesting.runner@2.8.3/com.carrotsearch.randomizedtesting.ThreadLeakControl$3.evaluate(ThreadLeakControl.java:490)
	at randomizedtesting.runner@2.8.3/com.carrotsearch.randomizedtesting.RandomizedRunner.runSingleTest(RandomizedRunner.java:955)
	at randomizedtesting.runner@2.8.3/com.carrotsearch.randomizedtesting.RandomizedRunner$5.evaluate(RandomizedRunner.java:840)
	at randomizedtesting.runner@2.8.3/com.carrotsearch.randomizedtesting.RandomizedRunner$6.evaluate(RandomizedRunner.java:891)
	at randomizedtesting.runner@2.8.3/com.carrotsearch.randomizedtesting.RandomizedRunner$7.evaluate(RandomizedRunner.java:902)
	at org.apache.lucene.test_framework@11.0.0-SNAPSHOT/org.apache.lucene.tests.util.AbstractBeforeAfterRule$1.evaluate(AbstractBeforeAfterRule.java:43)
	at randomizedtesting.runner@2.8.3/com.carrotsearch.randomizedtesting.rules.StatementAdapter.evaluate(StatementAdapter.java:36)
	at org.apache.lucene.test_framework@11.0.0-SNAPSHOT/org.apache.lucene.tests.util.TestRuleStoreClassName$1.evaluate(TestRuleStoreClassName.java:38)
	at randomizedtesting.runner@2.8.3/com.carrotsearch.randomizedtesting.rules.NoShadowingOrOverridesOnMethodsRule$1.evaluate(NoShadowingOrOverridesOnMethodsRule.java:40)
	at randomizedtesting.runner@2.8.3/com.carrotsearch.randomizedtesting.rules.NoShadowingOrOverridesOnMethodsRule$1.evaluate(NoShadowingOrOverridesOnMethodsRule.java:40)
	at randomizedtesting.runner@2.8.3/com.carrotsearch.randomizedtesting.rules.StatementAdapter.evaluate(StatementAdapter.java:36)
	at randomizedtesting.runner@2.8.3/com.carrotsearch.randomizedtesting.rules.StatementAdapter.evaluate(StatementAdapter.java:36)
	at org.apache.lucene.test_framework@11.0.0-SNAPSHOT/org.apache.lucene.tests.util.TestRuleAssertionsRequired$1.evaluate(TestRuleAssertionsRequired.java:52)
	at org.apache.lucene.test_framework@11.0.0-SNAPSHOT/org.apache.lucene.tests.util.AbstractBeforeAfterRule$1.evaluate(AbstractBeforeAfterRule.java:43)
	at org.apache.lucene.test_framework@11.0.0-SNAPSHOT/org.apache.lucene.tests.util.TestRuleMarkFailure$1.evaluate(TestRuleMarkFailure.java:44)
	at org.apache.lucene.test_framework@11.0.0-SNAPSHOT/org.apache.lucene.tests.util.TestRuleIgnoreAfterMaxFailures$1.evaluate(TestRuleIgnoreAfterMaxFailures.java:60)
	at org.apache.lucene.test_framework@11.0.0-SNAPSHOT/org.apache.lucene.tests.util.TestRuleIgnoreTestSuites$1.evaluate(TestRuleIgnoreTestSuites.java:47)
	at junit@4.13.2/org.junit.rules.RunRules.evaluate(RunRules.java:20)
	at randomizedtesting.runner@2.8.3/com.carrotsearch.randomizedtesting.rules.StatementAdapter.evaluate(StatementAdapter.java:36)
	at randomizedtesting.runner@2.8.3/com.carrotsearch.randomizedtesting.ThreadLeakControl$StatementRunner.run(ThreadLeakControl.java:390)
	at randomizedtesting.runner@2.8.3/com.carrotsearch.randomizedtesting.ThreadLeakControl.lambda$forkTimeoutingTask$0(ThreadLeakControl.java:850)
	at java.base/java.lang.Thread.run(Thread.java:1474)


FAILED:  org.apache.lucene.backward_codecs.lucene50.TestLucene50StoredFieldsFormatMergeInstance.testMergeStability

Error Message:
java.lang.AssertionError: expected:<{fnm=77, fdt=79978, fdx=103, fdm=158}> but was:<{cfs=80378, cfe=150}>

Stack Trace:
java.lang.AssertionError: expected:<{fnm=77, fdt=79978, fdx=103, fdm=158}> but was:<{cfs=80378, cfe=150}>
	at __randomizedtesting.SeedInfo.seed([9268D9678FC9F149:E6249F488223F3FF]:0)
	at junit@4.13.2/org.junit.Assert.fail(Assert.java:89)
	at junit@4.13.2/org.junit.Assert.failNotEquals(Assert.java:835)
	at junit@4.13.2/org.junit.Assert.assertEquals(Assert.java:120)
	at junit@4.13.2/org.junit.Assert.assertEquals(Assert.java:146)
	at org.apache.lucene.test_framework@11.0.0-SNAPSHOT/org.apache.lucene.tests.index.BaseIndexFileFormatTestCase.testMergeStability(BaseIndexFileFormatTestCase.java:306)
	at java.base/jdk.internal.reflect.DirectMethodHandleAccessor.invoke(DirectMethodHandleAccessor.java:104)
	at java.base/java.lang.reflect.Method.invoke(Method.java:565)
	at randomizedtesting.runner@2.8.3/com.carrotsearch.randomizedtesting.RandomizedRunner.invoke(RandomizedRunner.java:1763)
	at randomizedtesting.runner@2.8.3/com.carrotsearch.randomizedtesting.RandomizedRunner$8.evaluate(RandomizedRunner.java:946)
	at randomizedtesting.runner@2.8.3/com.carrotsearch.randomizedtesting.RandomizedRunner$9.evaluate(RandomizedRunner.java:982)
	at randomizedtesting.runner@2.8.3/com.carrotsearch.randomizedtesting.RandomizedRunner$10.evaluate(RandomizedRunner.java:996)
	at org.apache.lucene.test_framework@11.0.0-SNAPSHOT/org.apache.lucene.tests.util.TestRuleSetupTeardownChained$1.evaluate(TestRuleSetupTeardownChained.java:48)
	at org.apache.lucene.test_framework@11.0.0-SNAPSHOT/org.apache.lucene.tests.util.AbstractBeforeAfterRule$1.evaluate(AbstractBeforeAfterRule.java:43)
	at org.apache.lucene.test_framework@11.0.0-SNAPSHOT/org.apache.lucene.tests.util.TestRuleThreadAndTestName$1.evaluate(TestRuleThreadAndTestName.java:45)
	at org.apache.lucene.test_framework@11.0.0-SNAPSHOT/org.apache.lucene.tests.util.TestRuleIgnoreAfterMaxFailures$1.evaluate(TestRuleIgnoreAfterMaxFailures.java:60)
	at org.apache.lucene.test_framework@11.0.0-SNAPSHOT/org.apache.lucene.tests.util.TestRuleMarkFailure$1.evaluate(TestRuleMarkFailure.java:44)
	at junit@4.13.2/org.junit.rules.RunRules.evaluate(RunRules.java:20)
	at randomizedtesting.runner@2.8.3/com.carrotsearch.randomizedtesting.rules.StatementAdapter.evaluate(StatementAdapter.java:36)
	at randomizedtesting.runner@2.8.3/com.carrotsearch.randomizedtesting.ThreadLeakControl$StatementRunner.run(ThreadLeakControl.java:390)
	at randomizedtesting.runner@2.8.3/com.carrotsearch.randomizedtesting.ThreadLeakControl.forkTimeoutingTask(ThreadLeakControl.java:843)
	at randomizedtesting.runner@2.8.3/com.carrotsearch.randomizedtesting.ThreadLeakControl$3.evaluate(ThreadLeakControl.java:490)
	at randomizedtesting.runner@2.8.3/com.carrotsearch.randomizedtesting.RandomizedRunner.runSingleTest(RandomizedRunner.java:955)
	at randomizedtesting.runner@2.8.3/com.carrotsearch.randomizedtesting.RandomizedRunner$5.evaluate(RandomizedRunner.java:840)
	at randomizedtesting.runner@2.8.3/com.carrotsearch.randomizedtesting.RandomizedRunner$6.evaluate(RandomizedRunner.java:891)
	at randomizedtesting.runner@2.8.3/com.carrotsearch.randomizedtesting.RandomizedRunner$7.evaluate(RandomizedRunner.java:902)
	at org.apache.lucene.test_framework@11.0.0-SNAPSHOT/org.apache.lucene.tests.util.AbstractBeforeAfterRule$1.evaluate(AbstractBeforeAfterRule.java:43)
	at randomizedtesting.runner@2.8.3/com.carrotsearch.randomizedtesting.rules.StatementAdapter.evaluate(StatementAdapter.java:36)
	at org.apache.lucene.test_framework@11.0.0-SNAPSHOT/org.apache.lucene.tests.util.TestRuleStoreClassName$1.evaluate(TestRuleStoreClassName.java:38)
	at randomizedtesting.runner@2.8.3/com.carrotsearch.randomizedtesting.rules.NoShadowingOrOverridesOnMethodsRule$1.evaluate(NoShadowingOrOverridesOnMethodsRule.java:40)
	at randomizedtesting.runner@2.8.3/com.carrotsearch.randomizedtesting.rules.NoShadowingOrOverridesOnMethodsRule$1.evaluate(NoShadowingOrOverridesOnMethodsRule.java:40)
	at randomizedtesting.runner@2.8.3/com.carrotsearch.randomizedtesting.rules.StatementAdapter.evaluate(StatementAdapter.java:36)
	at randomizedtesting.runner@2.8.3/com.carrotsearch.randomizedtesting.rules.StatementAdapter.evaluate(StatementAdapter.java:36)
	at org.apache.lucene.test_framework@11.0.0-SNAPSHOT/org.apache.lucene.tests.util.TestRuleAssertionsRequired$1.evaluate(TestRuleAssertionsRequired.java:52)
	at org.apache.lucene.test_framework@11.0.0-SNAPSHOT/org.apache.lucene.tests.util.AbstractBeforeAfterRule$1.evaluate(AbstractBeforeAfterRule.java:43)
	at org.apache.lucene.test_framework@11.0.0-SNAPSHOT/org.apache.lucene.tests.util.TestRuleMarkFailure$1.evaluate(TestRuleMarkFailure.java:44)
	at org.apache.lucene.test_framework@11.0.0-SNAPSHOT/org.apache.lucene.tests.util.TestRuleIgnoreAfterMaxFailures$1.evaluate(TestRuleIgnoreAfterMaxFailures.java:60)
	at org.apache.lucene.test_framework@11.0.0-SNAPSHOT/org.apache.lucene.tests.util.TestRuleIgnoreTestSuites$1.evaluate(TestRuleIgnoreTestSuites.java:47)
	at junit@4.13.2/org.junit.rules.RunRules.evaluate(RunRules.java:20)
	at randomizedtesting.runner@2.8.3/com.carrotsearch.randomizedtesting.rules.StatementAdapter.evaluate(StatementAdapter.java:36)
	at randomizedtesting.runner@2.8.3/com.carrotsearch.randomizedtesting.ThreadLeakControl$StatementRunner.run(ThreadLeakControl.java:390)
	at randomizedtesting.runner@2.8.3/com.carrotsearch.randomizedtesting.ThreadLeakControl.lambda$forkTimeoutingTask$0(ThreadLeakControl.java:850)
	at java.base/java.lang.Thread.run(Thread.java:1474)


FAILED:  org.apache.lucene.backward_codecs.lucene50.TestLucene50TermVectorsFormat.testMergeStability

Error Message:
java.lang.AssertionError: expected:<{tvd=31653, fnm=686, nvm=283, pay=77, tvm=162, tmd=822, fdm=159, pos=14106, fdt=93, tvx=108, doc=15263, tim=23793, tip=130, fdx=72, nvd=20894}> but was:<{cfs=108363, cfe=447}>

Stack Trace:
java.lang.AssertionError: expected:<{tvd=31653, fnm=686, nvm=283, pay=77, tvm=162, tmd=822, fdm=159, pos=14106, fdt=93, tvx=108, doc=15263, tim=23793, tip=130, fdx=72, nvd=20894}> but was:<{cfs=108363, cfe=447}>
	at __randomizedtesting.SeedInfo.seed([9268D9678FC9F149:E6249F488223F3FF]:0)
	at junit@4.13.2/org.junit.Assert.fail(Assert.java:89)
	at junit@4.13.2/org.junit.Assert.failNotEquals(Assert.java:835)
	at junit@4.13.2/org.junit.Assert.assertEquals(Assert.java:120)
	at junit@4.13.2/org.junit.Assert.assertEquals(Assert.java:146)
	at org.apache.lucene.test_framework@11.0.0-SNAPSHOT/org.apache.lucene.tests.index.BaseIndexFileFormatTestCase.testMergeStability(BaseIndexFileFormatTestCase.java:306)
	at java.base/jdk.internal.reflect.DirectMethodHandleAccessor.invoke(DirectMethodHandleAccessor.java:104)
	at java.base/java.lang.reflect.Method.invoke(Method.java:565)
	at randomizedtesting.runner@2.8.3/com.carrotsearch.randomizedtesting.RandomizedRunner.invoke(RandomizedRunner.java:1763)
	at randomizedtesting.runner@2.8.3/com.carrotsearch.randomizedtesting.RandomizedRunner$8.evaluate(RandomizedRunner.java:946)
	at randomizedtesting.runner@2.8.3/com.carrotsearch.randomizedtesting.RandomizedRunner$9.evaluate(RandomizedRunner.java:982)
	at randomizedtesting.runner@2.8.3/com.carrotsearch.randomizedtesting.RandomizedRunner$10.evaluate(RandomizedRunner.java:996)
	at org.apache.lucene.test_framework@11.0.0-SNAPSHOT/org.apache.lucene.tests.util.TestRuleSetupTeardownChained$1.evaluate(TestRuleSetupTeardownChained.java:48)
	at org.apache.lucene.test_framework@11.0.0-SNAPSHOT/org.apache.lucene.tests.util.AbstractBeforeAfterRule$1.evaluate(AbstractBeforeAfterRule.java:43)
	at org.apache.lucene.test_framework@11.0.0-SNAPSHOT/org.apache.lucene.tests.util.TestRuleThreadAndTestName$1.evaluate(TestRuleThreadAndTestName.java:45)
	at org.apache.lucene.test_framework@11.0.0-SNAPSHOT/org.apache.lucene.tests.util.TestRuleIgnoreAfterMaxFailures$1.evaluate(TestRuleIgnoreAfterMaxFailures.java:60)
	at org.apache.lucene.test_framework@11.0.0-SNAPSHOT/org.apache.lucene.tests.util.TestRuleMarkFailure$1.evaluate(TestRuleMarkFailure.java:44)
	at junit@4.13.2/org.junit.rules.RunRules.evaluate(RunRules.java:20)
	at randomizedtesting.runner@2.8.3/com.carrotsearch.randomizedtesting.rules.StatementAdapter.evaluate(StatementAdapter.java:36)
	at randomizedtesting.runner@2.8.3/com.carrotsearch.randomizedtesting.ThreadLeakControl$StatementRunner.run(ThreadLeakControl.java:390)
	at randomizedtesting.runner@2.8.3/com.carrotsearch.randomizedtesting.ThreadLeakControl.forkTimeoutingTask(ThreadLeakControl.java:843)
	at randomizedtesting.runner@2.8.3/com.carrotsearch.randomizedtesting.ThreadLeakControl$3.evaluate(ThreadLeakControl.java:490)
	at randomizedtesting.runner@2.8.3/com.carrotsearch.randomizedtesting.RandomizedRunner.runSingleTest(RandomizedRunner.java:955)
	at randomizedtesting.runner@2.8.3/com.carrotsearch.randomizedtesting.RandomizedRunner$5.evaluate(RandomizedRunner.java:840)
	at randomizedtesting.runner@2.8.3/com.carrotsearch.randomizedtesting.RandomizedRunner$6.evaluate(RandomizedRunner.java:891)
	at randomizedtesting.runner@2.8.3/com.carrotsearch.randomizedtesting.RandomizedRunner$7.evaluate(RandomizedRunner.java:902)
	at org.apache.lucene.test_framework@11.0.0-SNAPSHOT/org.apache.lucene.tests.util.AbstractBeforeAfterRule$1.evaluate(AbstractBeforeAfterRule.java:43)
	at randomizedtesting.runner@2.8.3/com.carrotsearch.randomizedtesting.rules.StatementAdapter.evaluate(StatementAdapter.java:36)
	at org.apache.lucene.test_framework@11.0.0-SNAPSHOT/org.apache.lucene.tests.util.TestRuleStoreClassName$1.evaluate(TestRuleStoreClassName.java:38)
	at randomizedtesting.runner@2.8.3/com.carrotsearch.randomizedtesting.rules.NoShadowingOrOverridesOnMethodsRule$1.evaluate(NoShadowingOrOverridesOnMethodsRule.java:40)
	at randomizedtesting.runner@2.8.3/com.carrotsearch.randomizedtesting.rules.NoShadowingOrOverridesOnMethodsRule$1.evaluate(NoShadowingOrOverridesOnMethodsRule.java:40)
	at randomizedtesting.runner@2.8.3/com.carrotsearch.randomizedtesting.rules.StatementAdapter.evaluate(StatementAdapter.java:36)
	at randomizedtesting.runner@2.8.3/com.carrotsearch.randomizedtesting.rules.StatementAdapter.evaluate(StatementAdapter.java:36)
	at org.apache.lucene.test_framework@11.0.0-SNAPSHOT/org.apache.lucene.tests.util.TestRuleAssertionsRequired$1.evaluate(TestRuleAssertionsRequired.java:52)
	at org.apache.lucene.test_framework@11.0.0-SNAPSHOT/org.apache.lucene.tests.util.AbstractBeforeAfterRule$1.evaluate(AbstractBeforeAfterRule.java:43)
	at org.apache.lucene.test_framework@11.0.0-SNAPSHOT/org.apache.lucene.tests.util.TestRuleMarkFailure$1.evaluate(TestRuleMarkFailure.java:44)
	at org.apache.lucene.test_framework@11.0.0-SNAPSHOT/org.apache.lucene.tests.util.TestRuleIgnoreAfterMaxFailures$1.evaluate(TestRuleIgnoreAfterMaxFailures.java:60)
	at org.apache.lucene.test_framework@11.0.0-SNAPSHOT/org.apache.lucene.tests.util.TestRuleIgnoreTestSuites$1.evaluate(TestRuleIgnoreTestSuites.java:47)
	at junit@4.13.2/org.junit.rules.RunRules.evaluate(RunRules.java:20)
	at randomizedtesting.runner@2.8.3/com.carrotsearch.randomizedtesting.rules.StatementAdapter.evaluate(StatementAdapter.java:36)
	at randomizedtesting.runner@2.8.3/com.carrotsearch.randomizedtesting.ThreadLeakControl$StatementRunner.run(ThreadLeakControl.java:390)
	at randomizedtesting.runner@2.8.3/com.carrotsearch.randomizedtesting.ThreadLeakControl.lambda$forkTimeoutingTask$0(ThreadLeakControl.java:850)
	at java.base/java.lang.Thread.run(Thread.java:1474)


FAILED:  org.apache.lucene.backward_codecs.lucene60.TestLucene60FieldInfosFormat.testMergeStability

Error Message:
java.lang.AssertionError: expected:<{fnm=82, fdt=11033, fdx=103, fdm=158}> but was:<{cfs=11438, cfe=150}>

Stack Trace:
java.lang.AssertionError: expected:<{fnm=82, fdt=11033, fdx=103, fdm=158}> but was:<{cfs=11438, cfe=150}>
	at __randomizedtesting.SeedInfo.seed([9268D9678FC9F149:E6249F488223F3FF]:0)
	at junit@4.13.2/org.junit.Assert.fail(Assert.java:89)
	at junit@4.13.2/org.junit.Assert.failNotEquals(Assert.java:835)
	at junit@4.13.2/org.junit.Assert.assertEquals(Assert.java:120)
	at junit@4.13.2/org.junit.Assert.assertEquals(Assert.java:146)
	at org.apache.lucene.test_framework@11.0.0-SNAPSHOT/org.apache.lucene.tests.index.BaseIndexFileFormatTestCase.testMergeStability(BaseIndexFileFormatTestCase.java:306)
	at java.base/jdk.internal.reflect.DirectMethodHandleAccessor.invoke(DirectMethodHandleAccessor.java:104)
	at java.base/java.lang.reflect.Method.invoke(Method.java:565)
	at randomizedtesting.runner@2.8.3/com.carrotsearch.randomizedtesting.RandomizedRunner.invoke(RandomizedRunner.java:1763)
	at randomizedtesting.runner@2.8.3/com.carrotsearch.randomizedtesting.RandomizedRunner$8.evaluate(RandomizedRunner.java:946)
	at randomizedtesting.runner@2.8.3/com.carrotsearch.randomizedtesting.RandomizedRunner$9.evaluate(RandomizedRunner.java:982)
	at randomizedtesting.runner@2.8.3/com.carrotsearch.randomizedtesting.RandomizedRunner$10.evaluate(RandomizedRunner.java:996)
	at org.apache.lucene.test_framework@11.0.0-SNAPSHOT/org.apache.lucene.tests.util.TestRuleSetupTeardownChained$1.evaluate(TestRuleSetupTeardownChained.java:48)
	at org.apache.lucene.test_framework@11.0.0-SNAPSHOT/org.apache.lucene.tests.util.AbstractBeforeAfterRule$1.evaluate(AbstractBeforeAfterRule.java:43)
	at org.apache.lucene.test_framework@11.0.0-SNAPSHOT/org.apache.lucene.tests.util.TestRuleThreadAndTestName$1.evaluate(TestRuleThreadAndTestName.java:45)
	at org.apache.lucene.test_framework@11.0.0-SNAPSHOT/org.apache.lucene.tests.util.TestRuleIgnoreAfterMaxFailures$1.evaluate(TestRuleIgnoreAfterMaxFailures.java:60)
	at org.apache.lucene.test_framework@11.0.0-SNAPSHOT/org.apache.lucene.tests.util.TestRuleMarkFailure$1.evaluate(TestRuleMarkFailure.java:44)
	at junit@4.13.2/org.junit.rules.RunRules.evaluate(RunRules.java:20)
	at randomizedtesting.runner@2.8.3/com.carrotsearch.randomizedtesting.rules.StatementAdapter.evaluate(StatementAdapter.java:36)
	at randomizedtesting.runner@2.8.3/com.carrotsearch.randomizedtesting.ThreadLeakControl$StatementRunner.run(ThreadLeakControl.java:390)
	at randomizedtesting.runner@2.8.3/com.carrotsearch.randomizedtesting.ThreadLeakControl.forkTimeoutingTask(ThreadLeakControl.java:843)
	at randomizedtesting.runner@2.8.3/com.carrotsearch.randomizedtesting.ThreadLeakControl$3.evaluate(ThreadLeakControl.java:490)
	at randomizedtesting.runner@2.8.3/com.carrotsearch.randomizedtesting.RandomizedRunner.runSingleTest(RandomizedRunner.java:955)
	at randomizedtesting.runner@2.8.3/com.carrotsearch.randomizedtesting.RandomizedRunner$5.evaluate(RandomizedRunner.java:840)
	at randomizedtesting.runner@2.8.3/com.carrotsearch.randomizedtesting.RandomizedRunner$6.evaluate(RandomizedRunner.java:891)
	at randomizedtesting.runner@2.8.3/com.carrotsearch.randomizedtesting.RandomizedRunner$7.evaluate(RandomizedRunner.java:902)
	at org.apache.lucene.test_framework@11.0.0-SNAPSHOT/org.apache.lucene.tests.util.AbstractBeforeAfterRule$1.evaluate(AbstractBeforeAfterRule.java:43)
	at randomizedtesting.runner@2.8.3/com.carrotsearch.randomizedtesting.rules.StatementAdapter.evaluate(StatementAdapter.java:36)
	at org.apache.lucene.test_framework@11.0.0-SNAPSHOT/org.apache.lucene.tests.util.TestRuleStoreClassName$1.evaluate(TestRuleStoreClassName.java:38)
	at randomizedtesting.runner@2.8.3/com.carrotsearch.randomizedtesting.rules.NoShadowingOrOverridesOnMethodsRule$1.evaluate(NoShadowingOrOverridesOnMethodsRule.java:40)
	at randomizedtesting.runner@2.8.3/com.carrotsearch.randomizedtesting.rules.NoShadowingOrOverridesOnMethodsRule$1.evaluate(NoShadowingOrOverridesOnMethodsRule.java:40)
	at randomizedtesting.runner@2.8.3/com.carrotsearch.randomizedtesting.rules.StatementAdapter.evaluate(StatementAdapter.java:36)
	at randomizedtesting.runner@2.8.3/com.carrotsearch.randomizedtesting.rules.StatementAdapter.evaluate(StatementAdapter.java:36)
	at org.apache.lucene.test_framework@11.0.0-SNAPSHOT/org.apache.lucene.tests.util.TestRuleAssertionsRequired$1.evaluate(TestRuleAssertionsRequired.java:52)
	at org.apache.lucene.test_framework@11.0.0-SNAPSHOT/org.apache.lucene.tests.util.AbstractBeforeAfterRule$1.evaluate(AbstractBeforeAfterRule.java:43)
	at org.apache.lucene.test_framework@11.0.0-SNAPSHOT/org.apache.lucene.tests.util.TestRuleMarkFailure$1.evaluate(TestRuleMarkFailure.java:44)
	at org.apache.lucene.test_framework@11.0.0-SNAPSHOT/org.apache.lucene.tests.util.TestRuleIgnoreAfterMaxFailures$1.evaluate(TestRuleIgnoreAfterMaxFailures.java:60)
	at org.apache.lucene.test_framework@11.0.0-SNAPSHOT/org.apache.lucene.tests.util.TestRuleIgnoreTestSuites$1.evaluate(TestRuleIgnoreTestSuites.java:47)
	at junit@4.13.2/org.junit.rules.RunRules.evaluate(RunRules.java:20)
	at randomizedtesting.runner@2.8.3/com.carrotsearch.randomizedtesting.rules.StatementAdapter.evaluate(StatementAdapter.java:36)
	at randomizedtesting.runner@2.8.3/com.carrotsearch.randomizedtesting.ThreadLeakControl$StatementRunner.run(ThreadLeakControl.java:390)
	at randomizedtesting.runner@2.8.3/com.carrotsearch.randomizedtesting.ThreadLeakControl.lambda$forkTimeoutingTask$0(ThreadLeakControl.java:850)
	at java.base/java.lang.Thread.run(Thread.java:1474)


FAILED:  org.apache.lucene.backward_codecs.lucene70.TestLucene70SegmentInfoFormat.testMergeStability

Error Message:
java.lang.AssertionError: expected:<{fnm=82, fdt=11033, fdx=103, fdm=158}> but was:<{cfs=11438, cfe=150}>

Stack Trace:
java.lang.AssertionError: expected:<{fnm=82, fdt=11033, fdx=103, fdm=158}> but was:<{cfs=11438, cfe=150}>
	at __randomizedtesting.SeedInfo.seed([9268D9678FC9F149:E6249F488223F3FF]:0)
	at junit@4.13.2/org.junit.Assert.fail(Assert.java:89)
	at junit@4.13.2/org.junit.Assert.failNotEquals(Assert.java:835)
	at junit@4.13.2/org.junit.Assert.assertEquals(Assert.java:120)
	at junit@4.13.2/org.junit.Assert.assertEquals(Assert.java:146)
	at org.apache.lucene.test_framework@11.0.0-SNAPSHOT/org.apache.lucene.tests.index.BaseIndexFileFormatTestCase.testMergeStability(BaseIndexFileFormatTestCase.java:306)
	at java.base/jdk.internal.reflect.DirectMethodHandleAccessor.invoke(DirectMethodHandleAccessor.java:104)
	at java.base/java.lang.reflect.Method.invoke(Method.java:565)
	at randomizedtesting.runner@2.8.3/com.carrotsearch.randomizedtesting.RandomizedRunner.invoke(RandomizedRunner.java:1763)
	at randomizedtesting.runner@2.8.3/com.carrotsearch.randomizedtesting.RandomizedRunner$8.evaluate(RandomizedRunner.java:946)
	at randomizedtesting.runner@2.8.3/com.carrotsearch.randomizedtesting.RandomizedRunner$9.evaluate(RandomizedRunner.java:982)
	at randomizedtesting.runner@2.8.3/com.carrotsearch.randomizedtesting.RandomizedRunner$10.evaluate(RandomizedRunner.java:996)
	at org.apache.lucene.test_framework@11.0.0-SNAPSHOT/org.apache.lucene.tests.util.TestRuleSetupTeardownChained$1.evaluate(TestRuleSetupTeardownChained.java:48)
	at org.apache.lucene.test_framework@11.0.0-SNAPSHOT/org.apache.lucene.tests.util.AbstractBeforeAfterRule$1.evaluate(AbstractBeforeAfterRule.java:43)
	at org.apache.lucene.test_framework@11.0.0-SNAPSHOT/org.apache.lucene.tests.util.TestRuleThreadAndTestName$1.evaluate(TestRuleThreadAndTestName.java:45)
	at org.apache.lucene.test_framework@11.0.0-SNAPSHOT/org.apache.lucene.tests.util.TestRuleIgnoreAfterMaxFailures$1.evaluate(TestRuleIgnoreAfterMaxFailures.java:60)
	at org.apache.lucene.test_framework@11.0.0-SNAPSHOT/org.apache.lucene.tests.util.TestRuleMarkFailure$1.evaluate(TestRuleMarkFailure.java:44)
	at junit@4.13.2/org.junit.rules.RunRules.evaluate(RunRules.java:20)
	at randomizedtesting.runner@2.8.3/com.carrotsearch.randomizedtesting.rules.StatementAdapter.evaluate(StatementAdapter.java:36)
	at randomizedtesting.runner@2.8.3/com.carrotsearch.randomizedtesting.ThreadLeakControl$StatementRunner.run(ThreadLeakControl.java:390)
	at randomizedtesting.runner@2.8.3/com.carrotsearch.randomizedtesting.ThreadLeakControl.forkTimeoutingTask(ThreadLeakControl.java:843)
	at randomizedtesting.runner@2.8.3/com.carrotsearch.randomizedtesting.ThreadLeakControl$3.evaluate(ThreadLeakControl.java:490)
	at randomizedtesting.runner@2.8.3/com.carrotsearch.randomizedtesting.RandomizedRunner.runSingleTest(RandomizedRunner.java:955)
	at randomizedtesting.runner@2.8.3/com.carrotsearch.randomizedtesting.RandomizedRunner$5.evaluate(RandomizedRunner.java:840)
	at randomizedtesting.runner@2.8.3/com.carrotsearch.randomizedtesting.RandomizedRunner$6.evaluate(RandomizedRunner.java:891)
	at randomizedtesting.runner@2.8.3/com.carrotsearch.randomizedtesting.RandomizedRunner$7.evaluate(RandomizedRunner.java:902)
	at org.apache.lucene.test_framework@11.0.0-SNAPSHOT/org.apache.lucene.tests.util.AbstractBeforeAfterRule$1.evaluate(AbstractBeforeAfterRule.java:43)
	at randomizedtesting.runner@2.8.3/com.carrotsearch.randomizedtesting.rules.StatementAdapter.evaluate(StatementAdapter.java:36)
	at org.apache.lucene.test_framework@11.0.0-SNAPSHOT/org.apache.lucene.tests.util.TestRuleStoreClassName$1.evaluate(TestRuleStoreClassName.java:38)
	at randomizedtesting.runner@2.8.3/com.carrotsearch.randomizedtesting.rules.NoShadowingOrOverridesOnMethodsRule$1.evaluate(NoShadowingOrOverridesOnMethodsRule.java:40)
	at randomizedtesting.runner@2.8.3/com.carrotsearch.randomizedtesting.rules.NoShadowingOrOverridesOnMethodsRule$1.evaluate(NoShadowingOrOverridesOnMethodsRule.java:40)
	at randomizedtesting.runner@2.8.3/com.carrotsearch.randomizedtesting.rules.StatementAdapter.evaluate(StatementAdapter.java:36)
	at randomizedtesting.runner@2.8.3/com.carrotsearch.randomizedtesting.rules.StatementAdapter.evaluate(StatementAdapter.java:36)
	at org.apache.lucene.test_framework@11.0.0-SNAPSHOT/org.apache.lucene.tests.util.TestRuleAssertionsRequired$1.evaluate(TestRuleAssertionsRequired.java:52)
	at org.apache.lucene.test_framework@11.0.0-SNAPSHOT/org.apache.lucene.tests.util.AbstractBeforeAfterRule$1.evaluate(AbstractBeforeAfterRule.java:43)
	at org.apache.lucene.test_framework@11.0.0-SNAPSHOT/org.apache.lucene.tests.util.TestRuleMarkFailure$1.evaluate(TestRuleMarkFailure.java:44)
	at org.apache.lucene.test_framework@11.0.0-SNAPSHOT/org.apache.lucene.tests.util.TestRuleIgnoreAfterMaxFailures$1.evaluate(TestRuleIgnoreAfterMaxFailures.java:60)
	at org.apache.lucene.test_framework@11.0.0-SNAPSHOT/org.apache.lucene.tests.util.TestRuleIgnoreTestSuites$1.evaluate(TestRuleIgnoreTestSuites.java:47)
	at junit@4.13.2/org.junit.rules.RunRules.evaluate(RunRules.java:20)
	at randomizedtesting.runner@2.8.3/com.carrotsearch.randomizedtesting.rules.StatementAdapter.evaluate(StatementAdapter.java:36)
	at randomizedtesting.runner@2.8.3/com.carrotsearch.randomizedtesting.ThreadLeakControl$StatementRunner.run(ThreadLeakControl.java:390)
	at randomizedtesting.runner@2.8.3/com.carrotsearch.randomizedtesting.ThreadLeakControl.lambda$forkTimeoutingTask$0(ThreadLeakControl.java:850)
	at java.base/java.lang.Thread.run(Thread.java:1474)


FAILED:  org.apache.lucene.backward_codecs.lucene86.TestLucene86SegmentInfoFormat.testMergeStability

Error Message:
java.lang.AssertionError: expected:<{fnm=82, fdt=11026, fdx=80, fdm=159}> but was:<{cfs=11409, cfe=150}>

Stack Trace:
java.lang.AssertionError: expected:<{fnm=82, fdt=11026, fdx=80, fdm=159}> but was:<{cfs=11409, cfe=150}>
	at __randomizedtesting.SeedInfo.seed([9268D9678FC9F149:E6249F488223F3FF]:0)
	at junit@4.13.2/org.junit.Assert.fail(Assert.java:89)
	at junit@4.13.2/org.junit.Assert.failNotEquals(Assert.java:835)
	at junit@4.13.2/org.junit.Assert.assertEquals(Assert.java:120)
	at junit@4.13.2/org.junit.Assert.assertEquals(Assert.java:146)
	at org.apache.lucene.test_framework@11.0.0-SNAPSHOT/org.apache.lucene.tests.index.BaseIndexFileFormatTestCase.testMergeStability(BaseIndexFileFormatTestCase.java:306)
	at java.base/jdk.internal.reflect.DirectMethodHandleAccessor.invoke(DirectMethodHandleAccessor.java:104)
	at java.base/java.lang.reflect.Method.invoke(Method.java:565)
	at randomizedtesting.runner@2.8.3/com.carrotsearch.randomizedtesting.RandomizedRunner.invoke(RandomizedRunner.java:1763)
	at randomizedtesting.runner@2.8.3/com.carrotsearch.randomizedtesting.RandomizedRunner$8.evaluate(RandomizedRunner.java:946)
	at randomizedtesting.runner@2.8.3/com.carrotsearch.randomizedtesting.RandomizedRunner$9.evaluate(RandomizedRunner.java:982)
	at randomizedtesting.runner@2.8.3/com.carrotsearch.randomizedtesting.RandomizedRunner$10.evaluate(RandomizedRunner.java:996)
	at org.apache.lucene.test_framework@11.0.0-SNAPSHOT/org.apache.lucene.tests.util.TestRuleSetupTeardownChained$1.evaluate(TestRuleSetupTeardownChained.java:48)
	at org.apache.lucene.test_framework@11.0.0-SNAPSHOT/org.apache.lucene.tests.util.AbstractBeforeAfterRule$1.evaluate(AbstractBeforeAfterRule.java:43)
	at org.apache.lucene.test_framework@11.0.0-SNAPSHOT/org.apache.lucene.tests.util.TestRuleThreadAndTestName$1.evaluate(TestRuleThreadAndTestName.java:45)
	at org.apache.lucene.test_framework@11.0.0-SNAPSHOT/org.apache.lucene.tests.util.TestRuleIgnoreAfterMaxFailures$1.evaluate(TestRuleIgnoreAfterMaxFailures.java:60)
	at org.apache.lucene.test_framework@11.0.0-SNAPSHOT/org.apache.lucene.tests.util.TestRuleMarkFailure$1.evaluate(TestRuleMarkFailure.java:44)
	at junit@4.13.2/org.junit.rules.RunRules.evaluate(RunRules.java:20)
	at randomizedtesting.runner@2.8.3/com.carrotsearch.randomizedtesting.rules.StatementAdapter.evaluate(StatementAdapter.java:36)
	at randomizedtesting.runner@2.8.3/com.carrotsearch.randomizedtesting.ThreadLeakControl$StatementRunner.run(ThreadLeakControl.java:390)
	at randomizedtesting.runner@2.8.3/com.carrotsearch.randomizedtesting.ThreadLeakControl.forkTimeoutingTask(ThreadLeakControl.java:843)
	at randomizedtesting.runner@2.8.3/com.carrotsearch.randomizedtesting.ThreadLeakControl$3.evaluate(ThreadLeakControl.java:490)
	at randomizedtesting.runner@2.8.3/com.carrotsearch.randomizedtesting.RandomizedRunner.runSingleTest(RandomizedRunner.java:955)
	at randomizedtesting.runner@2.8.3/com.carrotsearch.randomizedtesting.RandomizedRunner$5.evaluate(RandomizedRunner.java:840)
	at randomizedtesting.runner@2.8.3/com.carrotsearch.randomizedtesting.RandomizedRunner$6.evaluate(RandomizedRunner.java:891)
	at randomizedtesting.runner@2.8.3/com.carrotsearch.randomizedtesting.RandomizedRunner$7.evaluate(RandomizedRunner.java:902)
	at org.apache.lucene.test_framework@11.0.0-SNAPSHOT/org.apache.lucene.tests.util.AbstractBeforeAfterRule$1.evaluate(AbstractBeforeAfterRule.java:43)
	at randomizedtesting.runner@2.8.3/com.carrotsearch.randomizedtesting.rules.StatementAdapter.evaluate(StatementAdapter.java:36)
	at org.apache.lucene.test_framework@11.0.0-SNAPSHOT/org.apache.lucene.tests.util.TestRuleStoreClassName$1.evaluate(TestRuleStoreClassName.java:38)
	at randomizedtesting.runner@2.8.3/com.carrotsearch.randomizedtesting.rules.NoShadowingOrOverridesOnMethodsRule$1.evaluate(NoShadowingOrOverridesOnMethodsRule.java:40)
	at randomizedtesting.runner@2.8.3/com.carrotsearch.randomizedtesting.rules.NoShadowingOrOverridesOnMethodsRule$1.evaluate(NoShadowingOrOverridesOnMethodsRule.java:40)
	at randomizedtesting.runner@2.8.3/com.carrotsearch.randomizedtesting.rules.StatementAdapter.evaluate(StatementAdapter.java:36)
	at randomizedtesting.runner@2.8.3/com.carrotsearch.randomizedtesting.rules.StatementAdapter.evaluate(StatementAdapter.java:36)
	at org.apache.lucene.test_framework@11.0.0-SNAPSHOT/org.apache.lucene.tests.util.TestRuleAssertionsRequired$1.evaluate(TestRuleAssertionsRequired.java:52)
	at org.apache.lucene.test_framework@11.0.0-SNAPSHOT/org.apache.lucene.tests.util.AbstractBeforeAfterRule$1.evaluate(AbstractBeforeAfterRule.java:43)
	at org.apache.lucene.test_framework@11.0.0-SNAPSHOT/org.apache.lucene.tests.util.TestRuleMarkFailure$1.evaluate(TestRuleMarkFailure.java:44)
	at org.apache.lucene.test_framework@11.0.0-SNAPSHOT/org.apache.lucene.tests.util.TestRuleIgnoreAfterMaxFailures$1.evaluate(TestRuleIgnoreAfterMaxFailures.java:60)
	at org.apache.lucene.test_framework@11.0.0-SNAPSHOT/org.apache.lucene.tests.util.TestRuleIgnoreTestSuites$1.evaluate(TestRuleIgnoreTestSuites.java:47)
	at junit@4.13.2/org.junit.rules.RunRules.evaluate(RunRules.java:20)
	at randomizedtesting.runner@2.8.3/com.carrotsearch.randomizedtesting.rules.StatementAdapter.evaluate(StatementAdapter.java:36)
	at randomizedtesting.runner@2.8.3/com.carrotsearch.randomizedtesting.ThreadLeakControl$StatementRunner.run(ThreadLeakControl.java:390)
	at randomizedtesting.runner@2.8.3/com.carrotsearch.randomizedtesting.ThreadLeakControl.lambda$forkTimeoutingTask$0(ThreadLeakControl.java:850)
	at java.base/java.lang.Thread.run(Thread.java:1474)


FAILED:  org.apache.lucene.backward_codecs.lucene87.TestLucene87StoredFieldsFormat.testMergeStability

Error Message:
java.lang.AssertionError: expected:<{fnm=77, fdt=79961, fdx=81, fdm=159}> but was:<{cfs=80340, cfe=150}>

Stack Trace:
java.lang.AssertionError: expected:<{fnm=77, fdt=79961, fdx=81, fdm=159}> but was:<{cfs=80340, cfe=150}>
	at __randomizedtesting.SeedInfo.seed([9268D9678FC9F149:E6249F488223F3FF]:0)
	at junit@4.13.2/org.junit.Assert.fail(Assert.java:89)
	at junit@4.13.2/org.junit.Assert.failNotEquals(Assert.java:835)
	at junit@4.13.2/org.junit.Assert.assertEquals(Assert.java:120)
	at junit@4.13.2/org.junit.Assert.assertEquals(Assert.java:146)
	at org.apache.lucene.test_framework@11.0.0-SNAPSHOT/org.apache.lucene.tests.index.BaseIndexFileFormatTestCase.testMergeStability(BaseIndexFileFormatTestCase.java:306)
	at java.base/jdk.internal.reflect.DirectMethodHandleAccessor.invoke(DirectMethodHandleAccessor.java:104)
	at java.base/java.lang.reflect.Method.invoke(Method.java:565)
	at randomizedtesting.runner@2.8.3/com.carrotsearch.randomizedtesting.RandomizedRunner.invoke(RandomizedRunner.java:1763)
	at randomizedtesting.runner@2.8.3/com.carrotsearch.randomizedtesting.RandomizedRunner$8.evaluate(RandomizedRunner.java:946)
	at randomizedtesting.runner@2.8.3/com.carrotsearch.randomizedtesting.RandomizedRunner$9.evaluate(RandomizedRunner.java:982)
	at randomizedtesting.runner@2.8.3/com.carrotsearch.randomizedtesting.RandomizedRunner$10.evaluate(RandomizedRunner.java:996)
	at org.apache.lucene.test_framework@11.0.0-SNAPSHOT/org.apache.lucene.tests.util.TestRuleSetupTeardownChained$1.evaluate(TestRuleSetupTeardownChained.java:48)
	at org.apache.lucene.test_framework@11.0.0-SNAPSHOT/org.apache.lucene.tests.util.AbstractBeforeAfterRule$1.evaluate(AbstractBeforeAfterRule.java:43)
	at org.apache.lucene.test_framework@11.0.0-SNAPSHOT/org.apache.lucene.tests.util.TestRuleThreadAndTestName$1.evaluate(TestRuleThreadAndTestName.java:45)
	at org.apache.lucene.test_framework@11.0.0-SNAPSHOT/org.apache.lucene.tests.util.TestRuleIgnoreAfterMaxFailures$1.evaluate(TestRuleIgnoreAfterMaxFailures.java:60)
	at org.apache.lucene.test_framework@11.0.0-SNAPSHOT/org.apache.lucene.tests.util.TestRuleMarkFailure$1.evaluate(TestRuleMarkFailure.java:44)
	at junit@4.13.2/org.junit.rules.RunRules.evaluate(RunRules.java:20)
	at randomizedtesting.runner@2.8.3/com.carrotsearch.randomizedtesting.rules.StatementAdapter.evaluate(StatementAdapter.java:36)
	at randomizedtesting.runner@2.8.3/com.carrotsearch.randomizedtesting.ThreadLeakControl$StatementRunner.run(ThreadLeakControl.java:390)
	at randomizedtesting.runner@2.8.3/com.carrotsearch.randomizedtesting.ThreadLeakControl.forkTimeoutingTask(ThreadLeakControl.java:843)
	at randomizedtesting.runner@2.8.3/com.carrotsearch.randomizedtesting.ThreadLeakControl$3.evaluate(ThreadLeakControl.java:490)
	at randomizedtesting.runner@2.8.3/com.carrotsearch.randomizedtesting.RandomizedRunner.runSingleTest(RandomizedRunner.java:955)
	at randomizedtesting.runner@2.8.3/com.carrotsearch.randomizedtesting.RandomizedRunner$5.evaluate(RandomizedRunner.java:840)
	at randomizedtesting.runner@2.8.3/com.carrotsearch.randomizedtesting.RandomizedRunner$6.evaluate(RandomizedRunner.java:891)
	at randomizedtesting.runner@2.8.3/com.carrotsearch.randomizedtesting.RandomizedRunner$7.evaluate(RandomizedRunner.java:902)
	at org.apache.lucene.test_framework@11.0.0-SNAPSHOT/org.apache.lucene.tests.util.AbstractBeforeAfterRule$1.evaluate(AbstractBeforeAfterRule.java:43)
	at randomizedtesting.runner@2.8.3/com.carrotsearch.randomizedtesting.rules.StatementAdapter.evaluate(StatementAdapter.java:36)
	at org.apache.lucene.test_framework@11.0.0-SNAPSHOT/org.apache.lucene.tests.util.TestRuleStoreClassName$1.evaluate(TestRuleStoreClassName.java:38)
	at randomizedtesting.runner@2.8.3/com.carrotsearch.randomizedtesting.rules.NoShadowingOrOverridesOnMethodsRule$1.evaluate(NoShadowingOrOverridesOnMethodsRule.java:40)
	at randomizedtesting.runner@2.8.3/com.carrotsearch.randomizedtesting.rules.NoShadowingOrOverridesOnMethodsRule$1.evaluate(NoShadowingOrOverridesOnMethodsRule.java:40)
	at randomizedtesting.runner@2.8.3/com.carrotsearch.randomizedtesting.rules.StatementAdapter.evaluate(StatementAdapter.java:36)
	at randomizedtesting.runner@2.8.3/com.carrotsearch.randomizedtesting.rules.StatementAdapter.evaluate(StatementAdapter.java:36)
	at org.apache.lucene.test_framework@11.0.0-SNAPSHOT/org.apache.lucene.tests.util.TestRuleAssertionsRequired$1.evaluate(TestRuleAssertionsRequired.java:52)
	at org.apache.lucene.test_framework@11.0.0-SNAPSHOT/org.apache.lucene.tests.util.AbstractBeforeAfterRule$1.evaluate(AbstractBeforeAfterRule.java:43)
	at org.apache.lucene.test_framework@11.0.0-SNAPSHOT/org.apache.lucene.tests.util.TestRuleMarkFailure$1.evaluate(TestRuleMarkFailure.java:44)
	at org.apache.lucene.test_framework@11.0.0-SNAPSHOT/org.apache.lucene.tests.util.TestRuleIgnoreAfterMaxFailures$1.evaluate(TestRuleIgnoreAfterMaxFailures.java:60)
	at org.apache.lucene.test_framework@11.0.0-SNAPSHOT/org.apache.lucene.tests.util.TestRuleIgnoreTestSuites$1.evaluate(TestRuleIgnoreTestSuites.java:47)
	at junit@4.13.2/org.junit.rules.RunRules.evaluate(RunRules.java:20)
	at randomizedtesting.runner@2.8.3/com.carrotsearch.randomizedtesting.rules.StatementAdapter.evaluate(StatementAdapter.java:36)
	at randomizedtesting.runner@2.8.3/com.carrotsearch.randomizedtesting.ThreadLeakControl$StatementRunner.run(ThreadLeakControl.java:390)
	at randomizedtesting.runner@2.8.3/com.carrotsearch.randomizedtesting.ThreadLeakControl.lambda$forkTimeoutingTask$0(ThreadLeakControl.java:850)
	at java.base/java.lang.Thread.run(Thread.java:1474)


FAILED:  org.apache.lucene.backward_codecs.lucene87.TestLucene87StoredFieldsFormatHighCompression.testMergeStability

Error Message:
java.lang.AssertionError: expected:<{fnm=77, fdt=52364, fdx=64, fdm=159}> but was:<{cfs=52726, cfe=150}>

Stack Trace:
java.lang.AssertionError: expected:<{fnm=77, fdt=52364, fdx=64, fdm=159}> but was:<{cfs=52726, cfe=150}>
	at __randomizedtesting.SeedInfo.seed([9268D9678FC9F149:E6249F488223F3FF]:0)
	at junit@4.13.2/org.junit.Assert.fail(Assert.java:89)
	at junit@4.13.2/org.junit.Assert.failNotEquals(Assert.java:835)
	at junit@4.13.2/org.junit.Assert.assertEquals(Assert.java:120)
	at junit@4.13.2/org.junit.Assert.assertEquals(Assert.java:146)
	at org.apache.lucene.test_framework@11.0.0-SNAPSHOT/org.apache.lucene.tests.index.BaseIndexFileFormatTestCase.testMergeStability(BaseIndexFileFormatTestCase.java:306)
	at java.base/jdk.internal.reflect.DirectMethodHandleAccessor.invoke(DirectMethodHandleAccessor.java:104)
	at java.base/java.lang.reflect.Method.invoke(Method.java:565)
	at randomizedtesting.runner@2.8.3/com.carrotsearch.randomizedtesting.RandomizedRunner.invoke(RandomizedRunner.java:1763)
	at randomizedtesting.runner@2.8.3/com.carrotsearch.randomizedtesting.RandomizedRunner$8.evaluate(RandomizedRunner.java:946)
	at randomizedtesting.runner@2.8.3/com.carrotsearch.randomizedtesting.RandomizedRunner$9.evaluate(RandomizedRunner.java:982)
	at randomizedtesting.runner@2.8.3/com.carrotsearch.randomizedtesting.RandomizedRunner$10.evaluate(RandomizedRunner.java:996)
	at org.apache.lucene.test_framework@11.0.0-SNAPSHOT/org.apache.lucene.tests.util.TestRuleSetupTeardownChained$1.evaluate(TestRuleSetupTeardownChained.java:48)
	at org.apache.lucene.test_framework@11.0.0-SNAPSHOT/org.apache.lucene.tests.util.AbstractBeforeAfterRule$1.evaluate(AbstractBeforeAfterRule.java:43)
	at org.apache.lucene.test_framework@11.0.0-SNAPSHOT/org.apache.lucene.tests.util.TestRuleThreadAndTestName$1.evaluate(TestRuleThreadAndTestName.java:45)
	at org.apache.lucene.test_framework@11.0.0-SNAPSHOT/org.apache.lucene.tests.util.TestRuleIgnoreAfterMaxFailures$1.evaluate(TestRuleIgnoreAfterMaxFailures.java:60)
	at org.apache.lucene.test_framework@11.0.0-SNAPSHOT/org.apache.lucene.tests.util.TestRuleMarkFailure$1.evaluate(TestRuleMarkFailure.java:44)
	at junit@4.13.2/org.junit.rules.RunRules.evaluate(RunRules.java:20)
	at randomizedtesting.runner@2.8.3/com.carrotsearch.randomizedtesting.rules.StatementAdapter.evaluate(StatementAdapter.java:36)
	at randomizedtesting.runner@2.8.3/com.carrotsearch.randomizedtesting.ThreadLeakControl$StatementRunner.run(ThreadLeakControl.java:390)
	at randomizedtesting.runner@2.8.3/com.carrotsearch.randomizedtesting.ThreadLeakControl.forkTimeoutingTask(ThreadLeakControl.java:843)
	at randomizedtesting.runner@2.8.3/com.carrotsearch.randomizedtesting.ThreadLeakControl$3.evaluate(ThreadLeakControl.java:490)
	at randomizedtesting.runner@2.8.3/com.carrotsearch.randomizedtesting.RandomizedRunner.runSingleTest(RandomizedRunner.java:955)
	at randomizedtesting.runner@2.8.3/com.carrotsearch.randomizedtesting.RandomizedRunner$5.evaluate(RandomizedRunner.java:840)
	at randomizedtesting.runner@2.8.3/com.carrotsearch.randomizedtesting.RandomizedRunner$6.evaluate(RandomizedRunner.java:891)
	at randomizedtesting.runner@2.8.3/com.carrotsearch.randomizedtesting.RandomizedRunner$7.evaluate(RandomizedRunner.java:902)
	at org.apache.lucene.test_framework@11.0.0-SNAPSHOT/org.apache.lucene.tests.util.AbstractBeforeAfterRule$1.evaluate(AbstractBeforeAfterRule.java:43)
	at randomizedtesting.runner@2.8.3/com.carrotsearch.randomizedtesting.rules.StatementAdapter.evaluate(StatementAdapter.java:36)
	at org.apache.lucene.test_framework@11.0.0-SNAPSHOT/org.apache.lucene.tests.util.TestRuleStoreClassName$1.evaluate(TestRuleStoreClassName.java:38)
	at randomizedtesting.runner@2.8.3/com.carrotsearch.randomizedtesting.rules.NoShadowingOrOverridesOnMethodsRule$1.evaluate(NoShadowingOrOverridesOnMethodsRule.java:40)
	at randomizedtesting.runner@2.8.3/com.carrotsearch.randomizedtesting.rules.NoShadowingOrOverridesOnMethodsRule$1.evaluate(NoShadowingOrOverridesOnMethodsRule.java:40)
	at randomizedtesting.runner@2.8.3/com.carrotsearch.randomizedtesting.rules.StatementAdapter.evaluate(StatementAdapter.java:36)
	at randomizedtesting.runner@2.8.3/com.carrotsearch.randomizedtesting.rules.StatementAdapter.evaluate(StatementAdapter.java:36)
	at org.apache.lucene.test_framework@11.0.0-SNAPSHOT/org.apache.lucene.tests.util.TestRuleAssertionsRequired$1.evaluate(TestRuleAssertionsRequired.java:52)
	at org.apache.lucene.test_framework@11.0.0-SNAPSHOT/org.apache.lucene.tests.util.AbstractBeforeAfterRule$1.evaluate(AbstractBeforeAfterRule.java:43)
	at org.apache.lucene.test_framework@11.0.0-SNAPSHOT/org.apache.lucene.tests.util.TestRuleMarkFailure$1.evaluate(TestRuleMarkFailure.java:44)
	at org.apache.lucene.test_framework@11.0.0-SNAPSHOT/org.apache.lucene.tests.util.TestRuleIgnoreAfterMaxFailures$1.evaluate(TestRuleIgnoreAfterMaxFailures.java:60)
	at org.apache.lucene.test_framework@11.0.0-SNAPSHOT/org.apache.lucene.tests.util.TestRuleIgnoreTestSuites$1.evaluate(TestRuleIgnoreTestSuites.java:47)
	at junit@4.13.2/org.junit.rules.RunRules.evaluate(RunRules.java:20)
	at randomizedtesting.runner@2.8.3/com.carrotsearch.randomizedtesting.rules.StatementAdapter.evaluate(StatementAdapter.java:36)
	at randomizedtesting.runner@2.8.3/com.carrotsearch.randomizedtesting.ThreadLeakControl$StatementRunner.run(ThreadLeakControl.java:390)
	at randomizedtesting.runner@2.8.3/com.carrotsearch.randomizedtesting.ThreadLeakControl.lambda$forkTimeoutingTask$0(ThreadLeakControl.java:850)
	at java.base/java.lang.Thread.run(Thread.java:1474)


FAILED:  org.apache.lucene.backward_codecs.lucene87.TestLucene87StoredFieldsFormatMergeInstance.testMergeStability

Error Message:
java.lang.AssertionError: expected:<{fnm=77, fdt=79961, fdx=81, fdm=159}> but was:<{cfs=80340, cfe=150}>

Stack Trace:
java.lang.AssertionError: expected:<{fnm=77, fdt=79961, fdx=81, fdm=159}> but was:<{cfs=80340, cfe=150}>
	at __randomizedtesting.SeedInfo.seed([9268D9678FC9F149:E6249F488223F3FF]:0)
	at junit@4.13.2/org.junit.Assert.fail(Assert.java:89)
	at junit@4.13.2/org.junit.Assert.failNotEquals(Assert.java:835)
	at junit@4.13.2/org.junit.Assert.assertEquals(Assert.java:120)
	at junit@4.13.2/org.junit.Assert.assertEquals(Assert.java:146)
	at org.apache.lucene.test_framework@11.0.0-SNAPSHOT/org.apache.lucene.tests.index.BaseIndexFileFormatTestCase.testMergeStability(BaseIndexFileFormatTestCase.java:306)
	at java.base/jdk.internal.reflect.DirectMethodHandleAccessor.invoke(DirectMethodHandleAccessor.java:104)
	at java.base/java.lang.reflect.Method.invoke(Method.java:565)
	at randomizedtesting.runner@2.8.3/com.carrotsearch.randomizedtesting.RandomizedRunner.invoke(RandomizedRunner.java:1763)
	at randomizedtesting.runner@2.8.3/com.carrotsearch.randomizedtesting.RandomizedRunner$8.evaluate(RandomizedRunner.java:946)
	at randomizedtesting.runner@2.8.3/com.carrotsearch.randomizedtesting.RandomizedRunner$9.evaluate(RandomizedRunner.java:982)
	at randomizedtesting.runner@2.8.3/com.carrotsearch.randomizedtesting.RandomizedRunner$10.evaluate(RandomizedRunner.java:996)
	at org.apache.lucene.test_framework@11.0.0-SNAPSHOT/org.apache.lucene.tests.util.TestRuleSetupTeardownChained$1.evaluate(TestRuleSetupTeardownChained.java:48)
	at org.apache.lucene.test_framework@11.0.0-SNAPSHOT/org.apache.lucene.tests.util.AbstractBeforeAfterRule$1.evaluate(AbstractBeforeAfterRule.java:43)
	at org.apache.lucene.test_framework@11.0.0-SNAPSHOT/org.apache.lucene.tests.util.TestRuleThreadAndTestName$1.evaluate(TestRuleThreadAndTestName.java:45)
	at org.apache.lucene.test_framework@11.0.0-SNAPSHOT/org.apache.lucene.tests.util.TestRuleIgnoreAfterMaxFailures$1.evaluate(TestRuleIgnoreAfterMaxFailures.java:60)
	at org.apache.lucene.test_framework@11.0.0-SNAPSHOT/org.apache.lucene.tests.util.TestRuleMarkFailure$1.evaluate(TestRuleMarkFailure.java:44)
	at junit@4.13.2/org.junit.rules.RunRules.evaluate(RunRules.java:20)
	at randomizedtesting.runner@2.8.3/com.carrotsearch.randomizedtesting.rules.StatementAdapter.evaluate(StatementAdapter.java:36)
	at randomizedtesting.runner@2.8.3/com.carrotsearch.randomizedtesting.ThreadLeakControl$StatementRunner.run(ThreadLeakControl.java:390)
	at randomizedtesting.runner@2.8.3/com.carrotsearch.randomizedtesting.ThreadLeakControl.forkTimeoutingTask(ThreadLeakControl.java:843)
	at randomizedtesting.runner@2.8.3/com.carrotsearch.randomizedtesting.ThreadLeakControl$3.evaluate(ThreadLeakControl.java:490)
	at randomizedtesting.runner@2.8.3/com.carrotsearch.randomizedtesting.RandomizedRunner.runSingleTest(RandomizedRunner.java:955)
	at randomizedtesting.runner@2.8.3/com.carrotsearch.randomizedtesting.RandomizedRunner$5.evaluate(RandomizedRunner.java:840)
	at randomizedtesting.runner@2.8.3/com.carrotsearch.randomizedtesting.RandomizedRunner$6.evaluate(RandomizedRunner.java:891)
	at randomizedtesting.runner@2.8.3/com.carrotsearch.randomizedtesting.RandomizedRunner$7.evaluate(RandomizedRunner.java:902)
	at org.apache.lucene.test_framework@11.0.0-SNAPSHOT/org.apache.lucene.tests.util.AbstractBeforeAfterRule$1.evaluate(AbstractBeforeAfterRule.java:43)
	at randomizedtesting.runner@2.8.3/com.carrotsearch.randomizedtesting.rules.StatementAdapter.evaluate(StatementAdapter.java:36)
	at org.apache.lucene.test_framework@11.0.0-SNAPSHOT/org.apache.lucene.tests.util.TestRuleStoreClassName$1.evaluate(TestRuleStoreClassName.java:38)
	at randomizedtesting.runner@2.8.3/com.carrotsearch.randomizedtesting.rules.NoShadowingOrOverridesOnMethodsRule$1.evaluate(NoShadowingOrOverridesOnMethodsRule.java:40)
	at randomizedtesting.runner@2.8.3/com.carrotsearch.randomizedtesting.rules.NoShadowingOrOverridesOnMethodsRule$1.evaluate(NoShadowingOrOverridesOnMethodsRule.java:40)
	at randomizedtesting.runner@2.8.3/com.carrotsearch.randomizedtesting.rules.StatementAdapter.evaluate(StatementAdapter.java:36)
	at randomizedtesting.runner@2.8.3/com.carrotsearch.randomizedtesting.rules.StatementAdapter.evaluate(StatementAdapter.java:36)
	at org.apache.lucene.test_framework@11.0.0-SNAPSHOT/org.apache.lucene.tests.util.TestRuleAssertionsRequired$1.evaluate(TestRuleAssertionsRequired.java:52)
	at org.apache.lucene.test_framework@11.0.0-SNAPSHOT/org.apache.lucene.tests.util.AbstractBeforeAfterRule$1.evaluate(AbstractBeforeAfterRule.java:43)
	at org.apache.lucene.test_framework@11.0.0-SNAPSHOT/org.apache.lucene.tests.util.TestRuleMarkFailure$1.evaluate(TestRuleMarkFailure.java:44)
	at org.apache.lucene.test_framework@11.0.0-SNAPSHOT/org.apache.lucene.tests.util.TestRuleIgnoreAfterMaxFailures$1.evaluate(TestRuleIgnoreAfterMaxFailures.java:60)
	at org.apache.lucene.test_framework@11.0.0-SNAPSHOT/org.apache.lucene.tests.util.TestRuleIgnoreTestSuites$1.evaluate(TestRuleIgnoreTestSuites.java:47)
	at junit@4.13.2/org.junit.rules.RunRules.evaluate(RunRules.java:20)
	at randomizedtesting.runner@2.8.3/com.carrotsearch.randomizedtesting.rules.StatementAdapter.evaluate(StatementAdapter.java:36)
	at randomizedtesting.runner@2.8.3/com.carrotsearch.randomizedtesting.ThreadLeakControl$StatementRunner.run(ThreadLeakControl.java:390)
	at randomizedtesting.runner@2.8.3/com.carrotsearch.randomizedtesting.ThreadLeakControl.lambda$forkTimeoutingTask$0(ThreadLeakControl.java:850)
	at java.base/java.lang.Thread.run(Thread.java:1474)




Build Log:
[...truncated 1673 lines...]
ERROR: 10 10 tests have failed:

  - org.apache.lucene.backward_codecs.lucene50.TestLucene50StoredFieldsFormatHighCompression.testMergeStability (:lucene:backward-codecs)
    Test output: /home/jenkins/jenkins-agent/workspace/Lucene/Lucene-NightlyTests-main/checkout/lucene/backward-codecs/build/test-results/test/outputs/OUTPUT-org.apache.lucene.backward_codecs.lucene50.TestLucene50StoredFieldsFormatHighCompression.txt
    Reproduce with: gradlew :lucene:backward-codecs:test --tests "org.apache.lucene.backward_codecs.lucene50.TestLucene50StoredFieldsFormatHighCompression.testMergeStability" -Ptests.asserts=true -Ptests.file.encoding=ISO-8859-1 -Ptests.gui=true -Ptests.haltonfailure=false -Ptests.jvmargs= -Ptests.jvms=4 -Ptests.linedocsfile=/home/jenkins/jenkins-agent/workspace/Lucene/Lucene-NightlyTests-main/test-data/enwiki.random.lines.txt -Ptests.multiplier=2 -Ptests.nightly=true -Ptests.seed=9268D9678FC9F149 -Ptests.vectorsize=128

  - org.apache.lucene.backward_codecs.lucene50.TestLucene50StoredFieldsFormat.testMergeStability (:lucene:backward-codecs)
    Test output: /home/jenkins/jenkins-agent/workspace/Lucene/Lucene-NightlyTests-main/checkout/lucene/backward-codecs/build/test-results/test/outputs/OUTPUT-org.apache.lucene.backward_codecs.lucene50.TestLucene50StoredFieldsFormat.txt
    Reproduce with: gradlew :lucene:backward-codecs:test --tests "org.apache.lucene.backward_codecs.lucene50.TestLucene50StoredFieldsFormat.testMergeStability" -Ptests.asserts=true -Ptests.file.encoding=ISO-8859-1 -Ptests.gui=true -Ptests.haltonfailure=false -Ptests.jvmargs= -Ptests.jvms=4 -Ptests.linedocsfile=/home/jenkins/jenkins-agent/workspace/Lucene/Lucene-NightlyTests-main/test-data/enwiki.random.lines.txt -Ptests.multiplier=2 -Ptests.nightly=true -Ptests.seed=9268D9678FC9F149 -Ptests.vectorsize=128

  - org.apache.lucene.backward_codecs.lucene50.TestLucene50StoredFieldsFormatMergeInstance.testMergeStability (:lucene:backward-codecs)
    Test output: /home/jenkins/jenkins-agent/workspace/Lucene/Lucene-NightlyTests-main/checkout/lucene/backward-codecs/build/test-results/test/outputs/OUTPUT-org.apache.lucene.backward_codecs.lucene50.TestLucene50StoredFieldsFormatMergeInstance.txt
    Reproduce with: gradlew :lucene:backward-codecs:test --tests "org.apache.lucene.backward_codecs.lucene50.TestLucene50StoredFieldsFormatMergeInstance.testMergeStability" -Ptests.asserts=true -Ptests.file.encoding=ISO-8859-1 -Ptests.gui=true -Ptests.haltonfailure=false -Ptests.jvmargs= -Ptests.jvms=4 -Ptests.linedocsfile=/home/jenkins/jenkins-agent/workspace/Lucene/Lucene-NightlyTests-main/test-data/enwiki.random.lines.txt -Ptests.multiplier=2 -Ptests.nightly=true -Ptests.seed=9268D9678FC9F149 -Ptests.vectorsize=128

  - org.apache.lucene.backward_codecs.lucene60.TestLucene60FieldInfosFormat.testMergeStability (:lucene:backward-codecs)
    Test output: /home/jenkins/jenkins-agent/workspace/Lucene/Lucene-NightlyTests-main/checkout/lucene/backward-codecs/build/test-results/test/outputs/OUTPUT-org.apache.lucene.backward_codecs.lucene60.TestLucene60FieldInfosFormat.txt
    Reproduce with: gradlew :lucene:backward-codecs:test --tests "org.apache.lucene.backward_codecs.lucene60.TestLucene60FieldInfosFormat.testMergeStability" -Ptests.asserts=true -Ptests.file.encoding=ISO-8859-1 -Ptests.gui=true -Ptests.haltonfailure=false -Ptests.jvmargs= -Ptests.jvms=4 -Ptests.linedocsfile=/home/jenkins/jenkins-agent/workspace/Lucene/Lucene-NightlyTests-main/test-data/enwiki.random.lines.txt -Ptests.multiplier=2 -Ptests.nightly=true -Ptests.seed=9268D9678FC9F149 -Ptests.vectorsize=128

  - org.apache.lucene.backward_codecs.lucene87.TestLucene87StoredFieldsFormatHighCompression.testMergeStability (:lucene:backward-codecs)
    Test output: /home/jenkins/jenkins-agent/workspace/Lucene/Lucene-NightlyTests-main/checkout/lucene/backward-codecs/build/test-results/test/outputs/OUTPUT-org.apache.lucene.backward_codecs.lucene87.TestLucene87StoredFieldsFormatHighCompression.txt
    Reproduce with: gradlew :lucene:backward-codecs:test --tests "org.apache.lucene.backward_codecs.lucene87.TestLucene87StoredFieldsFormatHighCompression.testMergeStability" -Ptests.asserts=true -Ptests.file.encoding=ISO-8859-1 -Ptests.gui=true -Ptests.haltonfailure=false -Ptests.jvmargs= -Ptests.jvms=4 -Ptests.linedocsfile=/home/jenkins/jenkins-agent/workspace/Lucene/Lucene-NightlyTests-main/test-data/enwiki.random.lines.txt -Ptests.multiplier=2 -Ptests.nightly=true -Ptests.seed=9268D9678FC9F149 -Ptests.vectorsize=128

  - org.apache.lucene.backward_codecs.lucene86.TestLucene86SegmentInfoFormat.testMergeStability (:lucene:backward-codecs)
    Test output: /home/jenkins/jenkins-agent/workspace/Lucene/Lucene-NightlyTests-main/checkout/lucene/backward-codecs/build/test-results/test/outputs/OUTPUT-org.apache.lucene.backward_codecs.lucene86.TestLucene86SegmentInfoFormat.txt
    Reproduce with: gradlew :lucene:backward-codecs:test --tests "org.apache.lucene.backward_codecs.lucene86.TestLucene86SegmentInfoFormat.testMergeStability" -Ptests.asserts=true -Ptests.file.encoding=ISO-8859-1 -Ptests.gui=true -Ptests.haltonfailure=false -Ptests.jvmargs= -Ptests.jvms=4 -Ptests.linedocsfile=/home/jenkins/jenkins-agent/workspace/Lucene/Lucene-NightlyTests-main/test-data/enwiki.random.lines.txt -Ptests.multiplier=2 -Ptests.nightly=true -Ptests.seed=9268D9678FC9F149 -Ptests.vectorsize=128

  - org.apache.lucene.backward_codecs.lucene70.TestLucene70SegmentInfoFormat.testMergeStability (:lucene:backward-codecs)
    Test output: /home/jenkins/jenkins-agent/workspace/Lucene/Lucene-NightlyTests-main/checkout/lucene/backward-codecs/build/test-results/test/outputs/OUTPUT-org.apache.lucene.backward_codecs.lucene70.TestLucene70SegmentInfoFormat.txt
    Reproduce with: gradlew :lucene:backward-codecs:test --tests "org.apache.lucene.backward_codecs.lucene70.TestLucene70SegmentInfoFormat.testMergeStability" -Ptests.asserts=true -Ptests.file.encoding=ISO-8859-1 -Ptests.gui=true -Ptests.haltonfailure=false -Ptests.jvmargs= -Ptests.jvms=4 -Ptests.linedocsfile=/home/jenkins/jenkins-agent/workspace/Lucene/Lucene-NightlyTests-main/test-data/enwiki.random.lines.txt -Ptests.multiplier=2 -Ptests.nightly=true -Ptests.seed=9268D9678FC9F149 -Ptests.vectorsize=128

  - org.apache.lucene.backward_codecs.lucene87.TestLucene87StoredFieldsFormatMergeInstance.testMergeStability (:lucene:backward-codecs)
    Test output: /home/jenkins/jenkins-agent/workspace/Lucene/Lucene-NightlyTests-main/checkout/lucene/backward-codecs/build/test-results/test/outputs/OUTPUT-org.apache.lucene.backward_codecs.lucene87.TestLucene87StoredFieldsFormatMergeInstance.txt
    Reproduce with: gradlew :lucene:backward-codecs:test --tests "org.apache.lucene.backward_codecs.lucene87.TestLucene87StoredFieldsFormatMergeInstance.testMergeStability" -Ptests.asserts=true -Ptests.file.encoding=ISO-8859-1 -Ptests.gui=true -Ptests.haltonfailure=false -Ptests.jvmargs= -Ptests.jvms=4 -Ptests.linedocsfile=/home/jenkins/jenkins-agent/workspace/Lucene/Lucene-NightlyTests-main/test-data/enwiki.random.lines.txt -Ptests.multiplier=2 -Ptests.nightly=true -Ptests.seed=9268D9678FC9F149 -Ptests.vectorsize=128

  - org.apache.lucene.backward_codecs.lucene50.TestLucene50TermVectorsFormat.testMergeStability (:lucene:backward-codecs)
    Test output: /home/jenkins/jenkins-agent/workspace/Lucene/Lucene-NightlyTests-main/checkout/lucene/backward-codecs/build/test-results/test/outputs/OUTPUT-org.apache.lucene.backward_codecs.lucene50.TestLucene50TermVectorsFormat.txt
    Reproduce with: gradlew :lucene:backward-codecs:test --tests "org.apache.lucene.backward_codecs.lucene50.TestLucene50TermVectorsFormat.testMergeStability" -Ptests.asserts=true -Ptests.file.encoding=ISO-8859-1 -Ptests.gui=true -Ptests.haltonfailure=false -Ptests.jvmargs= -Ptests.jvms=4 -Ptests.linedocsfile=/home/jenkins/jenkins-agent/workspace/Lucene/Lucene-NightlyTests-main/test-data/enwiki.random.lines.txt -Ptests.multiplier=2 -Ptests.nightly=true -Ptests.seed=9268D9678FC9F149 -Ptests.vectorsize=128

  - org.apache.lucene.backward_codecs.lucene87.TestLucene87StoredFieldsFormat.testMergeStability (:lucene:backward-codecs)
    Test output: /home/jenkins/jenkins-agent/workspace/Lucene/Lucene-NightlyTests-main/checkout/lucene/backward-codecs/build/test-results/test/outputs/OUTPUT-org.apache.lucene.backward_codecs.lucene87.TestLucene87StoredFieldsFormat.txt
    Reproduce with: gradlew :lucene:backward-codecs:test --tests "org.apache.lucene.backward_codecs.lucene87.TestLucene87StoredFieldsFormat.testMergeStability" -Ptests.asserts=true -Ptests.file.encoding=ISO-8859-1 -Ptests.gui=true -Ptests.haltonfailure=false -Ptests.jvmargs= -Ptests.jvms=4 -Ptests.linedocsfile=/home/jenkins/jenkins-agent/workspace/Lucene/Lucene-NightlyTests-main/test-data/enwiki.random.lines.txt -Ptests.multiplier=2 -Ptests.nightly=true -Ptests.seed=9268D9678FC9F149 -Ptests.vectorsize=128

The slowest tests during this run:
  543.92s TestIDVersionPostingsFormat.testGlobalVersions (:lucene:sandbox)
  471.91s TestStressNRTReplication.test (:lucene:replicator)
  443.45s Test2BPostings.test (:lucene:core)
  393.47s TestSimpleTextPostingsFormat.testDocsAndFreqsAndPositionsAndOffsetsAndPayloads (:lucene:codecs)
  228.97s TestSortedDvMultiRangeQuery.testDuelWithStandardDisjunction (:lucene:sandbox)
  219.39s TestIndexWriterOnDiskFull.testAddIndexOnDiskFull (:lucene:core)
  210.29s TestIndexWriterExceptions.testTooManyTokens (:lucene:core)
  184.34s TestNRTThreads.testNRTThreads (:lucene:core)
  180.59s TestSimpleTextPostingsFormat.testDocsAndFreqsAndPositionsAndOffsets (:lucene:codecs)
  176.50s TestSimpleTextPostingsFormat.testLineFileDocs (:lucene:codecs)
The slowest suites during this run:
  995.45s TestSimpleTextPostingsFormat (:lucene:codecs)
  545.36s TestIDVersionPostingsFormat (:lucene:sandbox)
  472.26s TestStressNRTReplication (:lucene:replicator)
  443.46s Test2BPostings (:lucene:core)
  355.84s TestLucene90DocValuesFormat (:lucene:core)
  350.80s TestLucene90DocValuesFormatMergeInstance (:lucene:core)
  283.56s TestBestCompressionLucene80DocValuesFormat (:lucene:backward-codecs)
  248.95s TestIndexWriterExceptions (:lucene:core)
  243.31s TestBestSpeedLucene80DocValuesFormat (:lucene:backward-codecs)
  229.09s TestSortedDvMultiRangeQuery (:lucene:sandbox)

[Incubating] Problems report is available at: file:///home/jenkins/jenkins-agent/workspace/Lucene/Lucene-NightlyTests-main/checkout/build/reports/problems/problems-report.html

BUILD SUCCESSFUL in 1h 30m 13s
294 actionable tasks: 149 executed, 145 up-to-date
Consider enabling configuration cache to speed up this build: https://docs.gradle.org/9.2.1/userguide/configuration_cache_enabling.html
Build step 'Invoke Gradle script' changed build result to SUCCESS
Archiving artifacts
‘**/build*/**/tests-cwd/*.hprof’ doesn’t match anything: ‘**’ exists but not ‘**/build*/**/tests-cwd/*.hprof’
No artifacts found that match the file pattern "**/build*/**/tests-cwd/*.hprof,**/*_pid*.log". Configuration error?
Recording test results
[Checks API] No suitable checks publisher found.
Build step 'Publish JUnit test result report' changed build result to UNSTABLE
Email was triggered for: Unstable (Test Failures)
Sending email for trigger: Unstable (Test Failures)

[JENKINS] Lucene » Lucene-NightlyTests-main - Build # 1904 - Still Unstable!

Posted by Apache Jenkins Server <je...@builds.apache.org>.
Build: https://ci-builds.apache.org/job/Lucene/job/Lucene-NightlyTests-main/1904/

10 tests failed.
FAILED:  org.apache.lucene.backward_codecs.lucene50.TestLucene50StoredFieldsFormat.testMergeStability

Error Message:
java.lang.AssertionError: expected:<{fnm=77, fdt=62228, fdx=95, fdm=158}> but was:<{cfs=62620, cfe=150}>

Stack Trace:
java.lang.AssertionError: expected:<{fnm=77, fdt=62228, fdx=95, fdm=158}> but was:<{cfs=62620, cfe=150}>
	at __randomizedtesting.SeedInfo.seed([6287B65127EA652:72643D4A1F94A4E4]:0)
	at junit@4.13.2/org.junit.Assert.fail(Assert.java:89)
	at junit@4.13.2/org.junit.Assert.failNotEquals(Assert.java:835)
	at junit@4.13.2/org.junit.Assert.assertEquals(Assert.java:120)
	at junit@4.13.2/org.junit.Assert.assertEquals(Assert.java:146)
	at org.apache.lucene.test_framework@11.0.0-SNAPSHOT/org.apache.lucene.tests.index.BaseIndexFileFormatTestCase.testMergeStability(BaseIndexFileFormatTestCase.java:306)
	at java.base/jdk.internal.reflect.DirectMethodHandleAccessor.invoke(DirectMethodHandleAccessor.java:104)
	at java.base/java.lang.reflect.Method.invoke(Method.java:565)
	at randomizedtesting.runner@2.8.3/com.carrotsearch.randomizedtesting.RandomizedRunner.invoke(RandomizedRunner.java:1763)
	at randomizedtesting.runner@2.8.3/com.carrotsearch.randomizedtesting.RandomizedRunner$8.evaluate(RandomizedRunner.java:946)
	at randomizedtesting.runner@2.8.3/com.carrotsearch.randomizedtesting.RandomizedRunner$9.evaluate(RandomizedRunner.java:982)
	at randomizedtesting.runner@2.8.3/com.carrotsearch.randomizedtesting.RandomizedRunner$10.evaluate(RandomizedRunner.java:996)
	at org.apache.lucene.test_framework@11.0.0-SNAPSHOT/org.apache.lucene.tests.util.TestRuleSetupTeardownChained$1.evaluate(TestRuleSetupTeardownChained.java:48)
	at org.apache.lucene.test_framework@11.0.0-SNAPSHOT/org.apache.lucene.tests.util.AbstractBeforeAfterRule$1.evaluate(AbstractBeforeAfterRule.java:43)
	at org.apache.lucene.test_framework@11.0.0-SNAPSHOT/org.apache.lucene.tests.util.TestRuleThreadAndTestName$1.evaluate(TestRuleThreadAndTestName.java:45)
	at org.apache.lucene.test_framework@11.0.0-SNAPSHOT/org.apache.lucene.tests.util.TestRuleIgnoreAfterMaxFailures$1.evaluate(TestRuleIgnoreAfterMaxFailures.java:60)
	at org.apache.lucene.test_framework@11.0.0-SNAPSHOT/org.apache.lucene.tests.util.TestRuleMarkFailure$1.evaluate(TestRuleMarkFailure.java:44)
	at junit@4.13.2/org.junit.rules.RunRules.evaluate(RunRules.java:20)
	at randomizedtesting.runner@2.8.3/com.carrotsearch.randomizedtesting.rules.StatementAdapter.evaluate(StatementAdapter.java:36)
	at randomizedtesting.runner@2.8.3/com.carrotsearch.randomizedtesting.ThreadLeakControl$StatementRunner.run(ThreadLeakControl.java:390)
	at randomizedtesting.runner@2.8.3/com.carrotsearch.randomizedtesting.ThreadLeakControl.forkTimeoutingTask(ThreadLeakControl.java:843)
	at randomizedtesting.runner@2.8.3/com.carrotsearch.randomizedtesting.ThreadLeakControl$3.evaluate(ThreadLeakControl.java:490)
	at randomizedtesting.runner@2.8.3/com.carrotsearch.randomizedtesting.RandomizedRunner.runSingleTest(RandomizedRunner.java:955)
	at randomizedtesting.runner@2.8.3/com.carrotsearch.randomizedtesting.RandomizedRunner$5.evaluate(RandomizedRunner.java:840)
	at randomizedtesting.runner@2.8.3/com.carrotsearch.randomizedtesting.RandomizedRunner$6.evaluate(RandomizedRunner.java:891)
	at randomizedtesting.runner@2.8.3/com.carrotsearch.randomizedtesting.RandomizedRunner$7.evaluate(RandomizedRunner.java:902)
	at org.apache.lucene.test_framework@11.0.0-SNAPSHOT/org.apache.lucene.tests.util.AbstractBeforeAfterRule$1.evaluate(AbstractBeforeAfterRule.java:43)
	at randomizedtesting.runner@2.8.3/com.carrotsearch.randomizedtesting.rules.StatementAdapter.evaluate(StatementAdapter.java:36)
	at org.apache.lucene.test_framework@11.0.0-SNAPSHOT/org.apache.lucene.tests.util.TestRuleStoreClassName$1.evaluate(TestRuleStoreClassName.java:38)
	at randomizedtesting.runner@2.8.3/com.carrotsearch.randomizedtesting.rules.NoShadowingOrOverridesOnMethodsRule$1.evaluate(NoShadowingOrOverridesOnMethodsRule.java:40)
	at randomizedtesting.runner@2.8.3/com.carrotsearch.randomizedtesting.rules.NoShadowingOrOverridesOnMethodsRule$1.evaluate(NoShadowingOrOverridesOnMethodsRule.java:40)
	at randomizedtesting.runner@2.8.3/com.carrotsearch.randomizedtesting.rules.StatementAdapter.evaluate(StatementAdapter.java:36)
	at randomizedtesting.runner@2.8.3/com.carrotsearch.randomizedtesting.rules.StatementAdapter.evaluate(StatementAdapter.java:36)
	at org.apache.lucene.test_framework@11.0.0-SNAPSHOT/org.apache.lucene.tests.util.TestRuleAssertionsRequired$1.evaluate(TestRuleAssertionsRequired.java:52)
	at org.apache.lucene.test_framework@11.0.0-SNAPSHOT/org.apache.lucene.tests.util.AbstractBeforeAfterRule$1.evaluate(AbstractBeforeAfterRule.java:43)
	at org.apache.lucene.test_framework@11.0.0-SNAPSHOT/org.apache.lucene.tests.util.TestRuleMarkFailure$1.evaluate(TestRuleMarkFailure.java:44)
	at org.apache.lucene.test_framework@11.0.0-SNAPSHOT/org.apache.lucene.tests.util.TestRuleIgnoreAfterMaxFailures$1.evaluate(TestRuleIgnoreAfterMaxFailures.java:60)
	at org.apache.lucene.test_framework@11.0.0-SNAPSHOT/org.apache.lucene.tests.util.TestRuleIgnoreTestSuites$1.evaluate(TestRuleIgnoreTestSuites.java:47)
	at junit@4.13.2/org.junit.rules.RunRules.evaluate(RunRules.java:20)
	at randomizedtesting.runner@2.8.3/com.carrotsearch.randomizedtesting.rules.StatementAdapter.evaluate(StatementAdapter.java:36)
	at randomizedtesting.runner@2.8.3/com.carrotsearch.randomizedtesting.ThreadLeakControl$StatementRunner.run(ThreadLeakControl.java:390)
	at randomizedtesting.runner@2.8.3/com.carrotsearch.randomizedtesting.ThreadLeakControl.lambda$forkTimeoutingTask$0(ThreadLeakControl.java:850)
	at java.base/java.lang.Thread.run(Thread.java:1474)


FAILED:  org.apache.lucene.backward_codecs.lucene50.TestLucene50StoredFieldsFormatHighCompression.testMergeStability

Error Message:
java.lang.AssertionError: expected:<{fnm=77, fdt=40988, fdx=84, fdm=158}> but was:<{cfs=41369, cfe=150}>

Stack Trace:
java.lang.AssertionError: expected:<{fnm=77, fdt=40988, fdx=84, fdm=158}> but was:<{cfs=41369, cfe=150}>
	at __randomizedtesting.SeedInfo.seed([6287B65127EA652:72643D4A1F94A4E4]:0)
	at junit@4.13.2/org.junit.Assert.fail(Assert.java:89)
	at junit@4.13.2/org.junit.Assert.failNotEquals(Assert.java:835)
	at junit@4.13.2/org.junit.Assert.assertEquals(Assert.java:120)
	at junit@4.13.2/org.junit.Assert.assertEquals(Assert.java:146)
	at org.apache.lucene.test_framework@11.0.0-SNAPSHOT/org.apache.lucene.tests.index.BaseIndexFileFormatTestCase.testMergeStability(BaseIndexFileFormatTestCase.java:306)
	at java.base/jdk.internal.reflect.DirectMethodHandleAccessor.invoke(DirectMethodHandleAccessor.java:104)
	at java.base/java.lang.reflect.Method.invoke(Method.java:565)
	at randomizedtesting.runner@2.8.3/com.carrotsearch.randomizedtesting.RandomizedRunner.invoke(RandomizedRunner.java:1763)
	at randomizedtesting.runner@2.8.3/com.carrotsearch.randomizedtesting.RandomizedRunner$8.evaluate(RandomizedRunner.java:946)
	at randomizedtesting.runner@2.8.3/com.carrotsearch.randomizedtesting.RandomizedRunner$9.evaluate(RandomizedRunner.java:982)
	at randomizedtesting.runner@2.8.3/com.carrotsearch.randomizedtesting.RandomizedRunner$10.evaluate(RandomizedRunner.java:996)
	at org.apache.lucene.test_framework@11.0.0-SNAPSHOT/org.apache.lucene.tests.util.TestRuleSetupTeardownChained$1.evaluate(TestRuleSetupTeardownChained.java:48)
	at org.apache.lucene.test_framework@11.0.0-SNAPSHOT/org.apache.lucene.tests.util.AbstractBeforeAfterRule$1.evaluate(AbstractBeforeAfterRule.java:43)
	at org.apache.lucene.test_framework@11.0.0-SNAPSHOT/org.apache.lucene.tests.util.TestRuleThreadAndTestName$1.evaluate(TestRuleThreadAndTestName.java:45)
	at org.apache.lucene.test_framework@11.0.0-SNAPSHOT/org.apache.lucene.tests.util.TestRuleIgnoreAfterMaxFailures$1.evaluate(TestRuleIgnoreAfterMaxFailures.java:60)
	at org.apache.lucene.test_framework@11.0.0-SNAPSHOT/org.apache.lucene.tests.util.TestRuleMarkFailure$1.evaluate(TestRuleMarkFailure.java:44)
	at junit@4.13.2/org.junit.rules.RunRules.evaluate(RunRules.java:20)
	at randomizedtesting.runner@2.8.3/com.carrotsearch.randomizedtesting.rules.StatementAdapter.evaluate(StatementAdapter.java:36)
	at randomizedtesting.runner@2.8.3/com.carrotsearch.randomizedtesting.ThreadLeakControl$StatementRunner.run(ThreadLeakControl.java:390)
	at randomizedtesting.runner@2.8.3/com.carrotsearch.randomizedtesting.ThreadLeakControl.forkTimeoutingTask(ThreadLeakControl.java:843)
	at randomizedtesting.runner@2.8.3/com.carrotsearch.randomizedtesting.ThreadLeakControl$3.evaluate(ThreadLeakControl.java:490)
	at randomizedtesting.runner@2.8.3/com.carrotsearch.randomizedtesting.RandomizedRunner.runSingleTest(RandomizedRunner.java:955)
	at randomizedtesting.runner@2.8.3/com.carrotsearch.randomizedtesting.RandomizedRunner$5.evaluate(RandomizedRunner.java:840)
	at randomizedtesting.runner@2.8.3/com.carrotsearch.randomizedtesting.RandomizedRunner$6.evaluate(RandomizedRunner.java:891)
	at randomizedtesting.runner@2.8.3/com.carrotsearch.randomizedtesting.RandomizedRunner$7.evaluate(RandomizedRunner.java:902)
	at org.apache.lucene.test_framework@11.0.0-SNAPSHOT/org.apache.lucene.tests.util.AbstractBeforeAfterRule$1.evaluate(AbstractBeforeAfterRule.java:43)
	at randomizedtesting.runner@2.8.3/com.carrotsearch.randomizedtesting.rules.StatementAdapter.evaluate(StatementAdapter.java:36)
	at org.apache.lucene.test_framework@11.0.0-SNAPSHOT/org.apache.lucene.tests.util.TestRuleStoreClassName$1.evaluate(TestRuleStoreClassName.java:38)
	at randomizedtesting.runner@2.8.3/com.carrotsearch.randomizedtesting.rules.NoShadowingOrOverridesOnMethodsRule$1.evaluate(NoShadowingOrOverridesOnMethodsRule.java:40)
	at randomizedtesting.runner@2.8.3/com.carrotsearch.randomizedtesting.rules.NoShadowingOrOverridesOnMethodsRule$1.evaluate(NoShadowingOrOverridesOnMethodsRule.java:40)
	at randomizedtesting.runner@2.8.3/com.carrotsearch.randomizedtesting.rules.StatementAdapter.evaluate(StatementAdapter.java:36)
	at randomizedtesting.runner@2.8.3/com.carrotsearch.randomizedtesting.rules.StatementAdapter.evaluate(StatementAdapter.java:36)
	at org.apache.lucene.test_framework@11.0.0-SNAPSHOT/org.apache.lucene.tests.util.TestRuleAssertionsRequired$1.evaluate(TestRuleAssertionsRequired.java:52)
	at org.apache.lucene.test_framework@11.0.0-SNAPSHOT/org.apache.lucene.tests.util.AbstractBeforeAfterRule$1.evaluate(AbstractBeforeAfterRule.java:43)
	at org.apache.lucene.test_framework@11.0.0-SNAPSHOT/org.apache.lucene.tests.util.TestRuleMarkFailure$1.evaluate(TestRuleMarkFailure.java:44)
	at org.apache.lucene.test_framework@11.0.0-SNAPSHOT/org.apache.lucene.tests.util.TestRuleIgnoreAfterMaxFailures$1.evaluate(TestRuleIgnoreAfterMaxFailures.java:60)
	at org.apache.lucene.test_framework@11.0.0-SNAPSHOT/org.apache.lucene.tests.util.TestRuleIgnoreTestSuites$1.evaluate(TestRuleIgnoreTestSuites.java:47)
	at junit@4.13.2/org.junit.rules.RunRules.evaluate(RunRules.java:20)
	at randomizedtesting.runner@2.8.3/com.carrotsearch.randomizedtesting.rules.StatementAdapter.evaluate(StatementAdapter.java:36)
	at randomizedtesting.runner@2.8.3/com.carrotsearch.randomizedtesting.ThreadLeakControl$StatementRunner.run(ThreadLeakControl.java:390)
	at randomizedtesting.runner@2.8.3/com.carrotsearch.randomizedtesting.ThreadLeakControl.lambda$forkTimeoutingTask$0(ThreadLeakControl.java:850)
	at java.base/java.lang.Thread.run(Thread.java:1474)


FAILED:  org.apache.lucene.backward_codecs.lucene50.TestLucene50StoredFieldsFormatMergeInstance.testMergeStability

Error Message:
java.lang.AssertionError: expected:<{fnm=77, fdt=62228, fdx=95, fdm=158}> but was:<{cfs=62620, cfe=150}>

Stack Trace:
java.lang.AssertionError: expected:<{fnm=77, fdt=62228, fdx=95, fdm=158}> but was:<{cfs=62620, cfe=150}>
	at __randomizedtesting.SeedInfo.seed([6287B65127EA652:72643D4A1F94A4E4]:0)
	at junit@4.13.2/org.junit.Assert.fail(Assert.java:89)
	at junit@4.13.2/org.junit.Assert.failNotEquals(Assert.java:835)
	at junit@4.13.2/org.junit.Assert.assertEquals(Assert.java:120)
	at junit@4.13.2/org.junit.Assert.assertEquals(Assert.java:146)
	at org.apache.lucene.test_framework@11.0.0-SNAPSHOT/org.apache.lucene.tests.index.BaseIndexFileFormatTestCase.testMergeStability(BaseIndexFileFormatTestCase.java:306)
	at java.base/jdk.internal.reflect.DirectMethodHandleAccessor.invoke(DirectMethodHandleAccessor.java:104)
	at java.base/java.lang.reflect.Method.invoke(Method.java:565)
	at randomizedtesting.runner@2.8.3/com.carrotsearch.randomizedtesting.RandomizedRunner.invoke(RandomizedRunner.java:1763)
	at randomizedtesting.runner@2.8.3/com.carrotsearch.randomizedtesting.RandomizedRunner$8.evaluate(RandomizedRunner.java:946)
	at randomizedtesting.runner@2.8.3/com.carrotsearch.randomizedtesting.RandomizedRunner$9.evaluate(RandomizedRunner.java:982)
	at randomizedtesting.runner@2.8.3/com.carrotsearch.randomizedtesting.RandomizedRunner$10.evaluate(RandomizedRunner.java:996)
	at org.apache.lucene.test_framework@11.0.0-SNAPSHOT/org.apache.lucene.tests.util.TestRuleSetupTeardownChained$1.evaluate(TestRuleSetupTeardownChained.java:48)
	at org.apache.lucene.test_framework@11.0.0-SNAPSHOT/org.apache.lucene.tests.util.AbstractBeforeAfterRule$1.evaluate(AbstractBeforeAfterRule.java:43)
	at org.apache.lucene.test_framework@11.0.0-SNAPSHOT/org.apache.lucene.tests.util.TestRuleThreadAndTestName$1.evaluate(TestRuleThreadAndTestName.java:45)
	at org.apache.lucene.test_framework@11.0.0-SNAPSHOT/org.apache.lucene.tests.util.TestRuleIgnoreAfterMaxFailures$1.evaluate(TestRuleIgnoreAfterMaxFailures.java:60)
	at org.apache.lucene.test_framework@11.0.0-SNAPSHOT/org.apache.lucene.tests.util.TestRuleMarkFailure$1.evaluate(TestRuleMarkFailure.java:44)
	at junit@4.13.2/org.junit.rules.RunRules.evaluate(RunRules.java:20)
	at randomizedtesting.runner@2.8.3/com.carrotsearch.randomizedtesting.rules.StatementAdapter.evaluate(StatementAdapter.java:36)
	at randomizedtesting.runner@2.8.3/com.carrotsearch.randomizedtesting.ThreadLeakControl$StatementRunner.run(ThreadLeakControl.java:390)
	at randomizedtesting.runner@2.8.3/com.carrotsearch.randomizedtesting.ThreadLeakControl.forkTimeoutingTask(ThreadLeakControl.java:843)
	at randomizedtesting.runner@2.8.3/com.carrotsearch.randomizedtesting.ThreadLeakControl$3.evaluate(ThreadLeakControl.java:490)
	at randomizedtesting.runner@2.8.3/com.carrotsearch.randomizedtesting.RandomizedRunner.runSingleTest(RandomizedRunner.java:955)
	at randomizedtesting.runner@2.8.3/com.carrotsearch.randomizedtesting.RandomizedRunner$5.evaluate(RandomizedRunner.java:840)
	at randomizedtesting.runner@2.8.3/com.carrotsearch.randomizedtesting.RandomizedRunner$6.evaluate(RandomizedRunner.java:891)
	at randomizedtesting.runner@2.8.3/com.carrotsearch.randomizedtesting.RandomizedRunner$7.evaluate(RandomizedRunner.java:902)
	at org.apache.lucene.test_framework@11.0.0-SNAPSHOT/org.apache.lucene.tests.util.AbstractBeforeAfterRule$1.evaluate(AbstractBeforeAfterRule.java:43)
	at randomizedtesting.runner@2.8.3/com.carrotsearch.randomizedtesting.rules.StatementAdapter.evaluate(StatementAdapter.java:36)
	at org.apache.lucene.test_framework@11.0.0-SNAPSHOT/org.apache.lucene.tests.util.TestRuleStoreClassName$1.evaluate(TestRuleStoreClassName.java:38)
	at randomizedtesting.runner@2.8.3/com.carrotsearch.randomizedtesting.rules.NoShadowingOrOverridesOnMethodsRule$1.evaluate(NoShadowingOrOverridesOnMethodsRule.java:40)
	at randomizedtesting.runner@2.8.3/com.carrotsearch.randomizedtesting.rules.NoShadowingOrOverridesOnMethodsRule$1.evaluate(NoShadowingOrOverridesOnMethodsRule.java:40)
	at randomizedtesting.runner@2.8.3/com.carrotsearch.randomizedtesting.rules.StatementAdapter.evaluate(StatementAdapter.java:36)
	at randomizedtesting.runner@2.8.3/com.carrotsearch.randomizedtesting.rules.StatementAdapter.evaluate(StatementAdapter.java:36)
	at org.apache.lucene.test_framework@11.0.0-SNAPSHOT/org.apache.lucene.tests.util.TestRuleAssertionsRequired$1.evaluate(TestRuleAssertionsRequired.java:52)
	at org.apache.lucene.test_framework@11.0.0-SNAPSHOT/org.apache.lucene.tests.util.AbstractBeforeAfterRule$1.evaluate(AbstractBeforeAfterRule.java:43)
	at org.apache.lucene.test_framework@11.0.0-SNAPSHOT/org.apache.lucene.tests.util.TestRuleMarkFailure$1.evaluate(TestRuleMarkFailure.java:44)
	at org.apache.lucene.test_framework@11.0.0-SNAPSHOT/org.apache.lucene.tests.util.TestRuleIgnoreAfterMaxFailures$1.evaluate(TestRuleIgnoreAfterMaxFailures.java:60)
	at org.apache.lucene.test_framework@11.0.0-SNAPSHOT/org.apache.lucene.tests.util.TestRuleIgnoreTestSuites$1.evaluate(TestRuleIgnoreTestSuites.java:47)
	at junit@4.13.2/org.junit.rules.RunRules.evaluate(RunRules.java:20)
	at randomizedtesting.runner@2.8.3/com.carrotsearch.randomizedtesting.rules.StatementAdapter.evaluate(StatementAdapter.java:36)
	at randomizedtesting.runner@2.8.3/com.carrotsearch.randomizedtesting.ThreadLeakControl$StatementRunner.run(ThreadLeakControl.java:390)
	at randomizedtesting.runner@2.8.3/com.carrotsearch.randomizedtesting.ThreadLeakControl.lambda$forkTimeoutingTask$0(ThreadLeakControl.java:850)
	at java.base/java.lang.Thread.run(Thread.java:1474)


FAILED:  org.apache.lucene.backward_codecs.lucene50.TestLucene50TermVectorsFormat.testMergeStability

Error Message:
java.lang.AssertionError: expected:<{tvd=24353, fnm=686, nvm=283, tvm=162, tmd=826, fdm=158, pos=9038, fdt=93, tvx=100, doc=10857, tim=20537, tip=83, fdx=72, nvd=16337}> but was:<{cfs=83647, cfe=415}>

Stack Trace:
java.lang.AssertionError: expected:<{tvd=24353, fnm=686, nvm=283, tvm=162, tmd=826, fdm=158, pos=9038, fdt=93, tvx=100, doc=10857, tim=20537, tip=83, fdx=72, nvd=16337}> but was:<{cfs=83647, cfe=415}>
	at __randomizedtesting.SeedInfo.seed([6287B65127EA652:72643D4A1F94A4E4]:0)
	at junit@4.13.2/org.junit.Assert.fail(Assert.java:89)
	at junit@4.13.2/org.junit.Assert.failNotEquals(Assert.java:835)
	at junit@4.13.2/org.junit.Assert.assertEquals(Assert.java:120)
	at junit@4.13.2/org.junit.Assert.assertEquals(Assert.java:146)
	at org.apache.lucene.test_framework@11.0.0-SNAPSHOT/org.apache.lucene.tests.index.BaseIndexFileFormatTestCase.testMergeStability(BaseIndexFileFormatTestCase.java:306)
	at java.base/jdk.internal.reflect.DirectMethodHandleAccessor.invoke(DirectMethodHandleAccessor.java:104)
	at java.base/java.lang.reflect.Method.invoke(Method.java:565)
	at randomizedtesting.runner@2.8.3/com.carrotsearch.randomizedtesting.RandomizedRunner.invoke(RandomizedRunner.java:1763)
	at randomizedtesting.runner@2.8.3/com.carrotsearch.randomizedtesting.RandomizedRunner$8.evaluate(RandomizedRunner.java:946)
	at randomizedtesting.runner@2.8.3/com.carrotsearch.randomizedtesting.RandomizedRunner$9.evaluate(RandomizedRunner.java:982)
	at randomizedtesting.runner@2.8.3/com.carrotsearch.randomizedtesting.RandomizedRunner$10.evaluate(RandomizedRunner.java:996)
	at org.apache.lucene.test_framework@11.0.0-SNAPSHOT/org.apache.lucene.tests.util.TestRuleSetupTeardownChained$1.evaluate(TestRuleSetupTeardownChained.java:48)
	at org.apache.lucene.test_framework@11.0.0-SNAPSHOT/org.apache.lucene.tests.util.AbstractBeforeAfterRule$1.evaluate(AbstractBeforeAfterRule.java:43)
	at org.apache.lucene.test_framework@11.0.0-SNAPSHOT/org.apache.lucene.tests.util.TestRuleThreadAndTestName$1.evaluate(TestRuleThreadAndTestName.java:45)
	at org.apache.lucene.test_framework@11.0.0-SNAPSHOT/org.apache.lucene.tests.util.TestRuleIgnoreAfterMaxFailures$1.evaluate(TestRuleIgnoreAfterMaxFailures.java:60)
	at org.apache.lucene.test_framework@11.0.0-SNAPSHOT/org.apache.lucene.tests.util.TestRuleMarkFailure$1.evaluate(TestRuleMarkFailure.java:44)
	at junit@4.13.2/org.junit.rules.RunRules.evaluate(RunRules.java:20)
	at randomizedtesting.runner@2.8.3/com.carrotsearch.randomizedtesting.rules.StatementAdapter.evaluate(StatementAdapter.java:36)
	at randomizedtesting.runner@2.8.3/com.carrotsearch.randomizedtesting.ThreadLeakControl$StatementRunner.run(ThreadLeakControl.java:390)
	at randomizedtesting.runner@2.8.3/com.carrotsearch.randomizedtesting.ThreadLeakControl.forkTimeoutingTask(ThreadLeakControl.java:843)
	at randomizedtesting.runner@2.8.3/com.carrotsearch.randomizedtesting.ThreadLeakControl$3.evaluate(ThreadLeakControl.java:490)
	at randomizedtesting.runner@2.8.3/com.carrotsearch.randomizedtesting.RandomizedRunner.runSingleTest(RandomizedRunner.java:955)
	at randomizedtesting.runner@2.8.3/com.carrotsearch.randomizedtesting.RandomizedRunner$5.evaluate(RandomizedRunner.java:840)
	at randomizedtesting.runner@2.8.3/com.carrotsearch.randomizedtesting.RandomizedRunner$6.evaluate(RandomizedRunner.java:891)
	at randomizedtesting.runner@2.8.3/com.carrotsearch.randomizedtesting.RandomizedRunner$7.evaluate(RandomizedRunner.java:902)
	at org.apache.lucene.test_framework@11.0.0-SNAPSHOT/org.apache.lucene.tests.util.AbstractBeforeAfterRule$1.evaluate(AbstractBeforeAfterRule.java:43)
	at randomizedtesting.runner@2.8.3/com.carrotsearch.randomizedtesting.rules.StatementAdapter.evaluate(StatementAdapter.java:36)
	at org.apache.lucene.test_framework@11.0.0-SNAPSHOT/org.apache.lucene.tests.util.TestRuleStoreClassName$1.evaluate(TestRuleStoreClassName.java:38)
	at randomizedtesting.runner@2.8.3/com.carrotsearch.randomizedtesting.rules.NoShadowingOrOverridesOnMethodsRule$1.evaluate(NoShadowingOrOverridesOnMethodsRule.java:40)
	at randomizedtesting.runner@2.8.3/com.carrotsearch.randomizedtesting.rules.NoShadowingOrOverridesOnMethodsRule$1.evaluate(NoShadowingOrOverridesOnMethodsRule.java:40)
	at randomizedtesting.runner@2.8.3/com.carrotsearch.randomizedtesting.rules.StatementAdapter.evaluate(StatementAdapter.java:36)
	at randomizedtesting.runner@2.8.3/com.carrotsearch.randomizedtesting.rules.StatementAdapter.evaluate(StatementAdapter.java:36)
	at org.apache.lucene.test_framework@11.0.0-SNAPSHOT/org.apache.lucene.tests.util.TestRuleAssertionsRequired$1.evaluate(TestRuleAssertionsRequired.java:52)
	at org.apache.lucene.test_framework@11.0.0-SNAPSHOT/org.apache.lucene.tests.util.AbstractBeforeAfterRule$1.evaluate(AbstractBeforeAfterRule.java:43)
	at org.apache.lucene.test_framework@11.0.0-SNAPSHOT/org.apache.lucene.tests.util.TestRuleMarkFailure$1.evaluate(TestRuleMarkFailure.java:44)
	at org.apache.lucene.test_framework@11.0.0-SNAPSHOT/org.apache.lucene.tests.util.TestRuleIgnoreAfterMaxFailures$1.evaluate(TestRuleIgnoreAfterMaxFailures.java:60)
	at org.apache.lucene.test_framework@11.0.0-SNAPSHOT/org.apache.lucene.tests.util.TestRuleIgnoreTestSuites$1.evaluate(TestRuleIgnoreTestSuites.java:47)
	at junit@4.13.2/org.junit.rules.RunRules.evaluate(RunRules.java:20)
	at randomizedtesting.runner@2.8.3/com.carrotsearch.randomizedtesting.rules.StatementAdapter.evaluate(StatementAdapter.java:36)
	at randomizedtesting.runner@2.8.3/com.carrotsearch.randomizedtesting.ThreadLeakControl$StatementRunner.run(ThreadLeakControl.java:390)
	at randomizedtesting.runner@2.8.3/com.carrotsearch.randomizedtesting.ThreadLeakControl.lambda$forkTimeoutingTask$0(ThreadLeakControl.java:850)
	at java.base/java.lang.Thread.run(Thread.java:1474)


FAILED:  org.apache.lucene.backward_codecs.lucene60.TestLucene60FieldInfosFormat.testMergeStability

Error Message:
java.lang.AssertionError: expected:<{fnm=82, fdt=8749, fdx=90, fdm=158}> but was:<{cfs=9141, cfe=150}>

Stack Trace:
java.lang.AssertionError: expected:<{fnm=82, fdt=8749, fdx=90, fdm=158}> but was:<{cfs=9141, cfe=150}>
	at __randomizedtesting.SeedInfo.seed([6287B65127EA652:72643D4A1F94A4E4]:0)
	at junit@4.13.2/org.junit.Assert.fail(Assert.java:89)
	at junit@4.13.2/org.junit.Assert.failNotEquals(Assert.java:835)
	at junit@4.13.2/org.junit.Assert.assertEquals(Assert.java:120)
	at junit@4.13.2/org.junit.Assert.assertEquals(Assert.java:146)
	at org.apache.lucene.test_framework@11.0.0-SNAPSHOT/org.apache.lucene.tests.index.BaseIndexFileFormatTestCase.testMergeStability(BaseIndexFileFormatTestCase.java:306)
	at java.base/jdk.internal.reflect.DirectMethodHandleAccessor.invoke(DirectMethodHandleAccessor.java:104)
	at java.base/java.lang.reflect.Method.invoke(Method.java:565)
	at randomizedtesting.runner@2.8.3/com.carrotsearch.randomizedtesting.RandomizedRunner.invoke(RandomizedRunner.java:1763)
	at randomizedtesting.runner@2.8.3/com.carrotsearch.randomizedtesting.RandomizedRunner$8.evaluate(RandomizedRunner.java:946)
	at randomizedtesting.runner@2.8.3/com.carrotsearch.randomizedtesting.RandomizedRunner$9.evaluate(RandomizedRunner.java:982)
	at randomizedtesting.runner@2.8.3/com.carrotsearch.randomizedtesting.RandomizedRunner$10.evaluate(RandomizedRunner.java:996)
	at org.apache.lucene.test_framework@11.0.0-SNAPSHOT/org.apache.lucene.tests.util.TestRuleSetupTeardownChained$1.evaluate(TestRuleSetupTeardownChained.java:48)
	at org.apache.lucene.test_framework@11.0.0-SNAPSHOT/org.apache.lucene.tests.util.AbstractBeforeAfterRule$1.evaluate(AbstractBeforeAfterRule.java:43)
	at org.apache.lucene.test_framework@11.0.0-SNAPSHOT/org.apache.lucene.tests.util.TestRuleThreadAndTestName$1.evaluate(TestRuleThreadAndTestName.java:45)
	at org.apache.lucene.test_framework@11.0.0-SNAPSHOT/org.apache.lucene.tests.util.TestRuleIgnoreAfterMaxFailures$1.evaluate(TestRuleIgnoreAfterMaxFailures.java:60)
	at org.apache.lucene.test_framework@11.0.0-SNAPSHOT/org.apache.lucene.tests.util.TestRuleMarkFailure$1.evaluate(TestRuleMarkFailure.java:44)
	at junit@4.13.2/org.junit.rules.RunRules.evaluate(RunRules.java:20)
	at randomizedtesting.runner@2.8.3/com.carrotsearch.randomizedtesting.rules.StatementAdapter.evaluate(StatementAdapter.java:36)
	at randomizedtesting.runner@2.8.3/com.carrotsearch.randomizedtesting.ThreadLeakControl$StatementRunner.run(ThreadLeakControl.java:390)
	at randomizedtesting.runner@2.8.3/com.carrotsearch.randomizedtesting.ThreadLeakControl.forkTimeoutingTask(ThreadLeakControl.java:843)
	at randomizedtesting.runner@2.8.3/com.carrotsearch.randomizedtesting.ThreadLeakControl$3.evaluate(ThreadLeakControl.java:490)
	at randomizedtesting.runner@2.8.3/com.carrotsearch.randomizedtesting.RandomizedRunner.runSingleTest(RandomizedRunner.java:955)
	at randomizedtesting.runner@2.8.3/com.carrotsearch.randomizedtesting.RandomizedRunner$5.evaluate(RandomizedRunner.java:840)
	at randomizedtesting.runner@2.8.3/com.carrotsearch.randomizedtesting.RandomizedRunner$6.evaluate(RandomizedRunner.java:891)
	at randomizedtesting.runner@2.8.3/com.carrotsearch.randomizedtesting.RandomizedRunner$7.evaluate(RandomizedRunner.java:902)
	at org.apache.lucene.test_framework@11.0.0-SNAPSHOT/org.apache.lucene.tests.util.AbstractBeforeAfterRule$1.evaluate(AbstractBeforeAfterRule.java:43)
	at randomizedtesting.runner@2.8.3/com.carrotsearch.randomizedtesting.rules.StatementAdapter.evaluate(StatementAdapter.java:36)
	at org.apache.lucene.test_framework@11.0.0-SNAPSHOT/org.apache.lucene.tests.util.TestRuleStoreClassName$1.evaluate(TestRuleStoreClassName.java:38)
	at randomizedtesting.runner@2.8.3/com.carrotsearch.randomizedtesting.rules.NoShadowingOrOverridesOnMethodsRule$1.evaluate(NoShadowingOrOverridesOnMethodsRule.java:40)
	at randomizedtesting.runner@2.8.3/com.carrotsearch.randomizedtesting.rules.NoShadowingOrOverridesOnMethodsRule$1.evaluate(NoShadowingOrOverridesOnMethodsRule.java:40)
	at randomizedtesting.runner@2.8.3/com.carrotsearch.randomizedtesting.rules.StatementAdapter.evaluate(StatementAdapter.java:36)
	at randomizedtesting.runner@2.8.3/com.carrotsearch.randomizedtesting.rules.StatementAdapter.evaluate(StatementAdapter.java:36)
	at org.apache.lucene.test_framework@11.0.0-SNAPSHOT/org.apache.lucene.tests.util.TestRuleAssertionsRequired$1.evaluate(TestRuleAssertionsRequired.java:52)
	at org.apache.lucene.test_framework@11.0.0-SNAPSHOT/org.apache.lucene.tests.util.AbstractBeforeAfterRule$1.evaluate(AbstractBeforeAfterRule.java:43)
	at org.apache.lucene.test_framework@11.0.0-SNAPSHOT/org.apache.lucene.tests.util.TestRuleMarkFailure$1.evaluate(TestRuleMarkFailure.java:44)
	at org.apache.lucene.test_framework@11.0.0-SNAPSHOT/org.apache.lucene.tests.util.TestRuleIgnoreAfterMaxFailures$1.evaluate(TestRuleIgnoreAfterMaxFailures.java:60)
	at org.apache.lucene.test_framework@11.0.0-SNAPSHOT/org.apache.lucene.tests.util.TestRuleIgnoreTestSuites$1.evaluate(TestRuleIgnoreTestSuites.java:47)
	at junit@4.13.2/org.junit.rules.RunRules.evaluate(RunRules.java:20)
	at randomizedtesting.runner@2.8.3/com.carrotsearch.randomizedtesting.rules.StatementAdapter.evaluate(StatementAdapter.java:36)
	at randomizedtesting.runner@2.8.3/com.carrotsearch.randomizedtesting.ThreadLeakControl$StatementRunner.run(ThreadLeakControl.java:390)
	at randomizedtesting.runner@2.8.3/com.carrotsearch.randomizedtesting.ThreadLeakControl.lambda$forkTimeoutingTask$0(ThreadLeakControl.java:850)
	at java.base/java.lang.Thread.run(Thread.java:1474)


FAILED:  org.apache.lucene.backward_codecs.lucene70.TestLucene70SegmentInfoFormat.testMergeStability

Error Message:
java.lang.AssertionError: expected:<{fnm=82, fdt=8749, fdx=90, fdm=158}> but was:<{cfs=9141, cfe=150}>

Stack Trace:
java.lang.AssertionError: expected:<{fnm=82, fdt=8749, fdx=90, fdm=158}> but was:<{cfs=9141, cfe=150}>
	at __randomizedtesting.SeedInfo.seed([6287B65127EA652:72643D4A1F94A4E4]:0)
	at junit@4.13.2/org.junit.Assert.fail(Assert.java:89)
	at junit@4.13.2/org.junit.Assert.failNotEquals(Assert.java:835)
	at junit@4.13.2/org.junit.Assert.assertEquals(Assert.java:120)
	at junit@4.13.2/org.junit.Assert.assertEquals(Assert.java:146)
	at org.apache.lucene.test_framework@11.0.0-SNAPSHOT/org.apache.lucene.tests.index.BaseIndexFileFormatTestCase.testMergeStability(BaseIndexFileFormatTestCase.java:306)
	at java.base/jdk.internal.reflect.DirectMethodHandleAccessor.invoke(DirectMethodHandleAccessor.java:104)
	at java.base/java.lang.reflect.Method.invoke(Method.java:565)
	at randomizedtesting.runner@2.8.3/com.carrotsearch.randomizedtesting.RandomizedRunner.invoke(RandomizedRunner.java:1763)
	at randomizedtesting.runner@2.8.3/com.carrotsearch.randomizedtesting.RandomizedRunner$8.evaluate(RandomizedRunner.java:946)
	at randomizedtesting.runner@2.8.3/com.carrotsearch.randomizedtesting.RandomizedRunner$9.evaluate(RandomizedRunner.java:982)
	at randomizedtesting.runner@2.8.3/com.carrotsearch.randomizedtesting.RandomizedRunner$10.evaluate(RandomizedRunner.java:996)
	at org.apache.lucene.test_framework@11.0.0-SNAPSHOT/org.apache.lucene.tests.util.TestRuleSetupTeardownChained$1.evaluate(TestRuleSetupTeardownChained.java:48)
	at org.apache.lucene.test_framework@11.0.0-SNAPSHOT/org.apache.lucene.tests.util.AbstractBeforeAfterRule$1.evaluate(AbstractBeforeAfterRule.java:43)
	at org.apache.lucene.test_framework@11.0.0-SNAPSHOT/org.apache.lucene.tests.util.TestRuleThreadAndTestName$1.evaluate(TestRuleThreadAndTestName.java:45)
	at org.apache.lucene.test_framework@11.0.0-SNAPSHOT/org.apache.lucene.tests.util.TestRuleIgnoreAfterMaxFailures$1.evaluate(TestRuleIgnoreAfterMaxFailures.java:60)
	at org.apache.lucene.test_framework@11.0.0-SNAPSHOT/org.apache.lucene.tests.util.TestRuleMarkFailure$1.evaluate(TestRuleMarkFailure.java:44)
	at junit@4.13.2/org.junit.rules.RunRules.evaluate(RunRules.java:20)
	at randomizedtesting.runner@2.8.3/com.carrotsearch.randomizedtesting.rules.StatementAdapter.evaluate(StatementAdapter.java:36)
	at randomizedtesting.runner@2.8.3/com.carrotsearch.randomizedtesting.ThreadLeakControl$StatementRunner.run(ThreadLeakControl.java:390)
	at randomizedtesting.runner@2.8.3/com.carrotsearch.randomizedtesting.ThreadLeakControl.forkTimeoutingTask(ThreadLeakControl.java:843)
	at randomizedtesting.runner@2.8.3/com.carrotsearch.randomizedtesting.ThreadLeakControl$3.evaluate(ThreadLeakControl.java:490)
	at randomizedtesting.runner@2.8.3/com.carrotsearch.randomizedtesting.RandomizedRunner.runSingleTest(RandomizedRunner.java:955)
	at randomizedtesting.runner@2.8.3/com.carrotsearch.randomizedtesting.RandomizedRunner$5.evaluate(RandomizedRunner.java:840)
	at randomizedtesting.runner@2.8.3/com.carrotsearch.randomizedtesting.RandomizedRunner$6.evaluate(RandomizedRunner.java:891)
	at randomizedtesting.runner@2.8.3/com.carrotsearch.randomizedtesting.RandomizedRunner$7.evaluate(RandomizedRunner.java:902)
	at org.apache.lucene.test_framework@11.0.0-SNAPSHOT/org.apache.lucene.tests.util.AbstractBeforeAfterRule$1.evaluate(AbstractBeforeAfterRule.java:43)
	at randomizedtesting.runner@2.8.3/com.carrotsearch.randomizedtesting.rules.StatementAdapter.evaluate(StatementAdapter.java:36)
	at org.apache.lucene.test_framework@11.0.0-SNAPSHOT/org.apache.lucene.tests.util.TestRuleStoreClassName$1.evaluate(TestRuleStoreClassName.java:38)
	at randomizedtesting.runner@2.8.3/com.carrotsearch.randomizedtesting.rules.NoShadowingOrOverridesOnMethodsRule$1.evaluate(NoShadowingOrOverridesOnMethodsRule.java:40)
	at randomizedtesting.runner@2.8.3/com.carrotsearch.randomizedtesting.rules.NoShadowingOrOverridesOnMethodsRule$1.evaluate(NoShadowingOrOverridesOnMethodsRule.java:40)
	at randomizedtesting.runner@2.8.3/com.carrotsearch.randomizedtesting.rules.StatementAdapter.evaluate(StatementAdapter.java:36)
	at randomizedtesting.runner@2.8.3/com.carrotsearch.randomizedtesting.rules.StatementAdapter.evaluate(StatementAdapter.java:36)
	at org.apache.lucene.test_framework@11.0.0-SNAPSHOT/org.apache.lucene.tests.util.TestRuleAssertionsRequired$1.evaluate(TestRuleAssertionsRequired.java:52)
	at org.apache.lucene.test_framework@11.0.0-SNAPSHOT/org.apache.lucene.tests.util.AbstractBeforeAfterRule$1.evaluate(AbstractBeforeAfterRule.java:43)
	at org.apache.lucene.test_framework@11.0.0-SNAPSHOT/org.apache.lucene.tests.util.TestRuleMarkFailure$1.evaluate(TestRuleMarkFailure.java:44)
	at org.apache.lucene.test_framework@11.0.0-SNAPSHOT/org.apache.lucene.tests.util.TestRuleIgnoreAfterMaxFailures$1.evaluate(TestRuleIgnoreAfterMaxFailures.java:60)
	at org.apache.lucene.test_framework@11.0.0-SNAPSHOT/org.apache.lucene.tests.util.TestRuleIgnoreTestSuites$1.evaluate(TestRuleIgnoreTestSuites.java:47)
	at junit@4.13.2/org.junit.rules.RunRules.evaluate(RunRules.java:20)
	at randomizedtesting.runner@2.8.3/com.carrotsearch.randomizedtesting.rules.StatementAdapter.evaluate(StatementAdapter.java:36)
	at randomizedtesting.runner@2.8.3/com.carrotsearch.randomizedtesting.ThreadLeakControl$StatementRunner.run(ThreadLeakControl.java:390)
	at randomizedtesting.runner@2.8.3/com.carrotsearch.randomizedtesting.ThreadLeakControl.lambda$forkTimeoutingTask$0(ThreadLeakControl.java:850)
	at java.base/java.lang.Thread.run(Thread.java:1474)


FAILED:  org.apache.lucene.backward_codecs.lucene86.TestLucene86SegmentInfoFormat.testMergeStability

Error Message:
java.lang.AssertionError: expected:<{fnm=82, fdt=8750, fdx=80, fdm=158}> but was:<{cfs=9132, cfe=150}>

Stack Trace:
java.lang.AssertionError: expected:<{fnm=82, fdt=8750, fdx=80, fdm=158}> but was:<{cfs=9132, cfe=150}>
	at __randomizedtesting.SeedInfo.seed([6287B65127EA652:72643D4A1F94A4E4]:0)
	at junit@4.13.2/org.junit.Assert.fail(Assert.java:89)
	at junit@4.13.2/org.junit.Assert.failNotEquals(Assert.java:835)
	at junit@4.13.2/org.junit.Assert.assertEquals(Assert.java:120)
	at junit@4.13.2/org.junit.Assert.assertEquals(Assert.java:146)
	at org.apache.lucene.test_framework@11.0.0-SNAPSHOT/org.apache.lucene.tests.index.BaseIndexFileFormatTestCase.testMergeStability(BaseIndexFileFormatTestCase.java:306)
	at java.base/jdk.internal.reflect.DirectMethodHandleAccessor.invoke(DirectMethodHandleAccessor.java:104)
	at java.base/java.lang.reflect.Method.invoke(Method.java:565)
	at randomizedtesting.runner@2.8.3/com.carrotsearch.randomizedtesting.RandomizedRunner.invoke(RandomizedRunner.java:1763)
	at randomizedtesting.runner@2.8.3/com.carrotsearch.randomizedtesting.RandomizedRunner$8.evaluate(RandomizedRunner.java:946)
	at randomizedtesting.runner@2.8.3/com.carrotsearch.randomizedtesting.RandomizedRunner$9.evaluate(RandomizedRunner.java:982)
	at randomizedtesting.runner@2.8.3/com.carrotsearch.randomizedtesting.RandomizedRunner$10.evaluate(RandomizedRunner.java:996)
	at org.apache.lucene.test_framework@11.0.0-SNAPSHOT/org.apache.lucene.tests.util.TestRuleSetupTeardownChained$1.evaluate(TestRuleSetupTeardownChained.java:48)
	at org.apache.lucene.test_framework@11.0.0-SNAPSHOT/org.apache.lucene.tests.util.AbstractBeforeAfterRule$1.evaluate(AbstractBeforeAfterRule.java:43)
	at org.apache.lucene.test_framework@11.0.0-SNAPSHOT/org.apache.lucene.tests.util.TestRuleThreadAndTestName$1.evaluate(TestRuleThreadAndTestName.java:45)
	at org.apache.lucene.test_framework@11.0.0-SNAPSHOT/org.apache.lucene.tests.util.TestRuleIgnoreAfterMaxFailures$1.evaluate(TestRuleIgnoreAfterMaxFailures.java:60)
	at org.apache.lucene.test_framework@11.0.0-SNAPSHOT/org.apache.lucene.tests.util.TestRuleMarkFailure$1.evaluate(TestRuleMarkFailure.java:44)
	at junit@4.13.2/org.junit.rules.RunRules.evaluate(RunRules.java:20)
	at randomizedtesting.runner@2.8.3/com.carrotsearch.randomizedtesting.rules.StatementAdapter.evaluate(StatementAdapter.java:36)
	at randomizedtesting.runner@2.8.3/com.carrotsearch.randomizedtesting.ThreadLeakControl$StatementRunner.run(ThreadLeakControl.java:390)
	at randomizedtesting.runner@2.8.3/com.carrotsearch.randomizedtesting.ThreadLeakControl.forkTimeoutingTask(ThreadLeakControl.java:843)
	at randomizedtesting.runner@2.8.3/com.carrotsearch.randomizedtesting.ThreadLeakControl$3.evaluate(ThreadLeakControl.java:490)
	at randomizedtesting.runner@2.8.3/com.carrotsearch.randomizedtesting.RandomizedRunner.runSingleTest(RandomizedRunner.java:955)
	at randomizedtesting.runner@2.8.3/com.carrotsearch.randomizedtesting.RandomizedRunner$5.evaluate(RandomizedRunner.java:840)
	at randomizedtesting.runner@2.8.3/com.carrotsearch.randomizedtesting.RandomizedRunner$6.evaluate(RandomizedRunner.java:891)
	at randomizedtesting.runner@2.8.3/com.carrotsearch.randomizedtesting.RandomizedRunner$7.evaluate(RandomizedRunner.java:902)
	at org.apache.lucene.test_framework@11.0.0-SNAPSHOT/org.apache.lucene.tests.util.AbstractBeforeAfterRule$1.evaluate(AbstractBeforeAfterRule.java:43)
	at randomizedtesting.runner@2.8.3/com.carrotsearch.randomizedtesting.rules.StatementAdapter.evaluate(StatementAdapter.java:36)
	at org.apache.lucene.test_framework@11.0.0-SNAPSHOT/org.apache.lucene.tests.util.TestRuleStoreClassName$1.evaluate(TestRuleStoreClassName.java:38)
	at randomizedtesting.runner@2.8.3/com.carrotsearch.randomizedtesting.rules.NoShadowingOrOverridesOnMethodsRule$1.evaluate(NoShadowingOrOverridesOnMethodsRule.java:40)
	at randomizedtesting.runner@2.8.3/com.carrotsearch.randomizedtesting.rules.NoShadowingOrOverridesOnMethodsRule$1.evaluate(NoShadowingOrOverridesOnMethodsRule.java:40)
	at randomizedtesting.runner@2.8.3/com.carrotsearch.randomizedtesting.rules.StatementAdapter.evaluate(StatementAdapter.java:36)
	at randomizedtesting.runner@2.8.3/com.carrotsearch.randomizedtesting.rules.StatementAdapter.evaluate(StatementAdapter.java:36)
	at org.apache.lucene.test_framework@11.0.0-SNAPSHOT/org.apache.lucene.tests.util.TestRuleAssertionsRequired$1.evaluate(TestRuleAssertionsRequired.java:52)
	at org.apache.lucene.test_framework@11.0.0-SNAPSHOT/org.apache.lucene.tests.util.AbstractBeforeAfterRule$1.evaluate(AbstractBeforeAfterRule.java:43)
	at org.apache.lucene.test_framework@11.0.0-SNAPSHOT/org.apache.lucene.tests.util.TestRuleMarkFailure$1.evaluate(TestRuleMarkFailure.java:44)
	at org.apache.lucene.test_framework@11.0.0-SNAPSHOT/org.apache.lucene.tests.util.TestRuleIgnoreAfterMaxFailures$1.evaluate(TestRuleIgnoreAfterMaxFailures.java:60)
	at org.apache.lucene.test_framework@11.0.0-SNAPSHOT/org.apache.lucene.tests.util.TestRuleIgnoreTestSuites$1.evaluate(TestRuleIgnoreTestSuites.java:47)
	at junit@4.13.2/org.junit.rules.RunRules.evaluate(RunRules.java:20)
	at randomizedtesting.runner@2.8.3/com.carrotsearch.randomizedtesting.rules.StatementAdapter.evaluate(StatementAdapter.java:36)
	at randomizedtesting.runner@2.8.3/com.carrotsearch.randomizedtesting.ThreadLeakControl$StatementRunner.run(ThreadLeakControl.java:390)
	at randomizedtesting.runner@2.8.3/com.carrotsearch.randomizedtesting.ThreadLeakControl.lambda$forkTimeoutingTask$0(ThreadLeakControl.java:850)
	at java.base/java.lang.Thread.run(Thread.java:1474)


FAILED:  org.apache.lucene.backward_codecs.lucene87.TestLucene87StoredFieldsFormat.testMergeStability

Error Message:
java.lang.AssertionError: expected:<{fnm=77, fdt=62220, fdx=81, fdm=158}> but was:<{cfs=62598, cfe=150}>

Stack Trace:
java.lang.AssertionError: expected:<{fnm=77, fdt=62220, fdx=81, fdm=158}> but was:<{cfs=62598, cfe=150}>
	at __randomizedtesting.SeedInfo.seed([6287B65127EA652:72643D4A1F94A4E4]:0)
	at junit@4.13.2/org.junit.Assert.fail(Assert.java:89)
	at junit@4.13.2/org.junit.Assert.failNotEquals(Assert.java:835)
	at junit@4.13.2/org.junit.Assert.assertEquals(Assert.java:120)
	at junit@4.13.2/org.junit.Assert.assertEquals(Assert.java:146)
	at org.apache.lucene.test_framework@11.0.0-SNAPSHOT/org.apache.lucene.tests.index.BaseIndexFileFormatTestCase.testMergeStability(BaseIndexFileFormatTestCase.java:306)
	at java.base/jdk.internal.reflect.DirectMethodHandleAccessor.invoke(DirectMethodHandleAccessor.java:104)
	at java.base/java.lang.reflect.Method.invoke(Method.java:565)
	at randomizedtesting.runner@2.8.3/com.carrotsearch.randomizedtesting.RandomizedRunner.invoke(RandomizedRunner.java:1763)
	at randomizedtesting.runner@2.8.3/com.carrotsearch.randomizedtesting.RandomizedRunner$8.evaluate(RandomizedRunner.java:946)
	at randomizedtesting.runner@2.8.3/com.carrotsearch.randomizedtesting.RandomizedRunner$9.evaluate(RandomizedRunner.java:982)
	at randomizedtesting.runner@2.8.3/com.carrotsearch.randomizedtesting.RandomizedRunner$10.evaluate(RandomizedRunner.java:996)
	at org.apache.lucene.test_framework@11.0.0-SNAPSHOT/org.apache.lucene.tests.util.TestRuleSetupTeardownChained$1.evaluate(TestRuleSetupTeardownChained.java:48)
	at org.apache.lucene.test_framework@11.0.0-SNAPSHOT/org.apache.lucene.tests.util.AbstractBeforeAfterRule$1.evaluate(AbstractBeforeAfterRule.java:43)
	at org.apache.lucene.test_framework@11.0.0-SNAPSHOT/org.apache.lucene.tests.util.TestRuleThreadAndTestName$1.evaluate(TestRuleThreadAndTestName.java:45)
	at org.apache.lucene.test_framework@11.0.0-SNAPSHOT/org.apache.lucene.tests.util.TestRuleIgnoreAfterMaxFailures$1.evaluate(TestRuleIgnoreAfterMaxFailures.java:60)
	at org.apache.lucene.test_framework@11.0.0-SNAPSHOT/org.apache.lucene.tests.util.TestRuleMarkFailure$1.evaluate(TestRuleMarkFailure.java:44)
	at junit@4.13.2/org.junit.rules.RunRules.evaluate(RunRules.java:20)
	at randomizedtesting.runner@2.8.3/com.carrotsearch.randomizedtesting.rules.StatementAdapter.evaluate(StatementAdapter.java:36)
	at randomizedtesting.runner@2.8.3/com.carrotsearch.randomizedtesting.ThreadLeakControl$StatementRunner.run(ThreadLeakControl.java:390)
	at randomizedtesting.runner@2.8.3/com.carrotsearch.randomizedtesting.ThreadLeakControl.forkTimeoutingTask(ThreadLeakControl.java:843)
	at randomizedtesting.runner@2.8.3/com.carrotsearch.randomizedtesting.ThreadLeakControl$3.evaluate(ThreadLeakControl.java:490)
	at randomizedtesting.runner@2.8.3/com.carrotsearch.randomizedtesting.RandomizedRunner.runSingleTest(RandomizedRunner.java:955)
	at randomizedtesting.runner@2.8.3/com.carrotsearch.randomizedtesting.RandomizedRunner$5.evaluate(RandomizedRunner.java:840)
	at randomizedtesting.runner@2.8.3/com.carrotsearch.randomizedtesting.RandomizedRunner$6.evaluate(RandomizedRunner.java:891)
	at randomizedtesting.runner@2.8.3/com.carrotsearch.randomizedtesting.RandomizedRunner$7.evaluate(RandomizedRunner.java:902)
	at org.apache.lucene.test_framework@11.0.0-SNAPSHOT/org.apache.lucene.tests.util.AbstractBeforeAfterRule$1.evaluate(AbstractBeforeAfterRule.java:43)
	at randomizedtesting.runner@2.8.3/com.carrotsearch.randomizedtesting.rules.StatementAdapter.evaluate(StatementAdapter.java:36)
	at org.apache.lucene.test_framework@11.0.0-SNAPSHOT/org.apache.lucene.tests.util.TestRuleStoreClassName$1.evaluate(TestRuleStoreClassName.java:38)
	at randomizedtesting.runner@2.8.3/com.carrotsearch.randomizedtesting.rules.NoShadowingOrOverridesOnMethodsRule$1.evaluate(NoShadowingOrOverridesOnMethodsRule.java:40)
	at randomizedtesting.runner@2.8.3/com.carrotsearch.randomizedtesting.rules.NoShadowingOrOverridesOnMethodsRule$1.evaluate(NoShadowingOrOverridesOnMethodsRule.java:40)
	at randomizedtesting.runner@2.8.3/com.carrotsearch.randomizedtesting.rules.StatementAdapter.evaluate(StatementAdapter.java:36)
	at randomizedtesting.runner@2.8.3/com.carrotsearch.randomizedtesting.rules.StatementAdapter.evaluate(StatementAdapter.java:36)
	at org.apache.lucene.test_framework@11.0.0-SNAPSHOT/org.apache.lucene.tests.util.TestRuleAssertionsRequired$1.evaluate(TestRuleAssertionsRequired.java:52)
	at org.apache.lucene.test_framework@11.0.0-SNAPSHOT/org.apache.lucene.tests.util.AbstractBeforeAfterRule$1.evaluate(AbstractBeforeAfterRule.java:43)
	at org.apache.lucene.test_framework@11.0.0-SNAPSHOT/org.apache.lucene.tests.util.TestRuleMarkFailure$1.evaluate(TestRuleMarkFailure.java:44)
	at org.apache.lucene.test_framework@11.0.0-SNAPSHOT/org.apache.lucene.tests.util.TestRuleIgnoreAfterMaxFailures$1.evaluate(TestRuleIgnoreAfterMaxFailures.java:60)
	at org.apache.lucene.test_framework@11.0.0-SNAPSHOT/org.apache.lucene.tests.util.TestRuleIgnoreTestSuites$1.evaluate(TestRuleIgnoreTestSuites.java:47)
	at junit@4.13.2/org.junit.rules.RunRules.evaluate(RunRules.java:20)
	at randomizedtesting.runner@2.8.3/com.carrotsearch.randomizedtesting.rules.StatementAdapter.evaluate(StatementAdapter.java:36)
	at randomizedtesting.runner@2.8.3/com.carrotsearch.randomizedtesting.ThreadLeakControl$StatementRunner.run(ThreadLeakControl.java:390)
	at randomizedtesting.runner@2.8.3/com.carrotsearch.randomizedtesting.ThreadLeakControl.lambda$forkTimeoutingTask$0(ThreadLeakControl.java:850)
	at java.base/java.lang.Thread.run(Thread.java:1474)


FAILED:  org.apache.lucene.backward_codecs.lucene87.TestLucene87StoredFieldsFormatHighCompression.testMergeStability

Error Message:
java.lang.AssertionError: expected:<{fnm=77, fdt=40797, fdx=64, fdm=159}> but was:<{cfs=41159, cfe=150}>

Stack Trace:
java.lang.AssertionError: expected:<{fnm=77, fdt=40797, fdx=64, fdm=159}> but was:<{cfs=41159, cfe=150}>
	at __randomizedtesting.SeedInfo.seed([6287B65127EA652:72643D4A1F94A4E4]:0)
	at junit@4.13.2/org.junit.Assert.fail(Assert.java:89)
	at junit@4.13.2/org.junit.Assert.failNotEquals(Assert.java:835)
	at junit@4.13.2/org.junit.Assert.assertEquals(Assert.java:120)
	at junit@4.13.2/org.junit.Assert.assertEquals(Assert.java:146)
	at org.apache.lucene.test_framework@11.0.0-SNAPSHOT/org.apache.lucene.tests.index.BaseIndexFileFormatTestCase.testMergeStability(BaseIndexFileFormatTestCase.java:306)
	at java.base/jdk.internal.reflect.DirectMethodHandleAccessor.invoke(DirectMethodHandleAccessor.java:104)
	at java.base/java.lang.reflect.Method.invoke(Method.java:565)
	at randomizedtesting.runner@2.8.3/com.carrotsearch.randomizedtesting.RandomizedRunner.invoke(RandomizedRunner.java:1763)
	at randomizedtesting.runner@2.8.3/com.carrotsearch.randomizedtesting.RandomizedRunner$8.evaluate(RandomizedRunner.java:946)
	at randomizedtesting.runner@2.8.3/com.carrotsearch.randomizedtesting.RandomizedRunner$9.evaluate(RandomizedRunner.java:982)
	at randomizedtesting.runner@2.8.3/com.carrotsearch.randomizedtesting.RandomizedRunner$10.evaluate(RandomizedRunner.java:996)
	at org.apache.lucene.test_framework@11.0.0-SNAPSHOT/org.apache.lucene.tests.util.TestRuleSetupTeardownChained$1.evaluate(TestRuleSetupTeardownChained.java:48)
	at org.apache.lucene.test_framework@11.0.0-SNAPSHOT/org.apache.lucene.tests.util.AbstractBeforeAfterRule$1.evaluate(AbstractBeforeAfterRule.java:43)
	at org.apache.lucene.test_framework@11.0.0-SNAPSHOT/org.apache.lucene.tests.util.TestRuleThreadAndTestName$1.evaluate(TestRuleThreadAndTestName.java:45)
	at org.apache.lucene.test_framework@11.0.0-SNAPSHOT/org.apache.lucene.tests.util.TestRuleIgnoreAfterMaxFailures$1.evaluate(TestRuleIgnoreAfterMaxFailures.java:60)
	at org.apache.lucene.test_framework@11.0.0-SNAPSHOT/org.apache.lucene.tests.util.TestRuleMarkFailure$1.evaluate(TestRuleMarkFailure.java:44)
	at junit@4.13.2/org.junit.rules.RunRules.evaluate(RunRules.java:20)
	at randomizedtesting.runner@2.8.3/com.carrotsearch.randomizedtesting.rules.StatementAdapter.evaluate(StatementAdapter.java:36)
	at randomizedtesting.runner@2.8.3/com.carrotsearch.randomizedtesting.ThreadLeakControl$StatementRunner.run(ThreadLeakControl.java:390)
	at randomizedtesting.runner@2.8.3/com.carrotsearch.randomizedtesting.ThreadLeakControl.forkTimeoutingTask(ThreadLeakControl.java:843)
	at randomizedtesting.runner@2.8.3/com.carrotsearch.randomizedtesting.ThreadLeakControl$3.evaluate(ThreadLeakControl.java:490)
	at randomizedtesting.runner@2.8.3/com.carrotsearch.randomizedtesting.RandomizedRunner.runSingleTest(RandomizedRunner.java:955)
	at randomizedtesting.runner@2.8.3/com.carrotsearch.randomizedtesting.RandomizedRunner$5.evaluate(RandomizedRunner.java:840)
	at randomizedtesting.runner@2.8.3/com.carrotsearch.randomizedtesting.RandomizedRunner$6.evaluate(RandomizedRunner.java:891)
	at randomizedtesting.runner@2.8.3/com.carrotsearch.randomizedtesting.RandomizedRunner$7.evaluate(RandomizedRunner.java:902)
	at org.apache.lucene.test_framework@11.0.0-SNAPSHOT/org.apache.lucene.tests.util.AbstractBeforeAfterRule$1.evaluate(AbstractBeforeAfterRule.java:43)
	at randomizedtesting.runner@2.8.3/com.carrotsearch.randomizedtesting.rules.StatementAdapter.evaluate(StatementAdapter.java:36)
	at org.apache.lucene.test_framework@11.0.0-SNAPSHOT/org.apache.lucene.tests.util.TestRuleStoreClassName$1.evaluate(TestRuleStoreClassName.java:38)
	at randomizedtesting.runner@2.8.3/com.carrotsearch.randomizedtesting.rules.NoShadowingOrOverridesOnMethodsRule$1.evaluate(NoShadowingOrOverridesOnMethodsRule.java:40)
	at randomizedtesting.runner@2.8.3/com.carrotsearch.randomizedtesting.rules.NoShadowingOrOverridesOnMethodsRule$1.evaluate(NoShadowingOrOverridesOnMethodsRule.java:40)
	at randomizedtesting.runner@2.8.3/com.carrotsearch.randomizedtesting.rules.StatementAdapter.evaluate(StatementAdapter.java:36)
	at randomizedtesting.runner@2.8.3/com.carrotsearch.randomizedtesting.rules.StatementAdapter.evaluate(StatementAdapter.java:36)
	at org.apache.lucene.test_framework@11.0.0-SNAPSHOT/org.apache.lucene.tests.util.TestRuleAssertionsRequired$1.evaluate(TestRuleAssertionsRequired.java:52)
	at org.apache.lucene.test_framework@11.0.0-SNAPSHOT/org.apache.lucene.tests.util.AbstractBeforeAfterRule$1.evaluate(AbstractBeforeAfterRule.java:43)
	at org.apache.lucene.test_framework@11.0.0-SNAPSHOT/org.apache.lucene.tests.util.TestRuleMarkFailure$1.evaluate(TestRuleMarkFailure.java:44)
	at org.apache.lucene.test_framework@11.0.0-SNAPSHOT/org.apache.lucene.tests.util.TestRuleIgnoreAfterMaxFailures$1.evaluate(TestRuleIgnoreAfterMaxFailures.java:60)
	at org.apache.lucene.test_framework@11.0.0-SNAPSHOT/org.apache.lucene.tests.util.TestRuleIgnoreTestSuites$1.evaluate(TestRuleIgnoreTestSuites.java:47)
	at junit@4.13.2/org.junit.rules.RunRules.evaluate(RunRules.java:20)
	at randomizedtesting.runner@2.8.3/com.carrotsearch.randomizedtesting.rules.StatementAdapter.evaluate(StatementAdapter.java:36)
	at randomizedtesting.runner@2.8.3/com.carrotsearch.randomizedtesting.ThreadLeakControl$StatementRunner.run(ThreadLeakControl.java:390)
	at randomizedtesting.runner@2.8.3/com.carrotsearch.randomizedtesting.ThreadLeakControl.lambda$forkTimeoutingTask$0(ThreadLeakControl.java:850)
	at java.base/java.lang.Thread.run(Thread.java:1474)


FAILED:  org.apache.lucene.backward_codecs.lucene87.TestLucene87StoredFieldsFormatMergeInstance.testMergeStability

Error Message:
java.lang.AssertionError: expected:<{fnm=77, fdt=62220, fdx=81, fdm=158}> but was:<{cfs=62598, cfe=150}>

Stack Trace:
java.lang.AssertionError: expected:<{fnm=77, fdt=62220, fdx=81, fdm=158}> but was:<{cfs=62598, cfe=150}>
	at __randomizedtesting.SeedInfo.seed([6287B65127EA652:72643D4A1F94A4E4]:0)
	at junit@4.13.2/org.junit.Assert.fail(Assert.java:89)
	at junit@4.13.2/org.junit.Assert.failNotEquals(Assert.java:835)
	at junit@4.13.2/org.junit.Assert.assertEquals(Assert.java:120)
	at junit@4.13.2/org.junit.Assert.assertEquals(Assert.java:146)
	at org.apache.lucene.test_framework@11.0.0-SNAPSHOT/org.apache.lucene.tests.index.BaseIndexFileFormatTestCase.testMergeStability(BaseIndexFileFormatTestCase.java:306)
	at java.base/jdk.internal.reflect.DirectMethodHandleAccessor.invoke(DirectMethodHandleAccessor.java:104)
	at java.base/java.lang.reflect.Method.invoke(Method.java:565)
	at randomizedtesting.runner@2.8.3/com.carrotsearch.randomizedtesting.RandomizedRunner.invoke(RandomizedRunner.java:1763)
	at randomizedtesting.runner@2.8.3/com.carrotsearch.randomizedtesting.RandomizedRunner$8.evaluate(RandomizedRunner.java:946)
	at randomizedtesting.runner@2.8.3/com.carrotsearch.randomizedtesting.RandomizedRunner$9.evaluate(RandomizedRunner.java:982)
	at randomizedtesting.runner@2.8.3/com.carrotsearch.randomizedtesting.RandomizedRunner$10.evaluate(RandomizedRunner.java:996)
	at org.apache.lucene.test_framework@11.0.0-SNAPSHOT/org.apache.lucene.tests.util.TestRuleSetupTeardownChained$1.evaluate(TestRuleSetupTeardownChained.java:48)
	at org.apache.lucene.test_framework@11.0.0-SNAPSHOT/org.apache.lucene.tests.util.AbstractBeforeAfterRule$1.evaluate(AbstractBeforeAfterRule.java:43)
	at org.apache.lucene.test_framework@11.0.0-SNAPSHOT/org.apache.lucene.tests.util.TestRuleThreadAndTestName$1.evaluate(TestRuleThreadAndTestName.java:45)
	at org.apache.lucene.test_framework@11.0.0-SNAPSHOT/org.apache.lucene.tests.util.TestRuleIgnoreAfterMaxFailures$1.evaluate(TestRuleIgnoreAfterMaxFailures.java:60)
	at org.apache.lucene.test_framework@11.0.0-SNAPSHOT/org.apache.lucene.tests.util.TestRuleMarkFailure$1.evaluate(TestRuleMarkFailure.java:44)
	at junit@4.13.2/org.junit.rules.RunRules.evaluate(RunRules.java:20)
	at randomizedtesting.runner@2.8.3/com.carrotsearch.randomizedtesting.rules.StatementAdapter.evaluate(StatementAdapter.java:36)
	at randomizedtesting.runner@2.8.3/com.carrotsearch.randomizedtesting.ThreadLeakControl$StatementRunner.run(ThreadLeakControl.java:390)
	at randomizedtesting.runner@2.8.3/com.carrotsearch.randomizedtesting.ThreadLeakControl.forkTimeoutingTask(ThreadLeakControl.java:843)
	at randomizedtesting.runner@2.8.3/com.carrotsearch.randomizedtesting.ThreadLeakControl$3.evaluate(ThreadLeakControl.java:490)
	at randomizedtesting.runner@2.8.3/com.carrotsearch.randomizedtesting.RandomizedRunner.runSingleTest(RandomizedRunner.java:955)
	at randomizedtesting.runner@2.8.3/com.carrotsearch.randomizedtesting.RandomizedRunner$5.evaluate(RandomizedRunner.java:840)
	at randomizedtesting.runner@2.8.3/com.carrotsearch.randomizedtesting.RandomizedRunner$6.evaluate(RandomizedRunner.java:891)
	at randomizedtesting.runner@2.8.3/com.carrotsearch.randomizedtesting.RandomizedRunner$7.evaluate(RandomizedRunner.java:902)
	at org.apache.lucene.test_framework@11.0.0-SNAPSHOT/org.apache.lucene.tests.util.AbstractBeforeAfterRule$1.evaluate(AbstractBeforeAfterRule.java:43)
	at randomizedtesting.runner@2.8.3/com.carrotsearch.randomizedtesting.rules.StatementAdapter.evaluate(StatementAdapter.java:36)
	at org.apache.lucene.test_framework@11.0.0-SNAPSHOT/org.apache.lucene.tests.util.TestRuleStoreClassName$1.evaluate(TestRuleStoreClassName.java:38)
	at randomizedtesting.runner@2.8.3/com.carrotsearch.randomizedtesting.rules.NoShadowingOrOverridesOnMethodsRule$1.evaluate(NoShadowingOrOverridesOnMethodsRule.java:40)
	at randomizedtesting.runner@2.8.3/com.carrotsearch.randomizedtesting.rules.NoShadowingOrOverridesOnMethodsRule$1.evaluate(NoShadowingOrOverridesOnMethodsRule.java:40)
	at randomizedtesting.runner@2.8.3/com.carrotsearch.randomizedtesting.rules.StatementAdapter.evaluate(StatementAdapter.java:36)
	at randomizedtesting.runner@2.8.3/com.carrotsearch.randomizedtesting.rules.StatementAdapter.evaluate(StatementAdapter.java:36)
	at org.apache.lucene.test_framework@11.0.0-SNAPSHOT/org.apache.lucene.tests.util.TestRuleAssertionsRequired$1.evaluate(TestRuleAssertionsRequired.java:52)
	at org.apache.lucene.test_framework@11.0.0-SNAPSHOT/org.apache.lucene.tests.util.AbstractBeforeAfterRule$1.evaluate(AbstractBeforeAfterRule.java:43)
	at org.apache.lucene.test_framework@11.0.0-SNAPSHOT/org.apache.lucene.tests.util.TestRuleMarkFailure$1.evaluate(TestRuleMarkFailure.java:44)
	at org.apache.lucene.test_framework@11.0.0-SNAPSHOT/org.apache.lucene.tests.util.TestRuleIgnoreAfterMaxFailures$1.evaluate(TestRuleIgnoreAfterMaxFailures.java:60)
	at org.apache.lucene.test_framework@11.0.0-SNAPSHOT/org.apache.lucene.tests.util.TestRuleIgnoreTestSuites$1.evaluate(TestRuleIgnoreTestSuites.java:47)
	at junit@4.13.2/org.junit.rules.RunRules.evaluate(RunRules.java:20)
	at randomizedtesting.runner@2.8.3/com.carrotsearch.randomizedtesting.rules.StatementAdapter.evaluate(StatementAdapter.java:36)
	at randomizedtesting.runner@2.8.3/com.carrotsearch.randomizedtesting.ThreadLeakControl$StatementRunner.run(ThreadLeakControl.java:390)
	at randomizedtesting.runner@2.8.3/com.carrotsearch.randomizedtesting.ThreadLeakControl.lambda$forkTimeoutingTask$0(ThreadLeakControl.java:850)
	at java.base/java.lang.Thread.run(Thread.java:1474)




Build Log:
[...truncated 1673 lines...]
ERROR: 10 10 tests have failed:

  - org.apache.lucene.backward_codecs.lucene50.TestLucene50TermVectorsFormat.testMergeStability (:lucene:backward-codecs)
    Test output: /home/jenkins/jenkins-agent/workspace/Lucene/Lucene-NightlyTests-main/checkout/lucene/backward-codecs/build/test-results/test/outputs/OUTPUT-org.apache.lucene.backward_codecs.lucene50.TestLucene50TermVectorsFormat.txt
    Reproduce with: gradlew :lucene:backward-codecs:test --tests "org.apache.lucene.backward_codecs.lucene50.TestLucene50TermVectorsFormat.testMergeStability" -Ptests.asserts=true -Ptests.file.encoding=US-ASCII -Ptests.gui=true -Ptests.haltonfailure=false -Ptests.jvmargs= -Ptests.jvms=4 -Ptests.linedocsfile=/home/jenkins/jenkins-agent/workspace/Lucene/Lucene-NightlyTests-main/test-data/enwiki.random.lines.txt -Ptests.multiplier=2 -Ptests.nightly=true -Ptests.seed=6287B65127EA652 -Ptests.vectorsize=128

  - org.apache.lucene.backward_codecs.lucene50.TestLucene50StoredFieldsFormat.testMergeStability (:lucene:backward-codecs)
    Test output: /home/jenkins/jenkins-agent/workspace/Lucene/Lucene-NightlyTests-main/checkout/lucene/backward-codecs/build/test-results/test/outputs/OUTPUT-org.apache.lucene.backward_codecs.lucene50.TestLucene50StoredFieldsFormat.txt
    Reproduce with: gradlew :lucene:backward-codecs:test --tests "org.apache.lucene.backward_codecs.lucene50.TestLucene50StoredFieldsFormat.testMergeStability" -Ptests.asserts=true -Ptests.file.encoding=US-ASCII -Ptests.gui=true -Ptests.haltonfailure=false -Ptests.jvmargs= -Ptests.jvms=4 -Ptests.linedocsfile=/home/jenkins/jenkins-agent/workspace/Lucene/Lucene-NightlyTests-main/test-data/enwiki.random.lines.txt -Ptests.multiplier=2 -Ptests.nightly=true -Ptests.seed=6287B65127EA652 -Ptests.vectorsize=128

  - org.apache.lucene.backward_codecs.lucene50.TestLucene50StoredFieldsFormatMergeInstance.testMergeStability (:lucene:backward-codecs)
    Test output: /home/jenkins/jenkins-agent/workspace/Lucene/Lucene-NightlyTests-main/checkout/lucene/backward-codecs/build/test-results/test/outputs/OUTPUT-org.apache.lucene.backward_codecs.lucene50.TestLucene50StoredFieldsFormatMergeInstance.txt
    Reproduce with: gradlew :lucene:backward-codecs:test --tests "org.apache.lucene.backward_codecs.lucene50.TestLucene50StoredFieldsFormatMergeInstance.testMergeStability" -Ptests.asserts=true -Ptests.file.encoding=US-ASCII -Ptests.gui=true -Ptests.haltonfailure=false -Ptests.jvmargs= -Ptests.jvms=4 -Ptests.linedocsfile=/home/jenkins/jenkins-agent/workspace/Lucene/Lucene-NightlyTests-main/test-data/enwiki.random.lines.txt -Ptests.multiplier=2 -Ptests.nightly=true -Ptests.seed=6287B65127EA652 -Ptests.vectorsize=128

  - org.apache.lucene.backward_codecs.lucene60.TestLucene60FieldInfosFormat.testMergeStability (:lucene:backward-codecs)
    Test output: /home/jenkins/jenkins-agent/workspace/Lucene/Lucene-NightlyTests-main/checkout/lucene/backward-codecs/build/test-results/test/outputs/OUTPUT-org.apache.lucene.backward_codecs.lucene60.TestLucene60FieldInfosFormat.txt
    Reproduce with: gradlew :lucene:backward-codecs:test --tests "org.apache.lucene.backward_codecs.lucene60.TestLucene60FieldInfosFormat.testMergeStability" -Ptests.asserts=true -Ptests.file.encoding=US-ASCII -Ptests.gui=true -Ptests.haltonfailure=false -Ptests.jvmargs= -Ptests.jvms=4 -Ptests.linedocsfile=/home/jenkins/jenkins-agent/workspace/Lucene/Lucene-NightlyTests-main/test-data/enwiki.random.lines.txt -Ptests.multiplier=2 -Ptests.nightly=true -Ptests.seed=6287B65127EA652 -Ptests.vectorsize=128

  - org.apache.lucene.backward_codecs.lucene86.TestLucene86SegmentInfoFormat.testMergeStability (:lucene:backward-codecs)
    Test output: /home/jenkins/jenkins-agent/workspace/Lucene/Lucene-NightlyTests-main/checkout/lucene/backward-codecs/build/test-results/test/outputs/OUTPUT-org.apache.lucene.backward_codecs.lucene86.TestLucene86SegmentInfoFormat.txt
    Reproduce with: gradlew :lucene:backward-codecs:test --tests "org.apache.lucene.backward_codecs.lucene86.TestLucene86SegmentInfoFormat.testMergeStability" -Ptests.asserts=true -Ptests.file.encoding=US-ASCII -Ptests.gui=true -Ptests.haltonfailure=false -Ptests.jvmargs= -Ptests.jvms=4 -Ptests.linedocsfile=/home/jenkins/jenkins-agent/workspace/Lucene/Lucene-NightlyTests-main/test-data/enwiki.random.lines.txt -Ptests.multiplier=2 -Ptests.nightly=true -Ptests.seed=6287B65127EA652 -Ptests.vectorsize=128

  - org.apache.lucene.backward_codecs.lucene50.TestLucene50StoredFieldsFormatHighCompression.testMergeStability (:lucene:backward-codecs)
    Test output: /home/jenkins/jenkins-agent/workspace/Lucene/Lucene-NightlyTests-main/checkout/lucene/backward-codecs/build/test-results/test/outputs/OUTPUT-org.apache.lucene.backward_codecs.lucene50.TestLucene50StoredFieldsFormatHighCompression.txt
    Reproduce with: gradlew :lucene:backward-codecs:test --tests "org.apache.lucene.backward_codecs.lucene50.TestLucene50StoredFieldsFormatHighCompression.testMergeStability" -Ptests.asserts=true -Ptests.file.encoding=US-ASCII -Ptests.gui=true -Ptests.haltonfailure=false -Ptests.jvmargs= -Ptests.jvms=4 -Ptests.linedocsfile=/home/jenkins/jenkins-agent/workspace/Lucene/Lucene-NightlyTests-main/test-data/enwiki.random.lines.txt -Ptests.multiplier=2 -Ptests.nightly=true -Ptests.seed=6287B65127EA652 -Ptests.vectorsize=128

  - org.apache.lucene.backward_codecs.lucene70.TestLucene70SegmentInfoFormat.testMergeStability (:lucene:backward-codecs)
    Test output: /home/jenkins/jenkins-agent/workspace/Lucene/Lucene-NightlyTests-main/checkout/lucene/backward-codecs/build/test-results/test/outputs/OUTPUT-org.apache.lucene.backward_codecs.lucene70.TestLucene70SegmentInfoFormat.txt
    Reproduce with: gradlew :lucene:backward-codecs:test --tests "org.apache.lucene.backward_codecs.lucene70.TestLucene70SegmentInfoFormat.testMergeStability" -Ptests.asserts=true -Ptests.file.encoding=US-ASCII -Ptests.gui=true -Ptests.haltonfailure=false -Ptests.jvmargs= -Ptests.jvms=4 -Ptests.linedocsfile=/home/jenkins/jenkins-agent/workspace/Lucene/Lucene-NightlyTests-main/test-data/enwiki.random.lines.txt -Ptests.multiplier=2 -Ptests.nightly=true -Ptests.seed=6287B65127EA652 -Ptests.vectorsize=128

  - org.apache.lucene.backward_codecs.lucene87.TestLucene87StoredFieldsFormatMergeInstance.testMergeStability (:lucene:backward-codecs)
    Test output: /home/jenkins/jenkins-agent/workspace/Lucene/Lucene-NightlyTests-main/checkout/lucene/backward-codecs/build/test-results/test/outputs/OUTPUT-org.apache.lucene.backward_codecs.lucene87.TestLucene87StoredFieldsFormatMergeInstance.txt
    Reproduce with: gradlew :lucene:backward-codecs:test --tests "org.apache.lucene.backward_codecs.lucene87.TestLucene87StoredFieldsFormatMergeInstance.testMergeStability" -Ptests.asserts=true -Ptests.file.encoding=US-ASCII -Ptests.gui=true -Ptests.haltonfailure=false -Ptests.jvmargs= -Ptests.jvms=4 -Ptests.linedocsfile=/home/jenkins/jenkins-agent/workspace/Lucene/Lucene-NightlyTests-main/test-data/enwiki.random.lines.txt -Ptests.multiplier=2 -Ptests.nightly=true -Ptests.seed=6287B65127EA652 -Ptests.vectorsize=128

  - org.apache.lucene.backward_codecs.lucene87.TestLucene87StoredFieldsFormatHighCompression.testMergeStability (:lucene:backward-codecs)
    Test output: /home/jenkins/jenkins-agent/workspace/Lucene/Lucene-NightlyTests-main/checkout/lucene/backward-codecs/build/test-results/test/outputs/OUTPUT-org.apache.lucene.backward_codecs.lucene87.TestLucene87StoredFieldsFormatHighCompression.txt
    Reproduce with: gradlew :lucene:backward-codecs:test --tests "org.apache.lucene.backward_codecs.lucene87.TestLucene87StoredFieldsFormatHighCompression.testMergeStability" -Ptests.asserts=true -Ptests.file.encoding=US-ASCII -Ptests.gui=true -Ptests.haltonfailure=false -Ptests.jvmargs= -Ptests.jvms=4 -Ptests.linedocsfile=/home/jenkins/jenkins-agent/workspace/Lucene/Lucene-NightlyTests-main/test-data/enwiki.random.lines.txt -Ptests.multiplier=2 -Ptests.nightly=true -Ptests.seed=6287B65127EA652 -Ptests.vectorsize=128

  - org.apache.lucene.backward_codecs.lucene87.TestLucene87StoredFieldsFormat.testMergeStability (:lucene:backward-codecs)
    Test output: /home/jenkins/jenkins-agent/workspace/Lucene/Lucene-NightlyTests-main/checkout/lucene/backward-codecs/build/test-results/test/outputs/OUTPUT-org.apache.lucene.backward_codecs.lucene87.TestLucene87StoredFieldsFormat.txt
    Reproduce with: gradlew :lucene:backward-codecs:test --tests "org.apache.lucene.backward_codecs.lucene87.TestLucene87StoredFieldsFormat.testMergeStability" -Ptests.asserts=true -Ptests.file.encoding=US-ASCII -Ptests.gui=true -Ptests.haltonfailure=false -Ptests.jvmargs= -Ptests.jvms=4 -Ptests.linedocsfile=/home/jenkins/jenkins-agent/workspace/Lucene/Lucene-NightlyTests-main/test-data/enwiki.random.lines.txt -Ptests.multiplier=2 -Ptests.nightly=true -Ptests.seed=6287B65127EA652 -Ptests.vectorsize=128

The slowest tests during this run:
  1053.15s TestIDVersionPostingsFormat.testGlobalVersions (:lucene:sandbox)
  460.87s Test2BPostings.test (:lucene:core)
  390.93s TestStressNRTReplication.test (:lucene:replicator)
  315.26s TestDocumentsWriterStallControl.testAcquireReleaseRace (:lucene:core)
  298.50s TestSortedDvMultiRangeQuery.testDuelWithStandardDisjunction (:lucene:sandbox)
  252.05s TestBestCompressionLucene80DocValuesFormat.testNumericFieldJumpTables (:lucene:backward-codecs)
  245.80s TestBestSpeedLucene80DocValuesFormat.testNumericFieldJumpTables (:lucene:backward-codecs)
  242.32s TestLucene90DocValuesFormat.testNumericFieldJumpTables (:lucene:core)
  230.67s TestLucene90DocValuesFormatMergeInstance.testNumericFieldJumpTables (:lucene:core)
  212.33s TestSimpleTextPostingsFormat.testDocsAndFreqsAndPositionsAndOffsetsAndPayloads (:lucene:codecs)
The slowest suites during this run:
  1056.17s TestIDVersionPostingsFormat (:lucene:sandbox)
  685.23s TestSimpleTextPostingsFormat (:lucene:codecs)
  563.23s TestLucene90DocValuesFormat (:lucene:core)
  557.32s TestLucene90DocValuesFormatMergeInstance (:lucene:core)
  460.88s Test2BPostings (:lucene:core)
  447.25s TestBestCompressionLucene80DocValuesFormat (:lucene:backward-codecs)
  425.27s TestBestSpeedLucene80DocValuesFormat (:lucene:backward-codecs)
  391.32s TestStressNRTReplication (:lucene:replicator)
  315.27s TestDocumentsWriterStallControl (:lucene:core)
  298.65s TestSortedDvMultiRangeQuery (:lucene:sandbox)

[Incubating] Problems report is available at: file:///home/jenkins/jenkins-agent/workspace/Lucene/Lucene-NightlyTests-main/checkout/build/reports/problems/problems-report.html

BUILD SUCCESSFUL in 1h 41m 2s
294 actionable tasks: 149 executed, 145 up-to-date
Consider enabling configuration cache to speed up this build: https://docs.gradle.org/9.2.1/userguide/configuration_cache_enabling.html
Build step 'Invoke Gradle script' changed build result to SUCCESS
Archiving artifacts
‘**/build*/**/tests-cwd/*.hprof’ doesn’t match anything: ‘**’ exists but not ‘**/build*/**/tests-cwd/*.hprof’
No artifacts found that match the file pattern "**/build*/**/tests-cwd/*.hprof,**/*_pid*.log". Configuration error?
Recording test results
[Checks API] No suitable checks publisher found.
Build step 'Publish JUnit test result report' changed build result to UNSTABLE
Email was triggered for: Unstable (Test Failures)
Sending email for trigger: Unstable (Test Failures)

[JENKINS] Lucene » Lucene-NightlyTests-main - Build # 1903 - Still Unstable!

Posted by Apache Jenkins Server <je...@builds.apache.org>.
Build: https://ci-builds.apache.org/job/Lucene/job/Lucene-NightlyTests-main/1903/

10 tests failed.
FAILED:  org.apache.lucene.backward_codecs.lucene50.TestLucene50StoredFieldsFormat.testMergeStability

Error Message:
java.lang.AssertionError: expected:<{fnm=77, fdt=75478, fdx=94, fdm=158}> but was:<{cfs=75869, cfe=150}>

Stack Trace:
java.lang.AssertionError: expected:<{fnm=77, fdt=75478, fdx=94, fdm=158}> but was:<{cfs=75869, cfe=150}>
	at __randomizedtesting.SeedInfo.seed([37D0A4589052930D:439CE2779DB891BB]:0)
	at junit@4.13.2/org.junit.Assert.fail(Assert.java:89)
	at junit@4.13.2/org.junit.Assert.failNotEquals(Assert.java:835)
	at junit@4.13.2/org.junit.Assert.assertEquals(Assert.java:120)
	at junit@4.13.2/org.junit.Assert.assertEquals(Assert.java:146)
	at org.apache.lucene.test_framework@11.0.0-SNAPSHOT/org.apache.lucene.tests.index.BaseIndexFileFormatTestCase.testMergeStability(BaseIndexFileFormatTestCase.java:306)
	at java.base/jdk.internal.reflect.DirectMethodHandleAccessor.invoke(DirectMethodHandleAccessor.java:104)
	at java.base/java.lang.reflect.Method.invoke(Method.java:565)
	at randomizedtesting.runner@2.8.3/com.carrotsearch.randomizedtesting.RandomizedRunner.invoke(RandomizedRunner.java:1763)
	at randomizedtesting.runner@2.8.3/com.carrotsearch.randomizedtesting.RandomizedRunner$8.evaluate(RandomizedRunner.java:946)
	at randomizedtesting.runner@2.8.3/com.carrotsearch.randomizedtesting.RandomizedRunner$9.evaluate(RandomizedRunner.java:982)
	at randomizedtesting.runner@2.8.3/com.carrotsearch.randomizedtesting.RandomizedRunner$10.evaluate(RandomizedRunner.java:996)
	at org.apache.lucene.test_framework@11.0.0-SNAPSHOT/org.apache.lucene.tests.util.TestRuleSetupTeardownChained$1.evaluate(TestRuleSetupTeardownChained.java:48)
	at org.apache.lucene.test_framework@11.0.0-SNAPSHOT/org.apache.lucene.tests.util.AbstractBeforeAfterRule$1.evaluate(AbstractBeforeAfterRule.java:43)
	at org.apache.lucene.test_framework@11.0.0-SNAPSHOT/org.apache.lucene.tests.util.TestRuleThreadAndTestName$1.evaluate(TestRuleThreadAndTestName.java:45)
	at org.apache.lucene.test_framework@11.0.0-SNAPSHOT/org.apache.lucene.tests.util.TestRuleIgnoreAfterMaxFailures$1.evaluate(TestRuleIgnoreAfterMaxFailures.java:60)
	at org.apache.lucene.test_framework@11.0.0-SNAPSHOT/org.apache.lucene.tests.util.TestRuleMarkFailure$1.evaluate(TestRuleMarkFailure.java:44)
	at junit@4.13.2/org.junit.rules.RunRules.evaluate(RunRules.java:20)
	at randomizedtesting.runner@2.8.3/com.carrotsearch.randomizedtesting.rules.StatementAdapter.evaluate(StatementAdapter.java:36)
	at randomizedtesting.runner@2.8.3/com.carrotsearch.randomizedtesting.ThreadLeakControl$StatementRunner.run(ThreadLeakControl.java:390)
	at randomizedtesting.runner@2.8.3/com.carrotsearch.randomizedtesting.ThreadLeakControl.forkTimeoutingTask(ThreadLeakControl.java:843)
	at randomizedtesting.runner@2.8.3/com.carrotsearch.randomizedtesting.ThreadLeakControl$3.evaluate(ThreadLeakControl.java:490)
	at randomizedtesting.runner@2.8.3/com.carrotsearch.randomizedtesting.RandomizedRunner.runSingleTest(RandomizedRunner.java:955)
	at randomizedtesting.runner@2.8.3/com.carrotsearch.randomizedtesting.RandomizedRunner$5.evaluate(RandomizedRunner.java:840)
	at randomizedtesting.runner@2.8.3/com.carrotsearch.randomizedtesting.RandomizedRunner$6.evaluate(RandomizedRunner.java:891)
	at randomizedtesting.runner@2.8.3/com.carrotsearch.randomizedtesting.RandomizedRunner$7.evaluate(RandomizedRunner.java:902)
	at org.apache.lucene.test_framework@11.0.0-SNAPSHOT/org.apache.lucene.tests.util.AbstractBeforeAfterRule$1.evaluate(AbstractBeforeAfterRule.java:43)
	at randomizedtesting.runner@2.8.3/com.carrotsearch.randomizedtesting.rules.StatementAdapter.evaluate(StatementAdapter.java:36)
	at org.apache.lucene.test_framework@11.0.0-SNAPSHOT/org.apache.lucene.tests.util.TestRuleStoreClassName$1.evaluate(TestRuleStoreClassName.java:38)
	at randomizedtesting.runner@2.8.3/com.carrotsearch.randomizedtesting.rules.NoShadowingOrOverridesOnMethodsRule$1.evaluate(NoShadowingOrOverridesOnMethodsRule.java:40)
	at randomizedtesting.runner@2.8.3/com.carrotsearch.randomizedtesting.rules.NoShadowingOrOverridesOnMethodsRule$1.evaluate(NoShadowingOrOverridesOnMethodsRule.java:40)
	at randomizedtesting.runner@2.8.3/com.carrotsearch.randomizedtesting.rules.StatementAdapter.evaluate(StatementAdapter.java:36)
	at randomizedtesting.runner@2.8.3/com.carrotsearch.randomizedtesting.rules.StatementAdapter.evaluate(StatementAdapter.java:36)
	at org.apache.lucene.test_framework@11.0.0-SNAPSHOT/org.apache.lucene.tests.util.TestRuleAssertionsRequired$1.evaluate(TestRuleAssertionsRequired.java:52)
	at org.apache.lucene.test_framework@11.0.0-SNAPSHOT/org.apache.lucene.tests.util.AbstractBeforeAfterRule$1.evaluate(AbstractBeforeAfterRule.java:43)
	at org.apache.lucene.test_framework@11.0.0-SNAPSHOT/org.apache.lucene.tests.util.TestRuleMarkFailure$1.evaluate(TestRuleMarkFailure.java:44)
	at org.apache.lucene.test_framework@11.0.0-SNAPSHOT/org.apache.lucene.tests.util.TestRuleIgnoreAfterMaxFailures$1.evaluate(TestRuleIgnoreAfterMaxFailures.java:60)
	at org.apache.lucene.test_framework@11.0.0-SNAPSHOT/org.apache.lucene.tests.util.TestRuleIgnoreTestSuites$1.evaluate(TestRuleIgnoreTestSuites.java:47)
	at junit@4.13.2/org.junit.rules.RunRules.evaluate(RunRules.java:20)
	at randomizedtesting.runner@2.8.3/com.carrotsearch.randomizedtesting.rules.StatementAdapter.evaluate(StatementAdapter.java:36)
	at randomizedtesting.runner@2.8.3/com.carrotsearch.randomizedtesting.ThreadLeakControl$StatementRunner.run(ThreadLeakControl.java:390)
	at randomizedtesting.runner@2.8.3/com.carrotsearch.randomizedtesting.ThreadLeakControl.lambda$forkTimeoutingTask$0(ThreadLeakControl.java:850)
	at java.base/java.lang.Thread.run(Thread.java:1474)


FAILED:  org.apache.lucene.backward_codecs.lucene50.TestLucene50StoredFieldsFormatHighCompression.testMergeStability

Error Message:
java.lang.AssertionError: expected:<{fnm=77, fdt=49671, fdx=80, fdm=159}> but was:<{cfs=50049, cfe=150}>

Stack Trace:
java.lang.AssertionError: expected:<{fnm=77, fdt=49671, fdx=80, fdm=159}> but was:<{cfs=50049, cfe=150}>
	at __randomizedtesting.SeedInfo.seed([37D0A4589052930D:439CE2779DB891BB]:0)
	at junit@4.13.2/org.junit.Assert.fail(Assert.java:89)
	at junit@4.13.2/org.junit.Assert.failNotEquals(Assert.java:835)
	at junit@4.13.2/org.junit.Assert.assertEquals(Assert.java:120)
	at junit@4.13.2/org.junit.Assert.assertEquals(Assert.java:146)
	at org.apache.lucene.test_framework@11.0.0-SNAPSHOT/org.apache.lucene.tests.index.BaseIndexFileFormatTestCase.testMergeStability(BaseIndexFileFormatTestCase.java:306)
	at java.base/jdk.internal.reflect.DirectMethodHandleAccessor.invoke(DirectMethodHandleAccessor.java:104)
	at java.base/java.lang.reflect.Method.invoke(Method.java:565)
	at randomizedtesting.runner@2.8.3/com.carrotsearch.randomizedtesting.RandomizedRunner.invoke(RandomizedRunner.java:1763)
	at randomizedtesting.runner@2.8.3/com.carrotsearch.randomizedtesting.RandomizedRunner$8.evaluate(RandomizedRunner.java:946)
	at randomizedtesting.runner@2.8.3/com.carrotsearch.randomizedtesting.RandomizedRunner$9.evaluate(RandomizedRunner.java:982)
	at randomizedtesting.runner@2.8.3/com.carrotsearch.randomizedtesting.RandomizedRunner$10.evaluate(RandomizedRunner.java:996)
	at org.apache.lucene.test_framework@11.0.0-SNAPSHOT/org.apache.lucene.tests.util.TestRuleSetupTeardownChained$1.evaluate(TestRuleSetupTeardownChained.java:48)
	at org.apache.lucene.test_framework@11.0.0-SNAPSHOT/org.apache.lucene.tests.util.AbstractBeforeAfterRule$1.evaluate(AbstractBeforeAfterRule.java:43)
	at org.apache.lucene.test_framework@11.0.0-SNAPSHOT/org.apache.lucene.tests.util.TestRuleThreadAndTestName$1.evaluate(TestRuleThreadAndTestName.java:45)
	at org.apache.lucene.test_framework@11.0.0-SNAPSHOT/org.apache.lucene.tests.util.TestRuleIgnoreAfterMaxFailures$1.evaluate(TestRuleIgnoreAfterMaxFailures.java:60)
	at org.apache.lucene.test_framework@11.0.0-SNAPSHOT/org.apache.lucene.tests.util.TestRuleMarkFailure$1.evaluate(TestRuleMarkFailure.java:44)
	at junit@4.13.2/org.junit.rules.RunRules.evaluate(RunRules.java:20)
	at randomizedtesting.runner@2.8.3/com.carrotsearch.randomizedtesting.rules.StatementAdapter.evaluate(StatementAdapter.java:36)
	at randomizedtesting.runner@2.8.3/com.carrotsearch.randomizedtesting.ThreadLeakControl$StatementRunner.run(ThreadLeakControl.java:390)
	at randomizedtesting.runner@2.8.3/com.carrotsearch.randomizedtesting.ThreadLeakControl.forkTimeoutingTask(ThreadLeakControl.java:843)
	at randomizedtesting.runner@2.8.3/com.carrotsearch.randomizedtesting.ThreadLeakControl$3.evaluate(ThreadLeakControl.java:490)
	at randomizedtesting.runner@2.8.3/com.carrotsearch.randomizedtesting.RandomizedRunner.runSingleTest(RandomizedRunner.java:955)
	at randomizedtesting.runner@2.8.3/com.carrotsearch.randomizedtesting.RandomizedRunner$5.evaluate(RandomizedRunner.java:840)
	at randomizedtesting.runner@2.8.3/com.carrotsearch.randomizedtesting.RandomizedRunner$6.evaluate(RandomizedRunner.java:891)
	at randomizedtesting.runner@2.8.3/com.carrotsearch.randomizedtesting.RandomizedRunner$7.evaluate(RandomizedRunner.java:902)
	at org.apache.lucene.test_framework@11.0.0-SNAPSHOT/org.apache.lucene.tests.util.AbstractBeforeAfterRule$1.evaluate(AbstractBeforeAfterRule.java:43)
	at randomizedtesting.runner@2.8.3/com.carrotsearch.randomizedtesting.rules.StatementAdapter.evaluate(StatementAdapter.java:36)
	at org.apache.lucene.test_framework@11.0.0-SNAPSHOT/org.apache.lucene.tests.util.TestRuleStoreClassName$1.evaluate(TestRuleStoreClassName.java:38)
	at randomizedtesting.runner@2.8.3/com.carrotsearch.randomizedtesting.rules.NoShadowingOrOverridesOnMethodsRule$1.evaluate(NoShadowingOrOverridesOnMethodsRule.java:40)
	at randomizedtesting.runner@2.8.3/com.carrotsearch.randomizedtesting.rules.NoShadowingOrOverridesOnMethodsRule$1.evaluate(NoShadowingOrOverridesOnMethodsRule.java:40)
	at randomizedtesting.runner@2.8.3/com.carrotsearch.randomizedtesting.rules.StatementAdapter.evaluate(StatementAdapter.java:36)
	at randomizedtesting.runner@2.8.3/com.carrotsearch.randomizedtesting.rules.StatementAdapter.evaluate(StatementAdapter.java:36)
	at org.apache.lucene.test_framework@11.0.0-SNAPSHOT/org.apache.lucene.tests.util.TestRuleAssertionsRequired$1.evaluate(TestRuleAssertionsRequired.java:52)
	at org.apache.lucene.test_framework@11.0.0-SNAPSHOT/org.apache.lucene.tests.util.AbstractBeforeAfterRule$1.evaluate(AbstractBeforeAfterRule.java:43)
	at org.apache.lucene.test_framework@11.0.0-SNAPSHOT/org.apache.lucene.tests.util.TestRuleMarkFailure$1.evaluate(TestRuleMarkFailure.java:44)
	at org.apache.lucene.test_framework@11.0.0-SNAPSHOT/org.apache.lucene.tests.util.TestRuleIgnoreAfterMaxFailures$1.evaluate(TestRuleIgnoreAfterMaxFailures.java:60)
	at org.apache.lucene.test_framework@11.0.0-SNAPSHOT/org.apache.lucene.tests.util.TestRuleIgnoreTestSuites$1.evaluate(TestRuleIgnoreTestSuites.java:47)
	at junit@4.13.2/org.junit.rules.RunRules.evaluate(RunRules.java:20)
	at randomizedtesting.runner@2.8.3/com.carrotsearch.randomizedtesting.rules.StatementAdapter.evaluate(StatementAdapter.java:36)
	at randomizedtesting.runner@2.8.3/com.carrotsearch.randomizedtesting.ThreadLeakControl$StatementRunner.run(ThreadLeakControl.java:390)
	at randomizedtesting.runner@2.8.3/com.carrotsearch.randomizedtesting.ThreadLeakControl.lambda$forkTimeoutingTask$0(ThreadLeakControl.java:850)
	at java.base/java.lang.Thread.run(Thread.java:1474)


FAILED:  org.apache.lucene.backward_codecs.lucene50.TestLucene50StoredFieldsFormatMergeInstance.testMergeStability

Error Message:
java.lang.AssertionError: expected:<{fnm=77, fdt=75478, fdx=94, fdm=158}> but was:<{cfs=75869, cfe=150}>

Stack Trace:
java.lang.AssertionError: expected:<{fnm=77, fdt=75478, fdx=94, fdm=158}> but was:<{cfs=75869, cfe=150}>
	at __randomizedtesting.SeedInfo.seed([37D0A4589052930D:439CE2779DB891BB]:0)
	at junit@4.13.2/org.junit.Assert.fail(Assert.java:89)
	at junit@4.13.2/org.junit.Assert.failNotEquals(Assert.java:835)
	at junit@4.13.2/org.junit.Assert.assertEquals(Assert.java:120)
	at junit@4.13.2/org.junit.Assert.assertEquals(Assert.java:146)
	at org.apache.lucene.test_framework@11.0.0-SNAPSHOT/org.apache.lucene.tests.index.BaseIndexFileFormatTestCase.testMergeStability(BaseIndexFileFormatTestCase.java:306)
	at java.base/jdk.internal.reflect.DirectMethodHandleAccessor.invoke(DirectMethodHandleAccessor.java:104)
	at java.base/java.lang.reflect.Method.invoke(Method.java:565)
	at randomizedtesting.runner@2.8.3/com.carrotsearch.randomizedtesting.RandomizedRunner.invoke(RandomizedRunner.java:1763)
	at randomizedtesting.runner@2.8.3/com.carrotsearch.randomizedtesting.RandomizedRunner$8.evaluate(RandomizedRunner.java:946)
	at randomizedtesting.runner@2.8.3/com.carrotsearch.randomizedtesting.RandomizedRunner$9.evaluate(RandomizedRunner.java:982)
	at randomizedtesting.runner@2.8.3/com.carrotsearch.randomizedtesting.RandomizedRunner$10.evaluate(RandomizedRunner.java:996)
	at org.apache.lucene.test_framework@11.0.0-SNAPSHOT/org.apache.lucene.tests.util.TestRuleSetupTeardownChained$1.evaluate(TestRuleSetupTeardownChained.java:48)
	at org.apache.lucene.test_framework@11.0.0-SNAPSHOT/org.apache.lucene.tests.util.AbstractBeforeAfterRule$1.evaluate(AbstractBeforeAfterRule.java:43)
	at org.apache.lucene.test_framework@11.0.0-SNAPSHOT/org.apache.lucene.tests.util.TestRuleThreadAndTestName$1.evaluate(TestRuleThreadAndTestName.java:45)
	at org.apache.lucene.test_framework@11.0.0-SNAPSHOT/org.apache.lucene.tests.util.TestRuleIgnoreAfterMaxFailures$1.evaluate(TestRuleIgnoreAfterMaxFailures.java:60)
	at org.apache.lucene.test_framework@11.0.0-SNAPSHOT/org.apache.lucene.tests.util.TestRuleMarkFailure$1.evaluate(TestRuleMarkFailure.java:44)
	at junit@4.13.2/org.junit.rules.RunRules.evaluate(RunRules.java:20)
	at randomizedtesting.runner@2.8.3/com.carrotsearch.randomizedtesting.rules.StatementAdapter.evaluate(StatementAdapter.java:36)
	at randomizedtesting.runner@2.8.3/com.carrotsearch.randomizedtesting.ThreadLeakControl$StatementRunner.run(ThreadLeakControl.java:390)
	at randomizedtesting.runner@2.8.3/com.carrotsearch.randomizedtesting.ThreadLeakControl.forkTimeoutingTask(ThreadLeakControl.java:843)
	at randomizedtesting.runner@2.8.3/com.carrotsearch.randomizedtesting.ThreadLeakControl$3.evaluate(ThreadLeakControl.java:490)
	at randomizedtesting.runner@2.8.3/com.carrotsearch.randomizedtesting.RandomizedRunner.runSingleTest(RandomizedRunner.java:955)
	at randomizedtesting.runner@2.8.3/com.carrotsearch.randomizedtesting.RandomizedRunner$5.evaluate(RandomizedRunner.java:840)
	at randomizedtesting.runner@2.8.3/com.carrotsearch.randomizedtesting.RandomizedRunner$6.evaluate(RandomizedRunner.java:891)
	at randomizedtesting.runner@2.8.3/com.carrotsearch.randomizedtesting.RandomizedRunner$7.evaluate(RandomizedRunner.java:902)
	at org.apache.lucene.test_framework@11.0.0-SNAPSHOT/org.apache.lucene.tests.util.AbstractBeforeAfterRule$1.evaluate(AbstractBeforeAfterRule.java:43)
	at randomizedtesting.runner@2.8.3/com.carrotsearch.randomizedtesting.rules.StatementAdapter.evaluate(StatementAdapter.java:36)
	at org.apache.lucene.test_framework@11.0.0-SNAPSHOT/org.apache.lucene.tests.util.TestRuleStoreClassName$1.evaluate(TestRuleStoreClassName.java:38)
	at randomizedtesting.runner@2.8.3/com.carrotsearch.randomizedtesting.rules.NoShadowingOrOverridesOnMethodsRule$1.evaluate(NoShadowingOrOverridesOnMethodsRule.java:40)
	at randomizedtesting.runner@2.8.3/com.carrotsearch.randomizedtesting.rules.NoShadowingOrOverridesOnMethodsRule$1.evaluate(NoShadowingOrOverridesOnMethodsRule.java:40)
	at randomizedtesting.runner@2.8.3/com.carrotsearch.randomizedtesting.rules.StatementAdapter.evaluate(StatementAdapter.java:36)
	at randomizedtesting.runner@2.8.3/com.carrotsearch.randomizedtesting.rules.StatementAdapter.evaluate(StatementAdapter.java:36)
	at org.apache.lucene.test_framework@11.0.0-SNAPSHOT/org.apache.lucene.tests.util.TestRuleAssertionsRequired$1.evaluate(TestRuleAssertionsRequired.java:52)
	at org.apache.lucene.test_framework@11.0.0-SNAPSHOT/org.apache.lucene.tests.util.AbstractBeforeAfterRule$1.evaluate(AbstractBeforeAfterRule.java:43)
	at org.apache.lucene.test_framework@11.0.0-SNAPSHOT/org.apache.lucene.tests.util.TestRuleMarkFailure$1.evaluate(TestRuleMarkFailure.java:44)
	at org.apache.lucene.test_framework@11.0.0-SNAPSHOT/org.apache.lucene.tests.util.TestRuleIgnoreAfterMaxFailures$1.evaluate(TestRuleIgnoreAfterMaxFailures.java:60)
	at org.apache.lucene.test_framework@11.0.0-SNAPSHOT/org.apache.lucene.tests.util.TestRuleIgnoreTestSuites$1.evaluate(TestRuleIgnoreTestSuites.java:47)
	at junit@4.13.2/org.junit.rules.RunRules.evaluate(RunRules.java:20)
	at randomizedtesting.runner@2.8.3/com.carrotsearch.randomizedtesting.rules.StatementAdapter.evaluate(StatementAdapter.java:36)
	at randomizedtesting.runner@2.8.3/com.carrotsearch.randomizedtesting.ThreadLeakControl$StatementRunner.run(ThreadLeakControl.java:390)
	at randomizedtesting.runner@2.8.3/com.carrotsearch.randomizedtesting.ThreadLeakControl.lambda$forkTimeoutingTask$0(ThreadLeakControl.java:850)
	at java.base/java.lang.Thread.run(Thread.java:1474)


FAILED:  org.apache.lucene.backward_codecs.lucene50.TestLucene50TermVectorsFormat.testMergeStability

Error Message:
java.lang.AssertionError: expected:<{tvd=30049, fnm=686, nvm=283, pay=77, tvm=162, tmd=826, fdm=159, pos=133720, fdt=93, tvx=93, doc=14533, tim=23558, tip=95, fdx=72, nvd=20102}> but was:<{cfs=224570, cfe=447}>

Stack Trace:
java.lang.AssertionError: expected:<{tvd=30049, fnm=686, nvm=283, pay=77, tvm=162, tmd=826, fdm=159, pos=133720, fdt=93, tvx=93, doc=14533, tim=23558, tip=95, fdx=72, nvd=20102}> but was:<{cfs=224570, cfe=447}>
	at __randomizedtesting.SeedInfo.seed([37D0A4589052930D:439CE2779DB891BB]:0)
	at junit@4.13.2/org.junit.Assert.fail(Assert.java:89)
	at junit@4.13.2/org.junit.Assert.failNotEquals(Assert.java:835)
	at junit@4.13.2/org.junit.Assert.assertEquals(Assert.java:120)
	at junit@4.13.2/org.junit.Assert.assertEquals(Assert.java:146)
	at org.apache.lucene.test_framework@11.0.0-SNAPSHOT/org.apache.lucene.tests.index.BaseIndexFileFormatTestCase.testMergeStability(BaseIndexFileFormatTestCase.java:306)
	at java.base/jdk.internal.reflect.DirectMethodHandleAccessor.invoke(DirectMethodHandleAccessor.java:104)
	at java.base/java.lang.reflect.Method.invoke(Method.java:565)
	at randomizedtesting.runner@2.8.3/com.carrotsearch.randomizedtesting.RandomizedRunner.invoke(RandomizedRunner.java:1763)
	at randomizedtesting.runner@2.8.3/com.carrotsearch.randomizedtesting.RandomizedRunner$8.evaluate(RandomizedRunner.java:946)
	at randomizedtesting.runner@2.8.3/com.carrotsearch.randomizedtesting.RandomizedRunner$9.evaluate(RandomizedRunner.java:982)
	at randomizedtesting.runner@2.8.3/com.carrotsearch.randomizedtesting.RandomizedRunner$10.evaluate(RandomizedRunner.java:996)
	at org.apache.lucene.test_framework@11.0.0-SNAPSHOT/org.apache.lucene.tests.util.TestRuleSetupTeardownChained$1.evaluate(TestRuleSetupTeardownChained.java:48)
	at org.apache.lucene.test_framework@11.0.0-SNAPSHOT/org.apache.lucene.tests.util.AbstractBeforeAfterRule$1.evaluate(AbstractBeforeAfterRule.java:43)
	at org.apache.lucene.test_framework@11.0.0-SNAPSHOT/org.apache.lucene.tests.util.TestRuleThreadAndTestName$1.evaluate(TestRuleThreadAndTestName.java:45)
	at org.apache.lucene.test_framework@11.0.0-SNAPSHOT/org.apache.lucene.tests.util.TestRuleIgnoreAfterMaxFailures$1.evaluate(TestRuleIgnoreAfterMaxFailures.java:60)
	at org.apache.lucene.test_framework@11.0.0-SNAPSHOT/org.apache.lucene.tests.util.TestRuleMarkFailure$1.evaluate(TestRuleMarkFailure.java:44)
	at junit@4.13.2/org.junit.rules.RunRules.evaluate(RunRules.java:20)
	at randomizedtesting.runner@2.8.3/com.carrotsearch.randomizedtesting.rules.StatementAdapter.evaluate(StatementAdapter.java:36)
	at randomizedtesting.runner@2.8.3/com.carrotsearch.randomizedtesting.ThreadLeakControl$StatementRunner.run(ThreadLeakControl.java:390)
	at randomizedtesting.runner@2.8.3/com.carrotsearch.randomizedtesting.ThreadLeakControl.forkTimeoutingTask(ThreadLeakControl.java:843)
	at randomizedtesting.runner@2.8.3/com.carrotsearch.randomizedtesting.ThreadLeakControl$3.evaluate(ThreadLeakControl.java:490)
	at randomizedtesting.runner@2.8.3/com.carrotsearch.randomizedtesting.RandomizedRunner.runSingleTest(RandomizedRunner.java:955)
	at randomizedtesting.runner@2.8.3/com.carrotsearch.randomizedtesting.RandomizedRunner$5.evaluate(RandomizedRunner.java:840)
	at randomizedtesting.runner@2.8.3/com.carrotsearch.randomizedtesting.RandomizedRunner$6.evaluate(RandomizedRunner.java:891)
	at randomizedtesting.runner@2.8.3/com.carrotsearch.randomizedtesting.RandomizedRunner$7.evaluate(RandomizedRunner.java:902)
	at org.apache.lucene.test_framework@11.0.0-SNAPSHOT/org.apache.lucene.tests.util.AbstractBeforeAfterRule$1.evaluate(AbstractBeforeAfterRule.java:43)
	at randomizedtesting.runner@2.8.3/com.carrotsearch.randomizedtesting.rules.StatementAdapter.evaluate(StatementAdapter.java:36)
	at org.apache.lucene.test_framework@11.0.0-SNAPSHOT/org.apache.lucene.tests.util.TestRuleStoreClassName$1.evaluate(TestRuleStoreClassName.java:38)
	at randomizedtesting.runner@2.8.3/com.carrotsearch.randomizedtesting.rules.NoShadowingOrOverridesOnMethodsRule$1.evaluate(NoShadowingOrOverridesOnMethodsRule.java:40)
	at randomizedtesting.runner@2.8.3/com.carrotsearch.randomizedtesting.rules.NoShadowingOrOverridesOnMethodsRule$1.evaluate(NoShadowingOrOverridesOnMethodsRule.java:40)
	at randomizedtesting.runner@2.8.3/com.carrotsearch.randomizedtesting.rules.StatementAdapter.evaluate(StatementAdapter.java:36)
	at randomizedtesting.runner@2.8.3/com.carrotsearch.randomizedtesting.rules.StatementAdapter.evaluate(StatementAdapter.java:36)
	at org.apache.lucene.test_framework@11.0.0-SNAPSHOT/org.apache.lucene.tests.util.TestRuleAssertionsRequired$1.evaluate(TestRuleAssertionsRequired.java:52)
	at org.apache.lucene.test_framework@11.0.0-SNAPSHOT/org.apache.lucene.tests.util.AbstractBeforeAfterRule$1.evaluate(AbstractBeforeAfterRule.java:43)
	at org.apache.lucene.test_framework@11.0.0-SNAPSHOT/org.apache.lucene.tests.util.TestRuleMarkFailure$1.evaluate(TestRuleMarkFailure.java:44)
	at org.apache.lucene.test_framework@11.0.0-SNAPSHOT/org.apache.lucene.tests.util.TestRuleIgnoreAfterMaxFailures$1.evaluate(TestRuleIgnoreAfterMaxFailures.java:60)
	at org.apache.lucene.test_framework@11.0.0-SNAPSHOT/org.apache.lucene.tests.util.TestRuleIgnoreTestSuites$1.evaluate(TestRuleIgnoreTestSuites.java:47)
	at junit@4.13.2/org.junit.rules.RunRules.evaluate(RunRules.java:20)
	at randomizedtesting.runner@2.8.3/com.carrotsearch.randomizedtesting.rules.StatementAdapter.evaluate(StatementAdapter.java:36)
	at randomizedtesting.runner@2.8.3/com.carrotsearch.randomizedtesting.ThreadLeakControl$StatementRunner.run(ThreadLeakControl.java:390)
	at randomizedtesting.runner@2.8.3/com.carrotsearch.randomizedtesting.ThreadLeakControl.lambda$forkTimeoutingTask$0(ThreadLeakControl.java:850)
	at java.base/java.lang.Thread.run(Thread.java:1474)


FAILED:  org.apache.lucene.backward_codecs.lucene60.TestLucene60FieldInfosFormat.testMergeStability

Error Message:
java.lang.AssertionError: expected:<{fnm=82, fdt=10836, fdx=88, fdm=158}> but was:<{cfs=11226, cfe=150}>

Stack Trace:
java.lang.AssertionError: expected:<{fnm=82, fdt=10836, fdx=88, fdm=158}> but was:<{cfs=11226, cfe=150}>
	at __randomizedtesting.SeedInfo.seed([37D0A4589052930D:439CE2779DB891BB]:0)
	at junit@4.13.2/org.junit.Assert.fail(Assert.java:89)
	at junit@4.13.2/org.junit.Assert.failNotEquals(Assert.java:835)
	at junit@4.13.2/org.junit.Assert.assertEquals(Assert.java:120)
	at junit@4.13.2/org.junit.Assert.assertEquals(Assert.java:146)
	at org.apache.lucene.test_framework@11.0.0-SNAPSHOT/org.apache.lucene.tests.index.BaseIndexFileFormatTestCase.testMergeStability(BaseIndexFileFormatTestCase.java:306)
	at java.base/jdk.internal.reflect.DirectMethodHandleAccessor.invoke(DirectMethodHandleAccessor.java:104)
	at java.base/java.lang.reflect.Method.invoke(Method.java:565)
	at randomizedtesting.runner@2.8.3/com.carrotsearch.randomizedtesting.RandomizedRunner.invoke(RandomizedRunner.java:1763)
	at randomizedtesting.runner@2.8.3/com.carrotsearch.randomizedtesting.RandomizedRunner$8.evaluate(RandomizedRunner.java:946)
	at randomizedtesting.runner@2.8.3/com.carrotsearch.randomizedtesting.RandomizedRunner$9.evaluate(RandomizedRunner.java:982)
	at randomizedtesting.runner@2.8.3/com.carrotsearch.randomizedtesting.RandomizedRunner$10.evaluate(RandomizedRunner.java:996)
	at org.apache.lucene.test_framework@11.0.0-SNAPSHOT/org.apache.lucene.tests.util.TestRuleSetupTeardownChained$1.evaluate(TestRuleSetupTeardownChained.java:48)
	at org.apache.lucene.test_framework@11.0.0-SNAPSHOT/org.apache.lucene.tests.util.AbstractBeforeAfterRule$1.evaluate(AbstractBeforeAfterRule.java:43)
	at org.apache.lucene.test_framework@11.0.0-SNAPSHOT/org.apache.lucene.tests.util.TestRuleThreadAndTestName$1.evaluate(TestRuleThreadAndTestName.java:45)
	at org.apache.lucene.test_framework@11.0.0-SNAPSHOT/org.apache.lucene.tests.util.TestRuleIgnoreAfterMaxFailures$1.evaluate(TestRuleIgnoreAfterMaxFailures.java:60)
	at org.apache.lucene.test_framework@11.0.0-SNAPSHOT/org.apache.lucene.tests.util.TestRuleMarkFailure$1.evaluate(TestRuleMarkFailure.java:44)
	at junit@4.13.2/org.junit.rules.RunRules.evaluate(RunRules.java:20)
	at randomizedtesting.runner@2.8.3/com.carrotsearch.randomizedtesting.rules.StatementAdapter.evaluate(StatementAdapter.java:36)
	at randomizedtesting.runner@2.8.3/com.carrotsearch.randomizedtesting.ThreadLeakControl$StatementRunner.run(ThreadLeakControl.java:390)
	at randomizedtesting.runner@2.8.3/com.carrotsearch.randomizedtesting.ThreadLeakControl.forkTimeoutingTask(ThreadLeakControl.java:843)
	at randomizedtesting.runner@2.8.3/com.carrotsearch.randomizedtesting.ThreadLeakControl$3.evaluate(ThreadLeakControl.java:490)
	at randomizedtesting.runner@2.8.3/com.carrotsearch.randomizedtesting.RandomizedRunner.runSingleTest(RandomizedRunner.java:955)
	at randomizedtesting.runner@2.8.3/com.carrotsearch.randomizedtesting.RandomizedRunner$5.evaluate(RandomizedRunner.java:840)
	at randomizedtesting.runner@2.8.3/com.carrotsearch.randomizedtesting.RandomizedRunner$6.evaluate(RandomizedRunner.java:891)
	at randomizedtesting.runner@2.8.3/com.carrotsearch.randomizedtesting.RandomizedRunner$7.evaluate(RandomizedRunner.java:902)
	at org.apache.lucene.test_framework@11.0.0-SNAPSHOT/org.apache.lucene.tests.util.AbstractBeforeAfterRule$1.evaluate(AbstractBeforeAfterRule.java:43)
	at randomizedtesting.runner@2.8.3/com.carrotsearch.randomizedtesting.rules.StatementAdapter.evaluate(StatementAdapter.java:36)
	at org.apache.lucene.test_framework@11.0.0-SNAPSHOT/org.apache.lucene.tests.util.TestRuleStoreClassName$1.evaluate(TestRuleStoreClassName.java:38)
	at randomizedtesting.runner@2.8.3/com.carrotsearch.randomizedtesting.rules.NoShadowingOrOverridesOnMethodsRule$1.evaluate(NoShadowingOrOverridesOnMethodsRule.java:40)
	at randomizedtesting.runner@2.8.3/com.carrotsearch.randomizedtesting.rules.NoShadowingOrOverridesOnMethodsRule$1.evaluate(NoShadowingOrOverridesOnMethodsRule.java:40)
	at randomizedtesting.runner@2.8.3/com.carrotsearch.randomizedtesting.rules.StatementAdapter.evaluate(StatementAdapter.java:36)
	at randomizedtesting.runner@2.8.3/com.carrotsearch.randomizedtesting.rules.StatementAdapter.evaluate(StatementAdapter.java:36)
	at org.apache.lucene.test_framework@11.0.0-SNAPSHOT/org.apache.lucene.tests.util.TestRuleAssertionsRequired$1.evaluate(TestRuleAssertionsRequired.java:52)
	at org.apache.lucene.test_framework@11.0.0-SNAPSHOT/org.apache.lucene.tests.util.AbstractBeforeAfterRule$1.evaluate(AbstractBeforeAfterRule.java:43)
	at org.apache.lucene.test_framework@11.0.0-SNAPSHOT/org.apache.lucene.tests.util.TestRuleMarkFailure$1.evaluate(TestRuleMarkFailure.java:44)
	at org.apache.lucene.test_framework@11.0.0-SNAPSHOT/org.apache.lucene.tests.util.TestRuleIgnoreAfterMaxFailures$1.evaluate(TestRuleIgnoreAfterMaxFailures.java:60)
	at org.apache.lucene.test_framework@11.0.0-SNAPSHOT/org.apache.lucene.tests.util.TestRuleIgnoreTestSuites$1.evaluate(TestRuleIgnoreTestSuites.java:47)
	at junit@4.13.2/org.junit.rules.RunRules.evaluate(RunRules.java:20)
	at randomizedtesting.runner@2.8.3/com.carrotsearch.randomizedtesting.rules.StatementAdapter.evaluate(StatementAdapter.java:36)
	at randomizedtesting.runner@2.8.3/com.carrotsearch.randomizedtesting.ThreadLeakControl$StatementRunner.run(ThreadLeakControl.java:390)
	at randomizedtesting.runner@2.8.3/com.carrotsearch.randomizedtesting.ThreadLeakControl.lambda$forkTimeoutingTask$0(ThreadLeakControl.java:850)
	at java.base/java.lang.Thread.run(Thread.java:1474)


FAILED:  org.apache.lucene.backward_codecs.lucene70.TestLucene70SegmentInfoFormat.testMergeStability

Error Message:
java.lang.AssertionError: expected:<{fnm=82, fdt=10836, fdx=88, fdm=158}> but was:<{cfs=11226, cfe=150}>

Stack Trace:
java.lang.AssertionError: expected:<{fnm=82, fdt=10836, fdx=88, fdm=158}> but was:<{cfs=11226, cfe=150}>
	at __randomizedtesting.SeedInfo.seed([37D0A4589052930D:439CE2779DB891BB]:0)
	at junit@4.13.2/org.junit.Assert.fail(Assert.java:89)
	at junit@4.13.2/org.junit.Assert.failNotEquals(Assert.java:835)
	at junit@4.13.2/org.junit.Assert.assertEquals(Assert.java:120)
	at junit@4.13.2/org.junit.Assert.assertEquals(Assert.java:146)
	at org.apache.lucene.test_framework@11.0.0-SNAPSHOT/org.apache.lucene.tests.index.BaseIndexFileFormatTestCase.testMergeStability(BaseIndexFileFormatTestCase.java:306)
	at java.base/jdk.internal.reflect.DirectMethodHandleAccessor.invoke(DirectMethodHandleAccessor.java:104)
	at java.base/java.lang.reflect.Method.invoke(Method.java:565)
	at randomizedtesting.runner@2.8.3/com.carrotsearch.randomizedtesting.RandomizedRunner.invoke(RandomizedRunner.java:1763)
	at randomizedtesting.runner@2.8.3/com.carrotsearch.randomizedtesting.RandomizedRunner$8.evaluate(RandomizedRunner.java:946)
	at randomizedtesting.runner@2.8.3/com.carrotsearch.randomizedtesting.RandomizedRunner$9.evaluate(RandomizedRunner.java:982)
	at randomizedtesting.runner@2.8.3/com.carrotsearch.randomizedtesting.RandomizedRunner$10.evaluate(RandomizedRunner.java:996)
	at org.apache.lucene.test_framework@11.0.0-SNAPSHOT/org.apache.lucene.tests.util.TestRuleSetupTeardownChained$1.evaluate(TestRuleSetupTeardownChained.java:48)
	at org.apache.lucene.test_framework@11.0.0-SNAPSHOT/org.apache.lucene.tests.util.AbstractBeforeAfterRule$1.evaluate(AbstractBeforeAfterRule.java:43)
	at org.apache.lucene.test_framework@11.0.0-SNAPSHOT/org.apache.lucene.tests.util.TestRuleThreadAndTestName$1.evaluate(TestRuleThreadAndTestName.java:45)
	at org.apache.lucene.test_framework@11.0.0-SNAPSHOT/org.apache.lucene.tests.util.TestRuleIgnoreAfterMaxFailures$1.evaluate(TestRuleIgnoreAfterMaxFailures.java:60)
	at org.apache.lucene.test_framework@11.0.0-SNAPSHOT/org.apache.lucene.tests.util.TestRuleMarkFailure$1.evaluate(TestRuleMarkFailure.java:44)
	at junit@4.13.2/org.junit.rules.RunRules.evaluate(RunRules.java:20)
	at randomizedtesting.runner@2.8.3/com.carrotsearch.randomizedtesting.rules.StatementAdapter.evaluate(StatementAdapter.java:36)
	at randomizedtesting.runner@2.8.3/com.carrotsearch.randomizedtesting.ThreadLeakControl$StatementRunner.run(ThreadLeakControl.java:390)
	at randomizedtesting.runner@2.8.3/com.carrotsearch.randomizedtesting.ThreadLeakControl.forkTimeoutingTask(ThreadLeakControl.java:843)
	at randomizedtesting.runner@2.8.3/com.carrotsearch.randomizedtesting.ThreadLeakControl$3.evaluate(ThreadLeakControl.java:490)
	at randomizedtesting.runner@2.8.3/com.carrotsearch.randomizedtesting.RandomizedRunner.runSingleTest(RandomizedRunner.java:955)
	at randomizedtesting.runner@2.8.3/com.carrotsearch.randomizedtesting.RandomizedRunner$5.evaluate(RandomizedRunner.java:840)
	at randomizedtesting.runner@2.8.3/com.carrotsearch.randomizedtesting.RandomizedRunner$6.evaluate(RandomizedRunner.java:891)
	at randomizedtesting.runner@2.8.3/com.carrotsearch.randomizedtesting.RandomizedRunner$7.evaluate(RandomizedRunner.java:902)
	at org.apache.lucene.test_framework@11.0.0-SNAPSHOT/org.apache.lucene.tests.util.AbstractBeforeAfterRule$1.evaluate(AbstractBeforeAfterRule.java:43)
	at randomizedtesting.runner@2.8.3/com.carrotsearch.randomizedtesting.rules.StatementAdapter.evaluate(StatementAdapter.java:36)
	at org.apache.lucene.test_framework@11.0.0-SNAPSHOT/org.apache.lucene.tests.util.TestRuleStoreClassName$1.evaluate(TestRuleStoreClassName.java:38)
	at randomizedtesting.runner@2.8.3/com.carrotsearch.randomizedtesting.rules.NoShadowingOrOverridesOnMethodsRule$1.evaluate(NoShadowingOrOverridesOnMethodsRule.java:40)
	at randomizedtesting.runner@2.8.3/com.carrotsearch.randomizedtesting.rules.NoShadowingOrOverridesOnMethodsRule$1.evaluate(NoShadowingOrOverridesOnMethodsRule.java:40)
	at randomizedtesting.runner@2.8.3/com.carrotsearch.randomizedtesting.rules.StatementAdapter.evaluate(StatementAdapter.java:36)
	at randomizedtesting.runner@2.8.3/com.carrotsearch.randomizedtesting.rules.StatementAdapter.evaluate(StatementAdapter.java:36)
	at org.apache.lucene.test_framework@11.0.0-SNAPSHOT/org.apache.lucene.tests.util.TestRuleAssertionsRequired$1.evaluate(TestRuleAssertionsRequired.java:52)
	at org.apache.lucene.test_framework@11.0.0-SNAPSHOT/org.apache.lucene.tests.util.AbstractBeforeAfterRule$1.evaluate(AbstractBeforeAfterRule.java:43)
	at org.apache.lucene.test_framework@11.0.0-SNAPSHOT/org.apache.lucene.tests.util.TestRuleMarkFailure$1.evaluate(TestRuleMarkFailure.java:44)
	at org.apache.lucene.test_framework@11.0.0-SNAPSHOT/org.apache.lucene.tests.util.TestRuleIgnoreAfterMaxFailures$1.evaluate(TestRuleIgnoreAfterMaxFailures.java:60)
	at org.apache.lucene.test_framework@11.0.0-SNAPSHOT/org.apache.lucene.tests.util.TestRuleIgnoreTestSuites$1.evaluate(TestRuleIgnoreTestSuites.java:47)
	at junit@4.13.2/org.junit.rules.RunRules.evaluate(RunRules.java:20)
	at randomizedtesting.runner@2.8.3/com.carrotsearch.randomizedtesting.rules.StatementAdapter.evaluate(StatementAdapter.java:36)
	at randomizedtesting.runner@2.8.3/com.carrotsearch.randomizedtesting.ThreadLeakControl$StatementRunner.run(ThreadLeakControl.java:390)
	at randomizedtesting.runner@2.8.3/com.carrotsearch.randomizedtesting.ThreadLeakControl.lambda$forkTimeoutingTask$0(ThreadLeakControl.java:850)
	at java.base/java.lang.Thread.run(Thread.java:1474)


FAILED:  org.apache.lucene.backward_codecs.lucene86.TestLucene86SegmentInfoFormat.testMergeStability

Error Message:
java.lang.AssertionError: expected:<{fnm=82, fdt=10837, fdx=80, fdm=159}> but was:<{cfs=11220, cfe=150}>

Stack Trace:
java.lang.AssertionError: expected:<{fnm=82, fdt=10837, fdx=80, fdm=159}> but was:<{cfs=11220, cfe=150}>
	at __randomizedtesting.SeedInfo.seed([37D0A4589052930D:439CE2779DB891BB]:0)
	at junit@4.13.2/org.junit.Assert.fail(Assert.java:89)
	at junit@4.13.2/org.junit.Assert.failNotEquals(Assert.java:835)
	at junit@4.13.2/org.junit.Assert.assertEquals(Assert.java:120)
	at junit@4.13.2/org.junit.Assert.assertEquals(Assert.java:146)
	at org.apache.lucene.test_framework@11.0.0-SNAPSHOT/org.apache.lucene.tests.index.BaseIndexFileFormatTestCase.testMergeStability(BaseIndexFileFormatTestCase.java:306)
	at java.base/jdk.internal.reflect.DirectMethodHandleAccessor.invoke(DirectMethodHandleAccessor.java:104)
	at java.base/java.lang.reflect.Method.invoke(Method.java:565)
	at randomizedtesting.runner@2.8.3/com.carrotsearch.randomizedtesting.RandomizedRunner.invoke(RandomizedRunner.java:1763)
	at randomizedtesting.runner@2.8.3/com.carrotsearch.randomizedtesting.RandomizedRunner$8.evaluate(RandomizedRunner.java:946)
	at randomizedtesting.runner@2.8.3/com.carrotsearch.randomizedtesting.RandomizedRunner$9.evaluate(RandomizedRunner.java:982)
	at randomizedtesting.runner@2.8.3/com.carrotsearch.randomizedtesting.RandomizedRunner$10.evaluate(RandomizedRunner.java:996)
	at org.apache.lucene.test_framework@11.0.0-SNAPSHOT/org.apache.lucene.tests.util.TestRuleSetupTeardownChained$1.evaluate(TestRuleSetupTeardownChained.java:48)
	at org.apache.lucene.test_framework@11.0.0-SNAPSHOT/org.apache.lucene.tests.util.AbstractBeforeAfterRule$1.evaluate(AbstractBeforeAfterRule.java:43)
	at org.apache.lucene.test_framework@11.0.0-SNAPSHOT/org.apache.lucene.tests.util.TestRuleThreadAndTestName$1.evaluate(TestRuleThreadAndTestName.java:45)
	at org.apache.lucene.test_framework@11.0.0-SNAPSHOT/org.apache.lucene.tests.util.TestRuleIgnoreAfterMaxFailures$1.evaluate(TestRuleIgnoreAfterMaxFailures.java:60)
	at org.apache.lucene.test_framework@11.0.0-SNAPSHOT/org.apache.lucene.tests.util.TestRuleMarkFailure$1.evaluate(TestRuleMarkFailure.java:44)
	at junit@4.13.2/org.junit.rules.RunRules.evaluate(RunRules.java:20)
	at randomizedtesting.runner@2.8.3/com.carrotsearch.randomizedtesting.rules.StatementAdapter.evaluate(StatementAdapter.java:36)
	at randomizedtesting.runner@2.8.3/com.carrotsearch.randomizedtesting.ThreadLeakControl$StatementRunner.run(ThreadLeakControl.java:390)
	at randomizedtesting.runner@2.8.3/com.carrotsearch.randomizedtesting.ThreadLeakControl.forkTimeoutingTask(ThreadLeakControl.java:843)
	at randomizedtesting.runner@2.8.3/com.carrotsearch.randomizedtesting.ThreadLeakControl$3.evaluate(ThreadLeakControl.java:490)
	at randomizedtesting.runner@2.8.3/com.carrotsearch.randomizedtesting.RandomizedRunner.runSingleTest(RandomizedRunner.java:955)
	at randomizedtesting.runner@2.8.3/com.carrotsearch.randomizedtesting.RandomizedRunner$5.evaluate(RandomizedRunner.java:840)
	at randomizedtesting.runner@2.8.3/com.carrotsearch.randomizedtesting.RandomizedRunner$6.evaluate(RandomizedRunner.java:891)
	at randomizedtesting.runner@2.8.3/com.carrotsearch.randomizedtesting.RandomizedRunner$7.evaluate(RandomizedRunner.java:902)
	at org.apache.lucene.test_framework@11.0.0-SNAPSHOT/org.apache.lucene.tests.util.AbstractBeforeAfterRule$1.evaluate(AbstractBeforeAfterRule.java:43)
	at randomizedtesting.runner@2.8.3/com.carrotsearch.randomizedtesting.rules.StatementAdapter.evaluate(StatementAdapter.java:36)
	at org.apache.lucene.test_framework@11.0.0-SNAPSHOT/org.apache.lucene.tests.util.TestRuleStoreClassName$1.evaluate(TestRuleStoreClassName.java:38)
	at randomizedtesting.runner@2.8.3/com.carrotsearch.randomizedtesting.rules.NoShadowingOrOverridesOnMethodsRule$1.evaluate(NoShadowingOrOverridesOnMethodsRule.java:40)
	at randomizedtesting.runner@2.8.3/com.carrotsearch.randomizedtesting.rules.NoShadowingOrOverridesOnMethodsRule$1.evaluate(NoShadowingOrOverridesOnMethodsRule.java:40)
	at randomizedtesting.runner@2.8.3/com.carrotsearch.randomizedtesting.rules.StatementAdapter.evaluate(StatementAdapter.java:36)
	at randomizedtesting.runner@2.8.3/com.carrotsearch.randomizedtesting.rules.StatementAdapter.evaluate(StatementAdapter.java:36)
	at org.apache.lucene.test_framework@11.0.0-SNAPSHOT/org.apache.lucene.tests.util.TestRuleAssertionsRequired$1.evaluate(TestRuleAssertionsRequired.java:52)
	at org.apache.lucene.test_framework@11.0.0-SNAPSHOT/org.apache.lucene.tests.util.AbstractBeforeAfterRule$1.evaluate(AbstractBeforeAfterRule.java:43)
	at org.apache.lucene.test_framework@11.0.0-SNAPSHOT/org.apache.lucene.tests.util.TestRuleMarkFailure$1.evaluate(TestRuleMarkFailure.java:44)
	at org.apache.lucene.test_framework@11.0.0-SNAPSHOT/org.apache.lucene.tests.util.TestRuleIgnoreAfterMaxFailures$1.evaluate(TestRuleIgnoreAfterMaxFailures.java:60)
	at org.apache.lucene.test_framework@11.0.0-SNAPSHOT/org.apache.lucene.tests.util.TestRuleIgnoreTestSuites$1.evaluate(TestRuleIgnoreTestSuites.java:47)
	at junit@4.13.2/org.junit.rules.RunRules.evaluate(RunRules.java:20)
	at randomizedtesting.runner@2.8.3/com.carrotsearch.randomizedtesting.rules.StatementAdapter.evaluate(StatementAdapter.java:36)
	at randomizedtesting.runner@2.8.3/com.carrotsearch.randomizedtesting.ThreadLeakControl$StatementRunner.run(ThreadLeakControl.java:390)
	at randomizedtesting.runner@2.8.3/com.carrotsearch.randomizedtesting.ThreadLeakControl.lambda$forkTimeoutingTask$0(ThreadLeakControl.java:850)
	at java.base/java.lang.Thread.run(Thread.java:1474)


FAILED:  org.apache.lucene.backward_codecs.lucene87.TestLucene87StoredFieldsFormat.testMergeStability

Error Message:
java.lang.AssertionError: expected:<{fnm=77, fdt=75471, fdx=81, fdm=159}> but was:<{cfs=75850, cfe=150}>

Stack Trace:
java.lang.AssertionError: expected:<{fnm=77, fdt=75471, fdx=81, fdm=159}> but was:<{cfs=75850, cfe=150}>
	at __randomizedtesting.SeedInfo.seed([37D0A4589052930D:439CE2779DB891BB]:0)
	at junit@4.13.2/org.junit.Assert.fail(Assert.java:89)
	at junit@4.13.2/org.junit.Assert.failNotEquals(Assert.java:835)
	at junit@4.13.2/org.junit.Assert.assertEquals(Assert.java:120)
	at junit@4.13.2/org.junit.Assert.assertEquals(Assert.java:146)
	at org.apache.lucene.test_framework@11.0.0-SNAPSHOT/org.apache.lucene.tests.index.BaseIndexFileFormatTestCase.testMergeStability(BaseIndexFileFormatTestCase.java:306)
	at java.base/jdk.internal.reflect.DirectMethodHandleAccessor.invoke(DirectMethodHandleAccessor.java:104)
	at java.base/java.lang.reflect.Method.invoke(Method.java:565)
	at randomizedtesting.runner@2.8.3/com.carrotsearch.randomizedtesting.RandomizedRunner.invoke(RandomizedRunner.java:1763)
	at randomizedtesting.runner@2.8.3/com.carrotsearch.randomizedtesting.RandomizedRunner$8.evaluate(RandomizedRunner.java:946)
	at randomizedtesting.runner@2.8.3/com.carrotsearch.randomizedtesting.RandomizedRunner$9.evaluate(RandomizedRunner.java:982)
	at randomizedtesting.runner@2.8.3/com.carrotsearch.randomizedtesting.RandomizedRunner$10.evaluate(RandomizedRunner.java:996)
	at org.apache.lucene.test_framework@11.0.0-SNAPSHOT/org.apache.lucene.tests.util.TestRuleSetupTeardownChained$1.evaluate(TestRuleSetupTeardownChained.java:48)
	at org.apache.lucene.test_framework@11.0.0-SNAPSHOT/org.apache.lucene.tests.util.AbstractBeforeAfterRule$1.evaluate(AbstractBeforeAfterRule.java:43)
	at org.apache.lucene.test_framework@11.0.0-SNAPSHOT/org.apache.lucene.tests.util.TestRuleThreadAndTestName$1.evaluate(TestRuleThreadAndTestName.java:45)
	at org.apache.lucene.test_framework@11.0.0-SNAPSHOT/org.apache.lucene.tests.util.TestRuleIgnoreAfterMaxFailures$1.evaluate(TestRuleIgnoreAfterMaxFailures.java:60)
	at org.apache.lucene.test_framework@11.0.0-SNAPSHOT/org.apache.lucene.tests.util.TestRuleMarkFailure$1.evaluate(TestRuleMarkFailure.java:44)
	at junit@4.13.2/org.junit.rules.RunRules.evaluate(RunRules.java:20)
	at randomizedtesting.runner@2.8.3/com.carrotsearch.randomizedtesting.rules.StatementAdapter.evaluate(StatementAdapter.java:36)
	at randomizedtesting.runner@2.8.3/com.carrotsearch.randomizedtesting.ThreadLeakControl$StatementRunner.run(ThreadLeakControl.java:390)
	at randomizedtesting.runner@2.8.3/com.carrotsearch.randomizedtesting.ThreadLeakControl.forkTimeoutingTask(ThreadLeakControl.java:843)
	at randomizedtesting.runner@2.8.3/com.carrotsearch.randomizedtesting.ThreadLeakControl$3.evaluate(ThreadLeakControl.java:490)
	at randomizedtesting.runner@2.8.3/com.carrotsearch.randomizedtesting.RandomizedRunner.runSingleTest(RandomizedRunner.java:955)
	at randomizedtesting.runner@2.8.3/com.carrotsearch.randomizedtesting.RandomizedRunner$5.evaluate(RandomizedRunner.java:840)
	at randomizedtesting.runner@2.8.3/com.carrotsearch.randomizedtesting.RandomizedRunner$6.evaluate(RandomizedRunner.java:891)
	at randomizedtesting.runner@2.8.3/com.carrotsearch.randomizedtesting.RandomizedRunner$7.evaluate(RandomizedRunner.java:902)
	at org.apache.lucene.test_framework@11.0.0-SNAPSHOT/org.apache.lucene.tests.util.AbstractBeforeAfterRule$1.evaluate(AbstractBeforeAfterRule.java:43)
	at randomizedtesting.runner@2.8.3/com.carrotsearch.randomizedtesting.rules.StatementAdapter.evaluate(StatementAdapter.java:36)
	at org.apache.lucene.test_framework@11.0.0-SNAPSHOT/org.apache.lucene.tests.util.TestRuleStoreClassName$1.evaluate(TestRuleStoreClassName.java:38)
	at randomizedtesting.runner@2.8.3/com.carrotsearch.randomizedtesting.rules.NoShadowingOrOverridesOnMethodsRule$1.evaluate(NoShadowingOrOverridesOnMethodsRule.java:40)
	at randomizedtesting.runner@2.8.3/com.carrotsearch.randomizedtesting.rules.NoShadowingOrOverridesOnMethodsRule$1.evaluate(NoShadowingOrOverridesOnMethodsRule.java:40)
	at randomizedtesting.runner@2.8.3/com.carrotsearch.randomizedtesting.rules.StatementAdapter.evaluate(StatementAdapter.java:36)
	at randomizedtesting.runner@2.8.3/com.carrotsearch.randomizedtesting.rules.StatementAdapter.evaluate(StatementAdapter.java:36)
	at org.apache.lucene.test_framework@11.0.0-SNAPSHOT/org.apache.lucene.tests.util.TestRuleAssertionsRequired$1.evaluate(TestRuleAssertionsRequired.java:52)
	at org.apache.lucene.test_framework@11.0.0-SNAPSHOT/org.apache.lucene.tests.util.AbstractBeforeAfterRule$1.evaluate(AbstractBeforeAfterRule.java:43)
	at org.apache.lucene.test_framework@11.0.0-SNAPSHOT/org.apache.lucene.tests.util.TestRuleMarkFailure$1.evaluate(TestRuleMarkFailure.java:44)
	at org.apache.lucene.test_framework@11.0.0-SNAPSHOT/org.apache.lucene.tests.util.TestRuleIgnoreAfterMaxFailures$1.evaluate(TestRuleIgnoreAfterMaxFailures.java:60)
	at org.apache.lucene.test_framework@11.0.0-SNAPSHOT/org.apache.lucene.tests.util.TestRuleIgnoreTestSuites$1.evaluate(TestRuleIgnoreTestSuites.java:47)
	at junit@4.13.2/org.junit.rules.RunRules.evaluate(RunRules.java:20)
	at randomizedtesting.runner@2.8.3/com.carrotsearch.randomizedtesting.rules.StatementAdapter.evaluate(StatementAdapter.java:36)
	at randomizedtesting.runner@2.8.3/com.carrotsearch.randomizedtesting.ThreadLeakControl$StatementRunner.run(ThreadLeakControl.java:390)
	at randomizedtesting.runner@2.8.3/com.carrotsearch.randomizedtesting.ThreadLeakControl.lambda$forkTimeoutingTask$0(ThreadLeakControl.java:850)
	at java.base/java.lang.Thread.run(Thread.java:1474)


FAILED:  org.apache.lucene.backward_codecs.lucene87.TestLucene87StoredFieldsFormatHighCompression.testMergeStability

Error Message:
java.lang.AssertionError: expected:<{fnm=77, fdt=49475, fdx=64, fdm=159}> but was:<{cfs=49837, cfe=150}>

Stack Trace:
java.lang.AssertionError: expected:<{fnm=77, fdt=49475, fdx=64, fdm=159}> but was:<{cfs=49837, cfe=150}>
	at __randomizedtesting.SeedInfo.seed([37D0A4589052930D:439CE2779DB891BB]:0)
	at junit@4.13.2/org.junit.Assert.fail(Assert.java:89)
	at junit@4.13.2/org.junit.Assert.failNotEquals(Assert.java:835)
	at junit@4.13.2/org.junit.Assert.assertEquals(Assert.java:120)
	at junit@4.13.2/org.junit.Assert.assertEquals(Assert.java:146)
	at org.apache.lucene.test_framework@11.0.0-SNAPSHOT/org.apache.lucene.tests.index.BaseIndexFileFormatTestCase.testMergeStability(BaseIndexFileFormatTestCase.java:306)
	at java.base/jdk.internal.reflect.DirectMethodHandleAccessor.invoke(DirectMethodHandleAccessor.java:104)
	at java.base/java.lang.reflect.Method.invoke(Method.java:565)
	at randomizedtesting.runner@2.8.3/com.carrotsearch.randomizedtesting.RandomizedRunner.invoke(RandomizedRunner.java:1763)
	at randomizedtesting.runner@2.8.3/com.carrotsearch.randomizedtesting.RandomizedRunner$8.evaluate(RandomizedRunner.java:946)
	at randomizedtesting.runner@2.8.3/com.carrotsearch.randomizedtesting.RandomizedRunner$9.evaluate(RandomizedRunner.java:982)
	at randomizedtesting.runner@2.8.3/com.carrotsearch.randomizedtesting.RandomizedRunner$10.evaluate(RandomizedRunner.java:996)
	at org.apache.lucene.test_framework@11.0.0-SNAPSHOT/org.apache.lucene.tests.util.TestRuleSetupTeardownChained$1.evaluate(TestRuleSetupTeardownChained.java:48)
	at org.apache.lucene.test_framework@11.0.0-SNAPSHOT/org.apache.lucene.tests.util.AbstractBeforeAfterRule$1.evaluate(AbstractBeforeAfterRule.java:43)
	at org.apache.lucene.test_framework@11.0.0-SNAPSHOT/org.apache.lucene.tests.util.TestRuleThreadAndTestName$1.evaluate(TestRuleThreadAndTestName.java:45)
	at org.apache.lucene.test_framework@11.0.0-SNAPSHOT/org.apache.lucene.tests.util.TestRuleIgnoreAfterMaxFailures$1.evaluate(TestRuleIgnoreAfterMaxFailures.java:60)
	at org.apache.lucene.test_framework@11.0.0-SNAPSHOT/org.apache.lucene.tests.util.TestRuleMarkFailure$1.evaluate(TestRuleMarkFailure.java:44)
	at junit@4.13.2/org.junit.rules.RunRules.evaluate(RunRules.java:20)
	at randomizedtesting.runner@2.8.3/com.carrotsearch.randomizedtesting.rules.StatementAdapter.evaluate(StatementAdapter.java:36)
	at randomizedtesting.runner@2.8.3/com.carrotsearch.randomizedtesting.ThreadLeakControl$StatementRunner.run(ThreadLeakControl.java:390)
	at randomizedtesting.runner@2.8.3/com.carrotsearch.randomizedtesting.ThreadLeakControl.forkTimeoutingTask(ThreadLeakControl.java:843)
	at randomizedtesting.runner@2.8.3/com.carrotsearch.randomizedtesting.ThreadLeakControl$3.evaluate(ThreadLeakControl.java:490)
	at randomizedtesting.runner@2.8.3/com.carrotsearch.randomizedtesting.RandomizedRunner.runSingleTest(RandomizedRunner.java:955)
	at randomizedtesting.runner@2.8.3/com.carrotsearch.randomizedtesting.RandomizedRunner$5.evaluate(RandomizedRunner.java:840)
	at randomizedtesting.runner@2.8.3/com.carrotsearch.randomizedtesting.RandomizedRunner$6.evaluate(RandomizedRunner.java:891)
	at randomizedtesting.runner@2.8.3/com.carrotsearch.randomizedtesting.RandomizedRunner$7.evaluate(RandomizedRunner.java:902)
	at org.apache.lucene.test_framework@11.0.0-SNAPSHOT/org.apache.lucene.tests.util.AbstractBeforeAfterRule$1.evaluate(AbstractBeforeAfterRule.java:43)
	at randomizedtesting.runner@2.8.3/com.carrotsearch.randomizedtesting.rules.StatementAdapter.evaluate(StatementAdapter.java:36)
	at org.apache.lucene.test_framework@11.0.0-SNAPSHOT/org.apache.lucene.tests.util.TestRuleStoreClassName$1.evaluate(TestRuleStoreClassName.java:38)
	at randomizedtesting.runner@2.8.3/com.carrotsearch.randomizedtesting.rules.NoShadowingOrOverridesOnMethodsRule$1.evaluate(NoShadowingOrOverridesOnMethodsRule.java:40)
	at randomizedtesting.runner@2.8.3/com.carrotsearch.randomizedtesting.rules.NoShadowingOrOverridesOnMethodsRule$1.evaluate(NoShadowingOrOverridesOnMethodsRule.java:40)
	at randomizedtesting.runner@2.8.3/com.carrotsearch.randomizedtesting.rules.StatementAdapter.evaluate(StatementAdapter.java:36)
	at randomizedtesting.runner@2.8.3/com.carrotsearch.randomizedtesting.rules.StatementAdapter.evaluate(StatementAdapter.java:36)
	at org.apache.lucene.test_framework@11.0.0-SNAPSHOT/org.apache.lucene.tests.util.TestRuleAssertionsRequired$1.evaluate(TestRuleAssertionsRequired.java:52)
	at org.apache.lucene.test_framework@11.0.0-SNAPSHOT/org.apache.lucene.tests.util.AbstractBeforeAfterRule$1.evaluate(AbstractBeforeAfterRule.java:43)
	at org.apache.lucene.test_framework@11.0.0-SNAPSHOT/org.apache.lucene.tests.util.TestRuleMarkFailure$1.evaluate(TestRuleMarkFailure.java:44)
	at org.apache.lucene.test_framework@11.0.0-SNAPSHOT/org.apache.lucene.tests.util.TestRuleIgnoreAfterMaxFailures$1.evaluate(TestRuleIgnoreAfterMaxFailures.java:60)
	at org.apache.lucene.test_framework@11.0.0-SNAPSHOT/org.apache.lucene.tests.util.TestRuleIgnoreTestSuites$1.evaluate(TestRuleIgnoreTestSuites.java:47)
	at junit@4.13.2/org.junit.rules.RunRules.evaluate(RunRules.java:20)
	at randomizedtesting.runner@2.8.3/com.carrotsearch.randomizedtesting.rules.StatementAdapter.evaluate(StatementAdapter.java:36)
	at randomizedtesting.runner@2.8.3/com.carrotsearch.randomizedtesting.ThreadLeakControl$StatementRunner.run(ThreadLeakControl.java:390)
	at randomizedtesting.runner@2.8.3/com.carrotsearch.randomizedtesting.ThreadLeakControl.lambda$forkTimeoutingTask$0(ThreadLeakControl.java:850)
	at java.base/java.lang.Thread.run(Thread.java:1474)


FAILED:  org.apache.lucene.backward_codecs.lucene87.TestLucene87StoredFieldsFormatMergeInstance.testMergeStability

Error Message:
java.lang.AssertionError: expected:<{fnm=77, fdt=75471, fdx=81, fdm=159}> but was:<{cfs=75850, cfe=150}>

Stack Trace:
java.lang.AssertionError: expected:<{fnm=77, fdt=75471, fdx=81, fdm=159}> but was:<{cfs=75850, cfe=150}>
	at __randomizedtesting.SeedInfo.seed([37D0A4589052930D:439CE2779DB891BB]:0)
	at junit@4.13.2/org.junit.Assert.fail(Assert.java:89)
	at junit@4.13.2/org.junit.Assert.failNotEquals(Assert.java:835)
	at junit@4.13.2/org.junit.Assert.assertEquals(Assert.java:120)
	at junit@4.13.2/org.junit.Assert.assertEquals(Assert.java:146)
	at org.apache.lucene.test_framework@11.0.0-SNAPSHOT/org.apache.lucene.tests.index.BaseIndexFileFormatTestCase.testMergeStability(BaseIndexFileFormatTestCase.java:306)
	at java.base/jdk.internal.reflect.DirectMethodHandleAccessor.invoke(DirectMethodHandleAccessor.java:104)
	at java.base/java.lang.reflect.Method.invoke(Method.java:565)
	at randomizedtesting.runner@2.8.3/com.carrotsearch.randomizedtesting.RandomizedRunner.invoke(RandomizedRunner.java:1763)
	at randomizedtesting.runner@2.8.3/com.carrotsearch.randomizedtesting.RandomizedRunner$8.evaluate(RandomizedRunner.java:946)
	at randomizedtesting.runner@2.8.3/com.carrotsearch.randomizedtesting.RandomizedRunner$9.evaluate(RandomizedRunner.java:982)
	at randomizedtesting.runner@2.8.3/com.carrotsearch.randomizedtesting.RandomizedRunner$10.evaluate(RandomizedRunner.java:996)
	at org.apache.lucene.test_framework@11.0.0-SNAPSHOT/org.apache.lucene.tests.util.TestRuleSetupTeardownChained$1.evaluate(TestRuleSetupTeardownChained.java:48)
	at org.apache.lucene.test_framework@11.0.0-SNAPSHOT/org.apache.lucene.tests.util.AbstractBeforeAfterRule$1.evaluate(AbstractBeforeAfterRule.java:43)
	at org.apache.lucene.test_framework@11.0.0-SNAPSHOT/org.apache.lucene.tests.util.TestRuleThreadAndTestName$1.evaluate(TestRuleThreadAndTestName.java:45)
	at org.apache.lucene.test_framework@11.0.0-SNAPSHOT/org.apache.lucene.tests.util.TestRuleIgnoreAfterMaxFailures$1.evaluate(TestRuleIgnoreAfterMaxFailures.java:60)
	at org.apache.lucene.test_framework@11.0.0-SNAPSHOT/org.apache.lucene.tests.util.TestRuleMarkFailure$1.evaluate(TestRuleMarkFailure.java:44)
	at junit@4.13.2/org.junit.rules.RunRules.evaluate(RunRules.java:20)
	at randomizedtesting.runner@2.8.3/com.carrotsearch.randomizedtesting.rules.StatementAdapter.evaluate(StatementAdapter.java:36)
	at randomizedtesting.runner@2.8.3/com.carrotsearch.randomizedtesting.ThreadLeakControl$StatementRunner.run(ThreadLeakControl.java:390)
	at randomizedtesting.runner@2.8.3/com.carrotsearch.randomizedtesting.ThreadLeakControl.forkTimeoutingTask(ThreadLeakControl.java:843)
	at randomizedtesting.runner@2.8.3/com.carrotsearch.randomizedtesting.ThreadLeakControl$3.evaluate(ThreadLeakControl.java:490)
	at randomizedtesting.runner@2.8.3/com.carrotsearch.randomizedtesting.RandomizedRunner.runSingleTest(RandomizedRunner.java:955)
	at randomizedtesting.runner@2.8.3/com.carrotsearch.randomizedtesting.RandomizedRunner$5.evaluate(RandomizedRunner.java:840)
	at randomizedtesting.runner@2.8.3/com.carrotsearch.randomizedtesting.RandomizedRunner$6.evaluate(RandomizedRunner.java:891)
	at randomizedtesting.runner@2.8.3/com.carrotsearch.randomizedtesting.RandomizedRunner$7.evaluate(RandomizedRunner.java:902)
	at org.apache.lucene.test_framework@11.0.0-SNAPSHOT/org.apache.lucene.tests.util.AbstractBeforeAfterRule$1.evaluate(AbstractBeforeAfterRule.java:43)
	at randomizedtesting.runner@2.8.3/com.carrotsearch.randomizedtesting.rules.StatementAdapter.evaluate(StatementAdapter.java:36)
	at org.apache.lucene.test_framework@11.0.0-SNAPSHOT/org.apache.lucene.tests.util.TestRuleStoreClassName$1.evaluate(TestRuleStoreClassName.java:38)
	at randomizedtesting.runner@2.8.3/com.carrotsearch.randomizedtesting.rules.NoShadowingOrOverridesOnMethodsRule$1.evaluate(NoShadowingOrOverridesOnMethodsRule.java:40)
	at randomizedtesting.runner@2.8.3/com.carrotsearch.randomizedtesting.rules.NoShadowingOrOverridesOnMethodsRule$1.evaluate(NoShadowingOrOverridesOnMethodsRule.java:40)
	at randomizedtesting.runner@2.8.3/com.carrotsearch.randomizedtesting.rules.StatementAdapter.evaluate(StatementAdapter.java:36)
	at randomizedtesting.runner@2.8.3/com.carrotsearch.randomizedtesting.rules.StatementAdapter.evaluate(StatementAdapter.java:36)
	at org.apache.lucene.test_framework@11.0.0-SNAPSHOT/org.apache.lucene.tests.util.TestRuleAssertionsRequired$1.evaluate(TestRuleAssertionsRequired.java:52)
	at org.apache.lucene.test_framework@11.0.0-SNAPSHOT/org.apache.lucene.tests.util.AbstractBeforeAfterRule$1.evaluate(AbstractBeforeAfterRule.java:43)
	at org.apache.lucene.test_framework@11.0.0-SNAPSHOT/org.apache.lucene.tests.util.TestRuleMarkFailure$1.evaluate(TestRuleMarkFailure.java:44)
	at org.apache.lucene.test_framework@11.0.0-SNAPSHOT/org.apache.lucene.tests.util.TestRuleIgnoreAfterMaxFailures$1.evaluate(TestRuleIgnoreAfterMaxFailures.java:60)
	at org.apache.lucene.test_framework@11.0.0-SNAPSHOT/org.apache.lucene.tests.util.TestRuleIgnoreTestSuites$1.evaluate(TestRuleIgnoreTestSuites.java:47)
	at junit@4.13.2/org.junit.rules.RunRules.evaluate(RunRules.java:20)
	at randomizedtesting.runner@2.8.3/com.carrotsearch.randomizedtesting.rules.StatementAdapter.evaluate(StatementAdapter.java:36)
	at randomizedtesting.runner@2.8.3/com.carrotsearch.randomizedtesting.ThreadLeakControl$StatementRunner.run(ThreadLeakControl.java:390)
	at randomizedtesting.runner@2.8.3/com.carrotsearch.randomizedtesting.ThreadLeakControl.lambda$forkTimeoutingTask$0(ThreadLeakControl.java:850)
	at java.base/java.lang.Thread.run(Thread.java:1474)




Build Log:
[...truncated 1673 lines...]
ERROR: 10 10 tests have failed:

  - org.apache.lucene.backward_codecs.lucene50.TestLucene50StoredFieldsFormatMergeInstance.testMergeStability (:lucene:backward-codecs)
    Test output: /home/jenkins/jenkins-agent/workspace/Lucene/Lucene-NightlyTests-main/checkout/lucene/backward-codecs/build/test-results/test/outputs/OUTPUT-org.apache.lucene.backward_codecs.lucene50.TestLucene50StoredFieldsFormatMergeInstance.txt
    Reproduce with: gradlew :lucene:backward-codecs:test --tests "org.apache.lucene.backward_codecs.lucene50.TestLucene50StoredFieldsFormatMergeInstance.testMergeStability" -Ptests.asserts=true -Ptests.file.encoding=UTF-8 -Ptests.gui=true -Ptests.haltonfailure=false -Ptests.jvmargs= -Ptests.jvms=4 -Ptests.linedocsfile=/home/jenkins/jenkins-agent/workspace/Lucene/Lucene-NightlyTests-main/test-data/enwiki.random.lines.txt -Ptests.multiplier=2 -Ptests.nightly=true -Ptests.seed=37D0A4589052930D -Ptests.vectorsize=256

  - org.apache.lucene.backward_codecs.lucene50.TestLucene50StoredFieldsFormat.testMergeStability (:lucene:backward-codecs)
    Test output: /home/jenkins/jenkins-agent/workspace/Lucene/Lucene-NightlyTests-main/checkout/lucene/backward-codecs/build/test-results/test/outputs/OUTPUT-org.apache.lucene.backward_codecs.lucene50.TestLucene50StoredFieldsFormat.txt
    Reproduce with: gradlew :lucene:backward-codecs:test --tests "org.apache.lucene.backward_codecs.lucene50.TestLucene50StoredFieldsFormat.testMergeStability" -Ptests.asserts=true -Ptests.file.encoding=UTF-8 -Ptests.gui=true -Ptests.haltonfailure=false -Ptests.jvmargs= -Ptests.jvms=4 -Ptests.linedocsfile=/home/jenkins/jenkins-agent/workspace/Lucene/Lucene-NightlyTests-main/test-data/enwiki.random.lines.txt -Ptests.multiplier=2 -Ptests.nightly=true -Ptests.seed=37D0A4589052930D -Ptests.vectorsize=256

  - org.apache.lucene.backward_codecs.lucene86.TestLucene86SegmentInfoFormat.testMergeStability (:lucene:backward-codecs)
    Test output: /home/jenkins/jenkins-agent/workspace/Lucene/Lucene-NightlyTests-main/checkout/lucene/backward-codecs/build/test-results/test/outputs/OUTPUT-org.apache.lucene.backward_codecs.lucene86.TestLucene86SegmentInfoFormat.txt
    Reproduce with: gradlew :lucene:backward-codecs:test --tests "org.apache.lucene.backward_codecs.lucene86.TestLucene86SegmentInfoFormat.testMergeStability" -Ptests.asserts=true -Ptests.file.encoding=UTF-8 -Ptests.gui=true -Ptests.haltonfailure=false -Ptests.jvmargs= -Ptests.jvms=4 -Ptests.linedocsfile=/home/jenkins/jenkins-agent/workspace/Lucene/Lucene-NightlyTests-main/test-data/enwiki.random.lines.txt -Ptests.multiplier=2 -Ptests.nightly=true -Ptests.seed=37D0A4589052930D -Ptests.vectorsize=256

  - org.apache.lucene.backward_codecs.lucene60.TestLucene60FieldInfosFormat.testMergeStability (:lucene:backward-codecs)
    Test output: /home/jenkins/jenkins-agent/workspace/Lucene/Lucene-NightlyTests-main/checkout/lucene/backward-codecs/build/test-results/test/outputs/OUTPUT-org.apache.lucene.backward_codecs.lucene60.TestLucene60FieldInfosFormat.txt
    Reproduce with: gradlew :lucene:backward-codecs:test --tests "org.apache.lucene.backward_codecs.lucene60.TestLucene60FieldInfosFormat.testMergeStability" -Ptests.asserts=true -Ptests.file.encoding=UTF-8 -Ptests.gui=true -Ptests.haltonfailure=false -Ptests.jvmargs= -Ptests.jvms=4 -Ptests.linedocsfile=/home/jenkins/jenkins-agent/workspace/Lucene/Lucene-NightlyTests-main/test-data/enwiki.random.lines.txt -Ptests.multiplier=2 -Ptests.nightly=true -Ptests.seed=37D0A4589052930D -Ptests.vectorsize=256

  - org.apache.lucene.backward_codecs.lucene50.TestLucene50StoredFieldsFormatHighCompression.testMergeStability (:lucene:backward-codecs)
    Test output: /home/jenkins/jenkins-agent/workspace/Lucene/Lucene-NightlyTests-main/checkout/lucene/backward-codecs/build/test-results/test/outputs/OUTPUT-org.apache.lucene.backward_codecs.lucene50.TestLucene50StoredFieldsFormatHighCompression.txt
    Reproduce with: gradlew :lucene:backward-codecs:test --tests "org.apache.lucene.backward_codecs.lucene50.TestLucene50StoredFieldsFormatHighCompression.testMergeStability" -Ptests.asserts=true -Ptests.file.encoding=UTF-8 -Ptests.gui=true -Ptests.haltonfailure=false -Ptests.jvmargs= -Ptests.jvms=4 -Ptests.linedocsfile=/home/jenkins/jenkins-agent/workspace/Lucene/Lucene-NightlyTests-main/test-data/enwiki.random.lines.txt -Ptests.multiplier=2 -Ptests.nightly=true -Ptests.seed=37D0A4589052930D -Ptests.vectorsize=256

  - org.apache.lucene.backward_codecs.lucene70.TestLucene70SegmentInfoFormat.testMergeStability (:lucene:backward-codecs)
    Test output: /home/jenkins/jenkins-agent/workspace/Lucene/Lucene-NightlyTests-main/checkout/lucene/backward-codecs/build/test-results/test/outputs/OUTPUT-org.apache.lucene.backward_codecs.lucene70.TestLucene70SegmentInfoFormat.txt
    Reproduce with: gradlew :lucene:backward-codecs:test --tests "org.apache.lucene.backward_codecs.lucene70.TestLucene70SegmentInfoFormat.testMergeStability" -Ptests.asserts=true -Ptests.file.encoding=UTF-8 -Ptests.gui=true -Ptests.haltonfailure=false -Ptests.jvmargs= -Ptests.jvms=4 -Ptests.linedocsfile=/home/jenkins/jenkins-agent/workspace/Lucene/Lucene-NightlyTests-main/test-data/enwiki.random.lines.txt -Ptests.multiplier=2 -Ptests.nightly=true -Ptests.seed=37D0A4589052930D -Ptests.vectorsize=256

  - org.apache.lucene.backward_codecs.lucene87.TestLucene87StoredFieldsFormatMergeInstance.testMergeStability (:lucene:backward-codecs)
    Test output: /home/jenkins/jenkins-agent/workspace/Lucene/Lucene-NightlyTests-main/checkout/lucene/backward-codecs/build/test-results/test/outputs/OUTPUT-org.apache.lucene.backward_codecs.lucene87.TestLucene87StoredFieldsFormatMergeInstance.txt
    Reproduce with: gradlew :lucene:backward-codecs:test --tests "org.apache.lucene.backward_codecs.lucene87.TestLucene87StoredFieldsFormatMergeInstance.testMergeStability" -Ptests.asserts=true -Ptests.file.encoding=UTF-8 -Ptests.gui=true -Ptests.haltonfailure=false -Ptests.jvmargs= -Ptests.jvms=4 -Ptests.linedocsfile=/home/jenkins/jenkins-agent/workspace/Lucene/Lucene-NightlyTests-main/test-data/enwiki.random.lines.txt -Ptests.multiplier=2 -Ptests.nightly=true -Ptests.seed=37D0A4589052930D -Ptests.vectorsize=256

  - org.apache.lucene.backward_codecs.lucene50.TestLucene50TermVectorsFormat.testMergeStability (:lucene:backward-codecs)
    Test output: /home/jenkins/jenkins-agent/workspace/Lucene/Lucene-NightlyTests-main/checkout/lucene/backward-codecs/build/test-results/test/outputs/OUTPUT-org.apache.lucene.backward_codecs.lucene50.TestLucene50TermVectorsFormat.txt
    Reproduce with: gradlew :lucene:backward-codecs:test --tests "org.apache.lucene.backward_codecs.lucene50.TestLucene50TermVectorsFormat.testMergeStability" -Ptests.asserts=true -Ptests.file.encoding=UTF-8 -Ptests.gui=true -Ptests.haltonfailure=false -Ptests.jvmargs= -Ptests.jvms=4 -Ptests.linedocsfile=/home/jenkins/jenkins-agent/workspace/Lucene/Lucene-NightlyTests-main/test-data/enwiki.random.lines.txt -Ptests.multiplier=2 -Ptests.nightly=true -Ptests.seed=37D0A4589052930D -Ptests.vectorsize=256

  - org.apache.lucene.backward_codecs.lucene87.TestLucene87StoredFieldsFormatHighCompression.testMergeStability (:lucene:backward-codecs)
    Test output: /home/jenkins/jenkins-agent/workspace/Lucene/Lucene-NightlyTests-main/checkout/lucene/backward-codecs/build/test-results/test/outputs/OUTPUT-org.apache.lucene.backward_codecs.lucene87.TestLucene87StoredFieldsFormatHighCompression.txt
    Reproduce with: gradlew :lucene:backward-codecs:test --tests "org.apache.lucene.backward_codecs.lucene87.TestLucene87StoredFieldsFormatHighCompression.testMergeStability" -Ptests.asserts=true -Ptests.file.encoding=UTF-8 -Ptests.gui=true -Ptests.haltonfailure=false -Ptests.jvmargs= -Ptests.jvms=4 -Ptests.linedocsfile=/home/jenkins/jenkins-agent/workspace/Lucene/Lucene-NightlyTests-main/test-data/enwiki.random.lines.txt -Ptests.multiplier=2 -Ptests.nightly=true -Ptests.seed=37D0A4589052930D -Ptests.vectorsize=256

  - org.apache.lucene.backward_codecs.lucene87.TestLucene87StoredFieldsFormat.testMergeStability (:lucene:backward-codecs)
    Test output: /home/jenkins/jenkins-agent/workspace/Lucene/Lucene-NightlyTests-main/checkout/lucene/backward-codecs/build/test-results/test/outputs/OUTPUT-org.apache.lucene.backward_codecs.lucene87.TestLucene87StoredFieldsFormat.txt
    Reproduce with: gradlew :lucene:backward-codecs:test --tests "org.apache.lucene.backward_codecs.lucene87.TestLucene87StoredFieldsFormat.testMergeStability" -Ptests.asserts=true -Ptests.file.encoding=UTF-8 -Ptests.gui=true -Ptests.haltonfailure=false -Ptests.jvmargs= -Ptests.jvms=4 -Ptests.linedocsfile=/home/jenkins/jenkins-agent/workspace/Lucene/Lucene-NightlyTests-main/test-data/enwiki.random.lines.txt -Ptests.multiplier=2 -Ptests.nightly=true -Ptests.seed=37D0A4589052930D -Ptests.vectorsize=256

The slowest tests during this run:
  899.29s TestIDVersionPostingsFormat.testGlobalVersions (:lucene:sandbox)
  438.90s TestSimpleTextPostingsFormat.testDocsAndFreqsAndPositionsAndOffsetsAndPayloads (:lucene:codecs)
  395.07s Test2BPostings.test (:lucene:core)
  283.61s TestStressNRTReplication.test (:lucene:replicator)
  245.21s TestSortedDvMultiRangeQuery.testDuelWithStandardDisjunction (:lucene:sandbox)
  241.54s TestBestCompressionLucene80DocValuesFormat.testNumericFieldJumpTables (:lucene:backward-codecs)
  236.51s TestBestSpeedLucene80DocValuesFormat.testNumericFieldJumpTables (:lucene:backward-codecs)
  218.44s TestIndexWriterExceptions.testTooManyTokens (:lucene:core)
  216.35s TestLucene90DocValuesFormat.testNumericFieldJumpTables (:lucene:core)
  212.49s TestLucene90DocValuesFormatMergeInstance.testNumericFieldJumpTables (:lucene:core)
The slowest suites during this run:
  1049.47s TestSimpleTextPostingsFormat (:lucene:codecs)
  901.44s TestIDVersionPostingsFormat (:lucene:sandbox)
  500.83s TestLucene90DocValuesFormat (:lucene:core)
  474.31s TestLucene90DocValuesFormatMergeInstance (:lucene:core)
  460.69s TestBestCompressionLucene80DocValuesFormat (:lucene:backward-codecs)
  432.20s TestBestSpeedLucene80DocValuesFormat (:lucene:backward-codecs)
  395.08s Test2BPostings (:lucene:core)
  283.99s TestStressNRTReplication (:lucene:replicator)
  245.32s TestSortedDvMultiRangeQuery (:lucene:sandbox)
  240.58s TestIndexWriterExceptions (:lucene:core)

[Incubating] Problems report is available at: file:///home/jenkins/jenkins-agent/workspace/Lucene/Lucene-NightlyTests-main/checkout/build/reports/problems/problems-report.html

BUILD SUCCESSFUL in 1h 37m 13s
294 actionable tasks: 150 executed, 144 up-to-date
Consider enabling configuration cache to speed up this build: https://docs.gradle.org/9.2.1/userguide/configuration_cache_enabling.html
Build step 'Invoke Gradle script' changed build result to SUCCESS
Archiving artifacts
‘**/build*/**/tests-cwd/*.hprof’ doesn’t match anything: ‘**’ exists but not ‘**/build*/**/tests-cwd/*.hprof’
No artifacts found that match the file pattern "**/build*/**/tests-cwd/*.hprof,**/*_pid*.log". Configuration error?
Recording test results
[Checks API] No suitable checks publisher found.
Build step 'Publish JUnit test result report' changed build result to UNSTABLE
Email was triggered for: Unstable (Test Failures)
Sending email for trigger: Unstable (Test Failures)