You are viewing a plain text version of this content. The canonical link for it is here.
Posted to hdfs-dev@hadoop.apache.org by Apache Jenkins Server <je...@builds.apache.org> on 2011/12/07 01:43:22 UTC
Hadoop-Hdfs-0.23-Commit - Build # 245 - Still Failing
See https://builds.apache.org/job/Hadoop-Hdfs-0.23-Commit/245/
###################################################################################
########################## LAST 60 LINES OF THE CONSOLE ###########################
[...truncated 8598 lines...]
1608 KB
1612 KB
1616 KB
1620 KB
1624 KB
1628 KB
1632 KB
1636 KB
1640 KB
1644 KB
1648 KB
1652 KB
1656 KB
1660 KB
1664 KB
1668 KB
1672 KB
1676 KB
1680 KB
1684 KB
1688 KB
1692 KB
1696 KB
1700 KB
1704 KB
1708 KB
1712 KB
1715 KB
Uploading: https://repository.apache.org/content/repositories/snapshots/org/apache/hadoop/hadoop-hdfs/0.23.1-SNAPSHOT/hadoop-hdfs-0.23.1-20111207.004319-87.pom
4 KB
8 KB
12 KB
16 KB
18 KB
[INFO] ------------------------------------------------------------------------
[INFO] Reactor Summary:
[INFO]
[INFO] Apache Hadoop HDFS ................................ FAILURE [9.082s]
[INFO] Apache Hadoop HDFS Project ........................ SKIPPED
[INFO] ------------------------------------------------------------------------
[INFO] BUILD FAILURE
[INFO] ------------------------------------------------------------------------
[INFO] Total time: 9.316s
[INFO] Finished at: Wed Dec 07 00:43:21 UTC 2011
[INFO] Final Memory: 19M/308M
[INFO] ------------------------------------------------------------------------
[ERROR] Failed to execute goal org.apache.maven.plugins:maven-deploy-plugin:2.5:deploy (default-deploy) on project hadoop-hdfs: Failed to deploy artifacts: Could not transfer artifact org.apache.hadoop:hadoop-hdfs:jar:0.23.1-20111207.004319-87 from/to apache.snapshots.https (https://repository.apache.org/content/repositories/snapshots): Failed to transfer file: https://repository.apache.org/content/repositories/snapshots/org/apache/hadoop/hadoop-hdfs/0.23.1-SNAPSHOT/hadoop-hdfs-0.23.1-20111207.004319-87.jar. Return code is: 401 -> [Help 1]
[ERROR]
[ERROR] To see the full stack trace of the errors, re-run Maven with the -e switch.
[ERROR] Re-run Maven using the -X switch to enable full debug logging.
[ERROR]
[ERROR] For more information about the errors and possible solutions, please read the following articles:
[ERROR] [Help 1] http://cwiki.apache.org/confluence/display/MAVEN/MojoExecutionException
Build step 'Execute shell' marked build as failure
Updating MAPREDUCE-3147
Email was triggered for: Failure
Sending email for trigger: Failure
###################################################################################
############################## FAILED TESTS (if any) ##############################
No tests ran.
Hadoop-Hdfs-0.23-Commit - Build # 248 - Still Failing
Posted by Apache Jenkins Server <je...@builds.apache.org>.
See https://builds.apache.org/job/Hadoop-Hdfs-0.23-Commit/248/
###################################################################################
########################## LAST 60 LINES OF THE CONSOLE ###########################
[...truncated 8696 lines...]
[INFO]
[INFO] ------------------------------------------------------------------------
[INFO] Building Apache Hadoop HttpFS 0.23.1-SNAPSHOT
[INFO] ------------------------------------------------------------------------
[INFO]
[INFO] --- maven-antrun-plugin:1.6:run (create-testdirs) @ hadoop-hdfs-httpfs ---
[INFO] Executing tasks
main:
[INFO] Executed tasks
[INFO]
[INFO] --- maven-resources-plugin:2.4.3:resources (default-resources) @ hadoop-hdfs-httpfs ---
[INFO] Using 'UTF-8' encoding to copy filtered resources.
[INFO] Copying 1 resource
[INFO] Copying 2 resources
[INFO]
[INFO] --- maven-compiler-plugin:2.3.2:compile (default-compile) @ hadoop-hdfs-httpfs ---
[INFO] Compiling 47 source files to /home/jenkins/jenkins-slave/workspace/Hadoop-Hdfs-0.23-Commit/trunk/hadoop-hdfs-project/hadoop-hdfs-httpfs/target/classes
[INFO] -------------------------------------------------------------
[ERROR] COMPILATION ERROR :
[INFO] -------------------------------------------------------------
[ERROR] /home/jenkins/jenkins-slave/workspace/Hadoop-Hdfs-0.23-Commit/trunk/hadoop-hdfs-project/hadoop-hdfs-httpfs/src/main/java/org/apache/hadoop/fs/http/server/FSOperations.java:[7,27] org.apache.hadoop.fs.GlobFilter is not public in org.apache.hadoop.fs; cannot be accessed from outside package
[ERROR] /home/jenkins/jenkins-slave/workspace/Hadoop-Hdfs-0.23-Commit/trunk/hadoop-hdfs-project/hadoop-hdfs-httpfs/src/main/java/org/apache/hadoop/fs/http/server/FSOperations.java:[433,50] cannot find symbol
symbol : class GlobFilter
location: class org.apache.hadoop.fs.http.server.FSOperations.FSListStatus
[INFO] 2 errors
[INFO] -------------------------------------------------------------
[INFO] ------------------------------------------------------------------------
[INFO] Reactor Summary:
[INFO]
[INFO] Apache Hadoop HDFS ................................ SUCCESS [14.670s]
[INFO] Apache Hadoop HttpFS .............................. FAILURE [1.197s]
[INFO] Apache Hadoop HDFS Project ........................ SKIPPED
[INFO] ------------------------------------------------------------------------
[INFO] BUILD FAILURE
[INFO] ------------------------------------------------------------------------
[INFO] Total time: 16.149s
[INFO] Finished at: Thu Dec 08 19:57:21 UTC 2011
[INFO] Final Memory: 26M/376M
[INFO] ------------------------------------------------------------------------
[ERROR] Failed to execute goal org.apache.maven.plugins:maven-compiler-plugin:2.3.2:compile (default-compile) on project hadoop-hdfs-httpfs: Compilation failure: Compilation failure:
[ERROR] /home/jenkins/jenkins-slave/workspace/Hadoop-Hdfs-0.23-Commit/trunk/hadoop-hdfs-project/hadoop-hdfs-httpfs/src/main/java/org/apache/hadoop/fs/http/server/FSOperations.java:[7,27] org.apache.hadoop.fs.GlobFilter is not public in org.apache.hadoop.fs; cannot be accessed from outside package
[ERROR] /home/jenkins/jenkins-slave/workspace/Hadoop-Hdfs-0.23-Commit/trunk/hadoop-hdfs-project/hadoop-hdfs-httpfs/src/main/java/org/apache/hadoop/fs/http/server/FSOperations.java:[433,50] cannot find symbol
[ERROR] symbol : class GlobFilter
[ERROR] location: class org.apache.hadoop.fs.http.server.FSOperations.FSListStatus
[ERROR] -> [Help 1]
[ERROR]
[ERROR] To see the full stack trace of the errors, re-run Maven with the -e switch.
[ERROR] Re-run Maven using the -X switch to enable full debug logging.
[ERROR]
[ERROR] For more information about the errors and possible solutions, please read the following articles:
[ERROR] [Help 1] http://cwiki.apache.org/confluence/display/MAVEN/MojoFailureException
[ERROR]
[ERROR] After correcting the problems, you can resume the build with the command
[ERROR] mvn <goals> -rf :hadoop-hdfs-httpfs
Build step 'Execute shell' marked build as failure
Updating HADOOP-6840
Email was triggered for: Failure
Sending email for trigger: Failure
###################################################################################
############################## FAILED TESTS (if any) ##############################
No tests ran.
Hadoop-Hdfs-0.23-Commit - Build # 247 - Still Failing
Posted by Apache Jenkins Server <je...@builds.apache.org>.
See https://builds.apache.org/job/Hadoop-Hdfs-0.23-Commit/247/
###################################################################################
########################## LAST 60 LINES OF THE CONSOLE ###########################
[...truncated 8696 lines...]
[INFO]
[INFO] ------------------------------------------------------------------------
[INFO] Building Apache Hadoop HttpFS 0.23.1-SNAPSHOT
[INFO] ------------------------------------------------------------------------
[INFO]
[INFO] --- maven-antrun-plugin:1.6:run (create-testdirs) @ hadoop-hdfs-httpfs ---
[INFO] Executing tasks
main:
[INFO] Executed tasks
[INFO]
[INFO] --- maven-resources-plugin:2.4.3:resources (default-resources) @ hadoop-hdfs-httpfs ---
[INFO] Using 'UTF-8' encoding to copy filtered resources.
[INFO] Copying 1 resource
[INFO] Copying 2 resources
[INFO]
[INFO] --- maven-compiler-plugin:2.3.2:compile (default-compile) @ hadoop-hdfs-httpfs ---
[INFO] Compiling 47 source files to /home/jenkins/jenkins-slave/workspace/Hadoop-Hdfs-0.23-Commit/trunk/hadoop-hdfs-project/hadoop-hdfs-httpfs/target/classes
[INFO] -------------------------------------------------------------
[ERROR] COMPILATION ERROR :
[INFO] -------------------------------------------------------------
[ERROR] /home/jenkins/jenkins-slave/workspace/Hadoop-Hdfs-0.23-Commit/trunk/hadoop-hdfs-project/hadoop-hdfs-httpfs/src/main/java/org/apache/hadoop/fs/http/server/FSOperations.java:[7,27] org.apache.hadoop.fs.GlobFilter is not public in org.apache.hadoop.fs; cannot be accessed from outside package
[ERROR] /home/jenkins/jenkins-slave/workspace/Hadoop-Hdfs-0.23-Commit/trunk/hadoop-hdfs-project/hadoop-hdfs-httpfs/src/main/java/org/apache/hadoop/fs/http/server/FSOperations.java:[433,50] cannot find symbol
symbol : class GlobFilter
location: class org.apache.hadoop.fs.http.server.FSOperations.FSListStatus
[INFO] 2 errors
[INFO] -------------------------------------------------------------
[INFO] ------------------------------------------------------------------------
[INFO] Reactor Summary:
[INFO]
[INFO] Apache Hadoop HDFS ................................ SUCCESS [14.684s]
[INFO] Apache Hadoop HttpFS .............................. FAILURE [1.224s]
[INFO] Apache Hadoop HDFS Project ........................ SKIPPED
[INFO] ------------------------------------------------------------------------
[INFO] BUILD FAILURE
[INFO] ------------------------------------------------------------------------
[INFO] Total time: 16.189s
[INFO] Finished at: Thu Dec 08 19:43:15 UTC 2011
[INFO] Final Memory: 21M/187M
[INFO] ------------------------------------------------------------------------
[ERROR] Failed to execute goal org.apache.maven.plugins:maven-compiler-plugin:2.3.2:compile (default-compile) on project hadoop-hdfs-httpfs: Compilation failure: Compilation failure:
[ERROR] /home/jenkins/jenkins-slave/workspace/Hadoop-Hdfs-0.23-Commit/trunk/hadoop-hdfs-project/hadoop-hdfs-httpfs/src/main/java/org/apache/hadoop/fs/http/server/FSOperations.java:[7,27] org.apache.hadoop.fs.GlobFilter is not public in org.apache.hadoop.fs; cannot be accessed from outside package
[ERROR] /home/jenkins/jenkins-slave/workspace/Hadoop-Hdfs-0.23-Commit/trunk/hadoop-hdfs-project/hadoop-hdfs-httpfs/src/main/java/org/apache/hadoop/fs/http/server/FSOperations.java:[433,50] cannot find symbol
[ERROR] symbol : class GlobFilter
[ERROR] location: class org.apache.hadoop.fs.http.server.FSOperations.FSListStatus
[ERROR] -> [Help 1]
[ERROR]
[ERROR] To see the full stack trace of the errors, re-run Maven with the -e switch.
[ERROR] Re-run Maven using the -X switch to enable full debug logging.
[ERROR]
[ERROR] For more information about the errors and possible solutions, please read the following articles:
[ERROR] [Help 1] http://cwiki.apache.org/confluence/display/MAVEN/MojoFailureException
[ERROR]
[ERROR] After correcting the problems, you can resume the build with the command
[ERROR] mvn <goals> -rf :hadoop-hdfs-httpfs
Build step 'Execute shell' marked build as failure
Updating HDFS-2178
Email was triggered for: Failure
Sending email for trigger: Failure
###################################################################################
############################## FAILED TESTS (if any) ##############################
No tests ran.
Hadoop-Hdfs-0.23-Commit - Build # 246 - Still Failing
Posted by Apache Jenkins Server <je...@builds.apache.org>.
See https://builds.apache.org/job/Hadoop-Hdfs-0.23-Commit/246/
###################################################################################
########################## LAST 60 LINES OF THE CONSOLE ###########################
[...truncated 8598 lines...]
1608 KB
1612 KB
1616 KB
1620 KB
1624 KB
1628 KB
1632 KB
1636 KB
1640 KB
1644 KB
1648 KB
1652 KB
1656 KB
1660 KB
1664 KB
1668 KB
1672 KB
1676 KB
1680 KB
1684 KB
1688 KB
1692 KB
1696 KB
1700 KB
1704 KB
1708 KB
1712 KB
1715 KB
Uploading: https://repository.apache.org/content/repositories/snapshots/org/apache/hadoop/hadoop-hdfs/0.23.1-SNAPSHOT/hadoop-hdfs-0.23.1-20111207.223307-88.pom
4 KB
8 KB
12 KB
16 KB
18 KB
[INFO] ------------------------------------------------------------------------
[INFO] Reactor Summary:
[INFO]
[INFO] Apache Hadoop HDFS ................................ FAILURE [9.290s]
[INFO] Apache Hadoop HDFS Project ........................ SKIPPED
[INFO] ------------------------------------------------------------------------
[INFO] BUILD FAILURE
[INFO] ------------------------------------------------------------------------
[INFO] Total time: 9.522s
[INFO] Finished at: Wed Dec 07 22:33:09 UTC 2011
[INFO] Final Memory: 20M/460M
[INFO] ------------------------------------------------------------------------
[ERROR] Failed to execute goal org.apache.maven.plugins:maven-deploy-plugin:2.5:deploy (default-deploy) on project hadoop-hdfs: Failed to deploy artifacts: Could not transfer artifact org.apache.hadoop:hadoop-hdfs:jar:0.23.1-20111207.223307-88 from/to apache.snapshots.https (https://repository.apache.org/content/repositories/snapshots): Failed to transfer file: https://repository.apache.org/content/repositories/snapshots/org/apache/hadoop/hadoop-hdfs/0.23.1-SNAPSHOT/hadoop-hdfs-0.23.1-20111207.223307-88.jar. Return code is: 401 -> [Help 1]
[ERROR]
[ERROR] To see the full stack trace of the errors, re-run Maven with the -e switch.
[ERROR] Re-run Maven using the -X switch to enable full debug logging.
[ERROR]
[ERROR] For more information about the errors and possible solutions, please read the following articles:
[ERROR] [Help 1] http://cwiki.apache.org/confluence/display/MAVEN/MojoExecutionException
Build step 'Execute shell' marked build as failure
Updating HADOOP-7887
Email was triggered for: Failure
Sending email for trigger: Failure
###################################################################################
############################## FAILED TESTS (if any) ##############################
No tests ran.