You are viewing a plain text version of this content. The canonical link for it is here.
Posted to notifications@cxf.apache.org by Apache Jenkins Server <je...@builds.apache.org> on 2019/01/24 18:03:18 UTC
Build failed in Jenkins: CXF-xjc-utils #101
See <https://builds.apache.org/job/CXF-xjc-utils/101/display/redirect?page=changes>
Changes:
[dkulp] [maven-release-plugin] prepare release xjc-utils-3.3.0
------------------------------------------
[...truncated 229.66 KB...]
at org.codehaus.plexus.classworlds.launcher.Launcher.launch (Launcher.java:229)
at jenkins.maven3.agent.Maven35Main.launch (Maven35Main.java:176)
at sun.reflect.NativeMethodAccessorImpl.invoke0 (Native Method)
at sun.reflect.NativeMethodAccessorImpl.invoke (NativeMethodAccessorImpl.java:62)
at sun.reflect.DelegatingMethodAccessorImpl.invoke (DelegatingMethodAccessorImpl.java:43)
at java.lang.reflect.Method.invoke (Method.java:498)
at hudson.maven.Maven3Builder.call (Maven3Builder.java:139)
at hudson.maven.Maven3Builder.call (Maven3Builder.java:70)
at hudson.remoting.UserRequest.perform (UserRequest.java:212)
at hudson.remoting.UserRequest.perform (UserRequest.java:54)
at hudson.remoting.Request$2.run (Request.java:369)
at hudson.remoting.InterceptingExecutorService$1.call (InterceptingExecutorService.java:72)
at java.util.concurrent.FutureTask.run (FutureTask.java:266)
at java.util.concurrent.ThreadPoolExecutor.runWorker (ThreadPoolExecutor.java:1149)
at java.util.concurrent.ThreadPoolExecutor$Worker.run (ThreadPoolExecutor.java:624)
at java.lang.Thread.run (Thread.java:748)
Caused by: org.apache.maven.plugin.MojoExecutionException: Failed to deploy artifacts: Could not transfer artifact org.apache.cxf.xjc-utils:xjc-utils:pom:3.3.0 from/to apache.releases.https (https://repository.apache.org/service/local/staging/deploy/maven2): Failed to transfer file https://repository.apache.org/service/local/staging/deploy/maven2/org/apache/cxf/xjc-utils/xjc-utils/3.3.0/xjc-utils-3.3.0.pom with status code 401
at org.apache.maven.plugin.deploy.DeployMojo.deployProject (DeployMojo.java:284)
at org.apache.maven.plugin.deploy.DeployMojo.execute (DeployMojo.java:169)
at org.apache.maven.plugin.DefaultBuildPluginManager.executeMojo (DefaultBuildPluginManager.java:137)
at org.apache.maven.lifecycle.internal.MojoExecutor.execute (MojoExecutor.java:210)
at org.apache.maven.lifecycle.internal.MojoExecutor.execute (MojoExecutor.java:156)
at org.apache.maven.lifecycle.internal.MojoExecutor.execute (MojoExecutor.java:148)
at org.apache.maven.lifecycle.internal.LifecycleModuleBuilder.buildProject (LifecycleModuleBuilder.java:117)
at org.apache.maven.lifecycle.internal.LifecycleModuleBuilder.buildProject (LifecycleModuleBuilder.java:81)
at org.apache.maven.lifecycle.internal.builder.singlethreaded.SingleThreadedBuilder.build (SingleThreadedBuilder.java:56)
at org.apache.maven.lifecycle.internal.LifecycleStarter.execute (LifecycleStarter.java:128)
at org.apache.maven.DefaultMaven.doExecute (DefaultMaven.java:305)
at org.apache.maven.DefaultMaven.doExecute (DefaultMaven.java:192)
at org.apache.maven.DefaultMaven.execute (DefaultMaven.java:105)
at org.jvnet.hudson.maven3.launcher.Maven35Launcher.main (Maven35Launcher.java:130)
at sun.reflect.NativeMethodAccessorImpl.invoke0 (Native Method)
at sun.reflect.NativeMethodAccessorImpl.invoke (NativeMethodAccessorImpl.java:62)
at sun.reflect.DelegatingMethodAccessorImpl.invoke (DelegatingMethodAccessorImpl.java:43)
at java.lang.reflect.Method.invoke (Method.java:498)
at org.codehaus.plexus.classworlds.launcher.Launcher.launchEnhanced (Launcher.java:289)
at org.codehaus.plexus.classworlds.launcher.Launcher.launch (Launcher.java:229)
at jenkins.maven3.agent.Maven35Main.launch (Maven35Main.java:176)
at sun.reflect.NativeMethodAccessorImpl.invoke0 (Native Method)
at sun.reflect.NativeMethodAccessorImpl.invoke (NativeMethodAccessorImpl.java:62)
at sun.reflect.DelegatingMethodAccessorImpl.invoke (DelegatingMethodAccessorImpl.java:43)
at java.lang.reflect.Method.invoke (Method.java:498)
at hudson.maven.Maven3Builder.call (Maven3Builder.java:139)
at hudson.maven.Maven3Builder.call (Maven3Builder.java:70)
at hudson.remoting.UserRequest.perform (UserRequest.java:212)
at hudson.remoting.UserRequest.perform (UserRequest.java:54)
at hudson.remoting.Request$2.run (Request.java:369)
at hudson.remoting.InterceptingExecutorService$1.call (InterceptingExecutorService.java:72)
at java.util.concurrent.FutureTask.run (FutureTask.java:266)
at java.util.concurrent.ThreadPoolExecutor.runWorker (ThreadPoolExecutor.java:1149)
at java.util.concurrent.ThreadPoolExecutor$Worker.run (ThreadPoolExecutor.java:624)
at java.lang.Thread.run (Thread.java:748)
Caused by: org.apache.maven.artifact.deployer.ArtifactDeploymentException: Failed to deploy artifacts: Could not transfer artifact org.apache.cxf.xjc-utils:xjc-utils:pom:3.3.0 from/to apache.releases.https (https://repository.apache.org/service/local/staging/deploy/maven2): Failed to transfer file https://repository.apache.org/service/local/staging/deploy/maven2/org/apache/cxf/xjc-utils/xjc-utils/3.3.0/xjc-utils-3.3.0.pom with status code 401
at org.apache.maven.artifact.deployer.DefaultArtifactDeployer.deploy (DefaultArtifactDeployer.java:146)
at org.apache.maven.plugin.deploy.AbstractDeployMojo.deploy (AbstractDeployMojo.java:171)
at org.apache.maven.plugin.deploy.DeployMojo.deployProject (DeployMojo.java:242)
at org.apache.maven.plugin.deploy.DeployMojo.execute (DeployMojo.java:169)
at org.apache.maven.plugin.DefaultBuildPluginManager.executeMojo (DefaultBuildPluginManager.java:137)
at org.apache.maven.lifecycle.internal.MojoExecutor.execute (MojoExecutor.java:210)
at org.apache.maven.lifecycle.internal.MojoExecutor.execute (MojoExecutor.java:156)
at org.apache.maven.lifecycle.internal.MojoExecutor.execute (MojoExecutor.java:148)
at org.apache.maven.lifecycle.internal.LifecycleModuleBuilder.buildProject (LifecycleModuleBuilder.java:117)
at org.apache.maven.lifecycle.internal.LifecycleModuleBuilder.buildProject (LifecycleModuleBuilder.java:81)
at org.apache.maven.lifecycle.internal.builder.singlethreaded.SingleThreadedBuilder.build (SingleThreadedBuilder.java:56)
at org.apache.maven.lifecycle.internal.LifecycleStarter.execute (LifecycleStarter.java:128)
at org.apache.maven.DefaultMaven.doExecute (DefaultMaven.java:305)
at org.apache.maven.DefaultMaven.doExecute (DefaultMaven.java:192)
at org.apache.maven.DefaultMaven.execute (DefaultMaven.java:105)
at org.jvnet.hudson.maven3.launcher.Maven35Launcher.main (Maven35Launcher.java:130)
at sun.reflect.NativeMethodAccessorImpl.invoke0 (Native Method)
at sun.reflect.NativeMethodAccessorImpl.invoke (NativeMethodAccessorImpl.java:62)
at sun.reflect.DelegatingMethodAccessorImpl.invoke (DelegatingMethodAccessorImpl.java:43)
at java.lang.reflect.Method.invoke (Method.java:498)
at org.codehaus.plexus.classworlds.launcher.Launcher.launchEnhanced (Launcher.java:289)
at org.codehaus.plexus.classworlds.launcher.Launcher.launch (Launcher.java:229)
at jenkins.maven3.agent.Maven35Main.launch (Maven35Main.java:176)
at sun.reflect.NativeMethodAccessorImpl.invoke0 (Native Method)
at sun.reflect.NativeMethodAccessorImpl.invoke (NativeMethodAccessorImpl.java:62)
at sun.reflect.DelegatingMethodAccessorImpl.invoke (DelegatingMethodAccessorImpl.java:43)
at java.lang.reflect.Method.invoke (Method.java:498)
at hudson.maven.Maven3Builder.call (Maven3Builder.java:139)
at hudson.maven.Maven3Builder.call (Maven3Builder.java:70)
at hudson.remoting.UserRequest.perform (UserRequest.java:212)
at hudson.remoting.UserRequest.perform (UserRequest.java:54)
at hudson.remoting.Request$2.run (Request.java:369)
at hudson.remoting.InterceptingExecutorService$1.call (InterceptingExecutorService.java:72)
at java.util.concurrent.FutureTask.run (FutureTask.java:266)
at java.util.concurrent.ThreadPoolExecutor.runWorker (ThreadPoolExecutor.java:1149)
at java.util.concurrent.ThreadPoolExecutor$Worker.run (ThreadPoolExecutor.java:624)
at java.lang.Thread.run (Thread.java:748)
Caused by: org.eclipse.aether.deployment.DeploymentException: Failed to deploy artifacts: Could not transfer artifact org.apache.cxf.xjc-utils:xjc-utils:pom:3.3.0 from/to apache.releases.https (https://repository.apache.org/service/local/staging/deploy/maven2): Failed to transfer file https://repository.apache.org/service/local/staging/deploy/maven2/org/apache/cxf/xjc-utils/xjc-utils/3.3.0/xjc-utils-3.3.0.pom with status code 401
at org.eclipse.aether.internal.impl.DefaultDeployer.deploy (DefaultDeployer.java:301)
at org.eclipse.aether.internal.impl.DefaultDeployer.deploy (DefaultDeployer.java:211)
at org.eclipse.aether.internal.impl.DefaultRepositorySystem.deploy (DefaultRepositorySystem.java:371)
at org.apache.maven.artifact.deployer.DefaultArtifactDeployer.deploy (DefaultArtifactDeployer.java:142)
at org.apache.maven.plugin.deploy.AbstractDeployMojo.deploy (AbstractDeployMojo.java:171)
at org.apache.maven.plugin.deploy.DeployMojo.deployProject (DeployMojo.java:242)
at org.apache.maven.plugin.deploy.DeployMojo.execute (DeployMojo.java:169)
at org.apache.maven.plugin.DefaultBuildPluginManager.executeMojo (DefaultBuildPluginManager.java:137)
at org.apache.maven.lifecycle.internal.MojoExecutor.execute (MojoExecutor.java:210)
at org.apache.maven.lifecycle.internal.MojoExecutor.execute (MojoExecutor.java:156)
at org.apache.maven.lifecycle.internal.MojoExecutor.execute (MojoExecutor.java:148)
at org.apache.maven.lifecycle.internal.LifecycleModuleBuilder.buildProject (LifecycleModuleBuilder.java:117)
at org.apache.maven.lifecycle.internal.LifecycleModuleBuilder.buildProject (LifecycleModuleBuilder.java:81)
at org.apache.maven.lifecycle.internal.builder.singlethreaded.SingleThreadedBuilder.build (SingleThreadedBuilder.java:56)
at org.apache.maven.lifecycle.internal.LifecycleStarter.execute (LifecycleStarter.java:128)
at org.apache.maven.DefaultMaven.doExecute (DefaultMaven.java:305)
at org.apache.maven.DefaultMaven.doExecute (DefaultMaven.java:192)
at org.apache.maven.DefaultMaven.execute (DefaultMaven.java:105)
at org.jvnet.hudson.maven3.launcher.Maven35Launcher.main (Maven35Launcher.java:130)
at sun.reflect.NativeMethodAccessorImpl.invoke0 (Native Method)
at sun.reflect.NativeMethodAccessorImpl.invoke (NativeMethodAccessorImpl.java:62)
at sun.reflect.DelegatingMethodAccessorImpl.invoke (DelegatingMethodAccessorImpl.java:43)
at java.lang.reflect.Method.invoke (Method.java:498)
at org.codehaus.plexus.classworlds.launcher.Launcher.launchEnhanced (Launcher.java:289)
at org.codehaus.plexus.classworlds.launcher.Launcher.launch (Launcher.java:229)
at jenkins.maven3.agent.Maven35Main.launch (Maven35Main.java:176)
at sun.reflect.NativeMethodAccessorImpl.invoke0 (Native Method)
at sun.reflect.NativeMethodAccessorImpl.invoke (NativeMethodAccessorImpl.java:62)
at sun.reflect.DelegatingMethodAccessorImpl.invoke (DelegatingMethodAccessorImpl.java:43)
at java.lang.reflect.Method.invoke (Method.java:498)
at hudson.maven.Maven3Builder.call (Maven3Builder.java:139)
at hudson.maven.Maven3Builder.call (Maven3Builder.java:70)
at hudson.remoting.UserRequest.perform (UserRequest.java:212)
at hudson.remoting.UserRequest.perform (UserRequest.java:54)
at hudson.remoting.Request$2.run (Request.java:369)
at hudson.remoting.InterceptingExecutorService$1.call (InterceptingExecutorService.java:72)
at java.util.concurrent.FutureTask.run (FutureTask.java:266)
at java.util.concurrent.ThreadPoolExecutor.runWorker (ThreadPoolExecutor.java:1149)
at java.util.concurrent.ThreadPoolExecutor$Worker.run (ThreadPoolExecutor.java:624)
at java.lang.Thread.run (Thread.java:748)
Caused by: org.eclipse.aether.transfer.ArtifactTransferException: Could not transfer artifact org.apache.cxf.xjc-utils:xjc-utils:pom:3.3.0 from/to apache.releases.https (https://repository.apache.org/service/local/staging/deploy/maven2): Failed to transfer file https://repository.apache.org/service/local/staging/deploy/maven2/org/apache/cxf/xjc-utils/xjc-utils/3.3.0/xjc-utils-3.3.0.pom with status code 401
at org.eclipse.aether.connector.basic.ArtifactTransportListener.transferFailed (ArtifactTransportListener.java:52)
at org.eclipse.aether.connector.basic.BasicRepositoryConnector$TaskRunner.run (BasicRepositoryConnector.java:368)
at org.eclipse.aether.connector.basic.BasicRepositoryConnector.put (BasicRepositoryConnector.java:287)
at org.eclipse.aether.internal.impl.DefaultDeployer.deploy (DefaultDeployer.java:295)
at org.eclipse.aether.internal.impl.DefaultDeployer.deploy (DefaultDeployer.java:211)
at org.eclipse.aether.internal.impl.DefaultRepositorySystem.deploy (DefaultRepositorySystem.java:371)
at org.apache.maven.artifact.deployer.DefaultArtifactDeployer.deploy (DefaultArtifactDeployer.java:142)
at org.apache.maven.plugin.deploy.AbstractDeployMojo.deploy (AbstractDeployMojo.java:171)
at org.apache.maven.plugin.deploy.DeployMojo.deployProject (DeployMojo.java:242)
at org.apache.maven.plugin.deploy.DeployMojo.execute (DeployMojo.java:169)
at org.apache.maven.plugin.DefaultBuildPluginManager.executeMojo (DefaultBuildPluginManager.java:137)
at org.apache.maven.lifecycle.internal.MojoExecutor.execute (MojoExecutor.java:210)
at org.apache.maven.lifecycle.internal.MojoExecutor.execute (MojoExecutor.java:156)
at org.apache.maven.lifecycle.internal.MojoExecutor.execute (MojoExecutor.java:148)
at org.apache.maven.lifecycle.internal.LifecycleModuleBuilder.buildProject (LifecycleModuleBuilder.java:117)
at org.apache.maven.lifecycle.internal.LifecycleModuleBuilder.buildProject (LifecycleModuleBuilder.java:81)
at org.apache.maven.lifecycle.internal.builder.singlethreaded.SingleThreadedBuilder.build (SingleThreadedBuilder.java:56)
at org.apache.maven.lifecycle.internal.LifecycleStarter.execute (LifecycleStarter.java:128)
at org.apache.maven.DefaultMaven.doExecute (DefaultMaven.java:305)
at org.apache.maven.DefaultMaven.doExecute (DefaultMaven.java:192)
at org.apache.maven.DefaultMaven.execute (DefaultMaven.java:105)
at org.jvnet.hudson.maven3.launcher.Maven35Launcher.main (Maven35Launcher.java:130)
at sun.reflect.NativeMethodAccessorImpl.invoke0 (Native Method)
at sun.reflect.NativeMethodAccessorImpl.invoke (NativeMethodAccessorImpl.java:62)
at sun.reflect.DelegatingMethodAccessorImpl.invoke (DelegatingMethodAccessorImpl.java:43)
at java.lang.reflect.Method.invoke (Method.java:498)
at org.codehaus.plexus.classworlds.launcher.Launcher.launchEnhanced (Launcher.java:289)
at org.codehaus.plexus.classworlds.launcher.Launcher.launch (Launcher.java:229)
at jenkins.maven3.agent.Maven35Main.launch (Maven35Main.java:176)
at sun.reflect.NativeMethodAccessorImpl.invoke0 (Native Method)
at sun.reflect.NativeMethodAccessorImpl.invoke (NativeMethodAccessorImpl.java:62)
at sun.reflect.DelegatingMethodAccessorImpl.invoke (DelegatingMethodAccessorImpl.java:43)
at java.lang.reflect.Method.invoke (Method.java:498)
at hudson.maven.Maven3Builder.call (Maven3Builder.java:139)
at hudson.maven.Maven3Builder.call (Maven3Builder.java:70)
at hudson.remoting.UserRequest.perform (UserRequest.java:212)
at hudson.remoting.UserRequest.perform (UserRequest.java:54)
at hudson.remoting.Request$2.run (Request.java:369)
at hudson.remoting.InterceptingExecutorService$1.call (InterceptingExecutorService.java:72)
at java.util.concurrent.FutureTask.run (FutureTask.java:266)
at java.util.concurrent.ThreadPoolExecutor.runWorker (ThreadPoolExecutor.java:1149)
at java.util.concurrent.ThreadPoolExecutor$Worker.run (ThreadPoolExecutor.java:624)
at java.lang.Thread.run (Thread.java:748)
Caused by: org.apache.maven.wagon.TransferFailedException: Failed to transfer file https://repository.apache.org/service/local/staging/deploy/maven2/org/apache/cxf/xjc-utils/xjc-utils/3.3.0/xjc-utils-3.3.0.pom with status code 401
at org.apache.maven.wagon.providers.http.wagon.shared.AbstractHttpClientWagon.put (AbstractHttpClientWagon.java:734)
at org.apache.maven.wagon.providers.http.wagon.shared.AbstractHttpClientWagon.put (AbstractHttpClientWagon.java:648)
at org.apache.maven.wagon.providers.http.wagon.shared.AbstractHttpClientWagon.put (AbstractHttpClientWagon.java:630)
at org.apache.maven.wagon.providers.http.wagon.shared.AbstractHttpClientWagon.put (AbstractHttpClientWagon.java:624)
at org.apache.maven.wagon.providers.http.wagon.shared.AbstractHttpClientWagon.put (AbstractHttpClientWagon.java:604)
at org.eclipse.aether.transport.wagon.WagonTransporter$PutTaskRunner.run (WagonTransporter.java:686)
at org.eclipse.aether.transport.wagon.WagonTransporter.execute (WagonTransporter.java:435)
at org.eclipse.aether.transport.wagon.WagonTransporter.put (WagonTransporter.java:418)
at org.eclipse.aether.connector.basic.BasicRepositoryConnector$PutTaskRunner.runTask (BasicRepositoryConnector.java:554)
at org.eclipse.aether.connector.basic.BasicRepositoryConnector$TaskRunner.run (BasicRepositoryConnector.java:363)
at org.eclipse.aether.connector.basic.BasicRepositoryConnector.put (BasicRepositoryConnector.java:287)
at org.eclipse.aether.internal.impl.DefaultDeployer.deploy (DefaultDeployer.java:295)
at org.eclipse.aether.internal.impl.DefaultDeployer.deploy (DefaultDeployer.java:211)
at org.eclipse.aether.internal.impl.DefaultRepositorySystem.deploy (DefaultRepositorySystem.java:371)
at org.apache.maven.artifact.deployer.DefaultArtifactDeployer.deploy (DefaultArtifactDeployer.java:142)
at org.apache.maven.plugin.deploy.AbstractDeployMojo.deploy (AbstractDeployMojo.java:171)
at org.apache.maven.plugin.deploy.DeployMojo.deployProject (DeployMojo.java:242)
at org.apache.maven.plugin.deploy.DeployMojo.execute (DeployMojo.java:169)
at org.apache.maven.plugin.DefaultBuildPluginManager.executeMojo (DefaultBuildPluginManager.java:137)
at org.apache.maven.lifecycle.internal.MojoExecutor.execute (MojoExecutor.java:210)
at org.apache.maven.lifecycle.internal.MojoExecutor.execute (MojoExecutor.java:156)
at org.apache.maven.lifecycle.internal.MojoExecutor.execute (MojoExecutor.java:148)
at org.apache.maven.lifecycle.internal.LifecycleModuleBuilder.buildProject (LifecycleModuleBuilder.java:117)
at org.apache.maven.lifecycle.internal.LifecycleModuleBuilder.buildProject (LifecycleModuleBuilder.java:81)
at org.apache.maven.lifecycle.internal.builder.singlethreaded.SingleThreadedBuilder.build (SingleThreadedBuilder.java:56)
at org.apache.maven.lifecycle.internal.LifecycleStarter.execute (LifecycleStarter.java:128)
at org.apache.maven.DefaultMaven.doExecute (DefaultMaven.java:305)
at org.apache.maven.DefaultMaven.doExecute (DefaultMaven.java:192)
at org.apache.maven.DefaultMaven.execute (DefaultMaven.java:105)
at org.jvnet.hudson.maven3.launcher.Maven35Launcher.main (Maven35Launcher.java:130)
at sun.reflect.NativeMethodAccessorImpl.invoke0 (Native Method)
at sun.reflect.NativeMethodAccessorImpl.invoke (NativeMethodAccessorImpl.java:62)
at sun.reflect.DelegatingMethodAccessorImpl.invoke (DelegatingMethodAccessorImpl.java:43)
at java.lang.reflect.Method.invoke (Method.java:498)
at org.codehaus.plexus.classworlds.launcher.Launcher.launchEnhanced (Launcher.java:289)
at org.codehaus.plexus.classworlds.launcher.Launcher.launch (Launcher.java:229)
at jenkins.maven3.agent.Maven35Main.launch (Maven35Main.java:176)
at sun.reflect.NativeMethodAccessorImpl.invoke0 (Native Method)
at sun.reflect.NativeMethodAccessorImpl.invoke (NativeMethodAccessorImpl.java:62)
at sun.reflect.DelegatingMethodAccessorImpl.invoke (DelegatingMethodAccessorImpl.java:43)
at java.lang.reflect.Method.invoke (Method.java:498)
at hudson.maven.Maven3Builder.call (Maven3Builder.java:139)
at hudson.maven.Maven3Builder.call (Maven3Builder.java:70)
at hudson.remoting.UserRequest.perform (UserRequest.java:212)
at hudson.remoting.UserRequest.perform (UserRequest.java:54)
at hudson.remoting.Request$2.run (Request.java:369)
at hudson.remoting.InterceptingExecutorService$1.call (InterceptingExecutorService.java:72)
at java.util.concurrent.FutureTask.run (FutureTask.java:266)
at java.util.concurrent.ThreadPoolExecutor.runWorker (ThreadPoolExecutor.java:1149)
at java.util.concurrent.ThreadPoolExecutor$Worker.run (ThreadPoolExecutor.java:624)
at java.lang.Thread.run (Thread.java:748)
[ERROR]
[ERROR] Re-run Maven using the -X switch to enable full debug logging.
[ERROR]
[ERROR] For more information about the errors and possible solutions, please read the following articles:
[ERROR] [Help 1] http://cwiki.apache.org/confluence/display/MAVEN/MojoExecutionException
[JENKINS] Archiving <https://builds.apache.org/job/CXF-xjc-utils/ws/cxf-xjc-plugin/pom.xml> to org.apache.cxf/cxf-xjc-plugin/3.3.0/cxf-xjc-plugin-3.3.0.pom
[JENKINS] Archiving <https://builds.apache.org/job/CXF-xjc-utils/ws/property-listener/pom.xml> to org.apache.cxf.xjcplugins/cxf-xjc-pl/3.3.0/cxf-xjc-pl-3.3.0.pom
[JENKINS] Archiving <https://builds.apache.org/job/CXF-xjc-utils/ws/bug671/pom.xml> to org.apache.cxf.xjcplugins/cxf-xjc-bug671/3.3.0/cxf-xjc-bug671-3.3.0.pom
[JENKINS] Archiving <https://builds.apache.org/job/CXF-xjc-utils/ws/ts/pom.xml> to org.apache.cxf.xjcplugins/cxf-xjc-ts/3.3.0/cxf-xjc-ts-3.3.0.pom
[JENKINS] Archiving <https://builds.apache.org/job/CXF-xjc-utils/ws/wsdlextension/pom.xml> to org.apache.cxf.xjcplugins/cxf-xjc-wsdlextension/3.3.0/cxf-xjc-wsdlextension-3.3.0.pom
[JENKINS] Archiving <https://builds.apache.org/job/CXF-xjc-utils/ws/boolean/pom.xml> to org.apache.cxf.xjcplugins/cxf-xjc-boolean/3.3.0/cxf-xjc-boolean-3.3.0.pom
[JENKINS] Archiving <https://builds.apache.org/job/CXF-xjc-utils/ws/pom.xml> to org.apache.cxf.xjc-utils/xjc-utils/3.3.0/xjc-utils-3.3.0.pom
[JENKINS] Archiving <https://builds.apache.org/job/CXF-xjc-utils/ws/bug986/pom.xml> to org.apache.cxf.xjcplugins/cxf-xjc-bug986/3.3.0/cxf-xjc-bug986-3.3.0.pom
[JENKINS] Archiving <https://builds.apache.org/job/CXF-xjc-utils/ws/ts-test/pom.xml> to org.apache.cxf.xjcplugins.tests/cxf-xjc-ts-test/3.3.0/cxf-xjc-ts-test-3.3.0.pom
[JENKINS] Archiving <https://builds.apache.org/job/CXF-xjc-utils/ws/boolean-test/pom.xml> to org.apache.cxf.xjcplugins.tests/cxf-xjc-boolean-test/3.3.0/cxf-xjc-boolean-test-3.3.0.pom
[JENKINS] Archiving <https://builds.apache.org/job/CXF-xjc-utils/ws/javadoc/pom.xml> to org.apache.cxf.xjcplugins/cxf-xjc-javadoc/3.3.0/cxf-xjc-javadoc-3.3.0.pom
[JENKINS] Archiving <https://builds.apache.org/job/CXF-xjc-utils/ws/runtime/pom.xml> to org.apache.cxf.xjc-utils/cxf-xjc-runtime/3.3.0/cxf-xjc-runtime-3.3.0.pom
[JENKINS] Archiving <https://builds.apache.org/job/CXF-xjc-utils/ws/wsdlextension-test/pom.xml> to org.apache.cxf.xjcplugins.tests/cxf-xjc-wsdlextension-test/3.3.0/cxf-xjc-wsdlextension-test-3.3.0.pom
[JENKINS] Archiving <https://builds.apache.org/job/CXF-xjc-utils/ws/dv/pom.xml> to org.apache.cxf.xjcplugins/cxf-xjc-dv/3.3.0/cxf-xjc-dv-3.3.0.pom
[JENKINS] Archiving <https://builds.apache.org/job/CXF-xjc-utils/ws/dv-test/pom.xml> to org.apache.cxf.xjcplugins.tests/cxf-xjc-dv-test/3.3.0/cxf-xjc-dv-test-3.3.0.pom
Sending e-mails to: notifications@cxf.apache.org dkulp@apache.org
channel stopped
Jenkins build is back to normal : CXF-xjc-utils #102
Posted by Apache Jenkins Server <je...@builds.apache.org>.
See <https://builds.apache.org/job/CXF-xjc-utils/102/display/redirect?page=changes>