You are viewing a plain text version of this content. The canonical link for it is here.
Posted to commits@tomee.apache.org by Apache Jenkins Server <je...@builds.apache.org> on 2022/04/15 04:46:26 UTC

Build failed in Jenkins: TomEE » tomee-8.x-deploy #41

See <https://ci-builds.apache.org/job/Tomee/job/tomee-8.x-deploy/41/display/redirect>

Changes:


------------------------------------------
Started by timer
Running as SYSTEM
[EnvInject] - Loading node environment variables.
Building remotely on builds34 (ubuntu) in workspace <https://ci-builds.apache.org/job/Tomee/job/tomee-8.x-deploy/ws/>
The recommended git tool is: NONE
No credentials specified
Wiping out workspace first.
Cloning the remote Git repository
Cloning repository https://github.com/apache/tomee
 > git init <https://ci-builds.apache.org/job/Tomee/job/tomee-8.x-deploy/ws/> # timeout=10
Fetching upstream changes from https://github.com/apache/tomee
 > git --version # timeout=10
 > git --version # 'git version 2.17.1'
 > git fetch --tags --progress -- https://github.com/apache/tomee +refs/heads/*:refs/remotes/origin/* # timeout=10
 > git config remote.origin.url https://github.com/apache/tomee # timeout=10
 > git config --add remote.origin.fetch +refs/heads/*:refs/remotes/origin/* # timeout=10
Avoid second fetch
 > git rev-parse refs/remotes/origin/tomee-8.x^{commit} # timeout=10
Checking out Revision 9866a4d5e2d7ba4ea43469fa8945cd3860b050e9 (refs/remotes/origin/tomee-8.x)
 > git config core.sparsecheckout # timeout=10
 > git checkout -f 9866a4d5e2d7ba4ea43469fa8945cd3860b050e9 # timeout=10
Commit message: "Merge remote-tracking branch 'apache/tomee-8.x' into tomee-8.x"
 > git rev-list --no-walk 9866a4d5e2d7ba4ea43469fa8945cd3860b050e9 # timeout=10
Parsing POMs
ERROR: Failed to parse POMs
hudson.remoting.ProxyException: hudson.maven.MavenModuleSetBuild$MavenExecutionException: org.apache.maven.project.ProjectBuildingException: Some problems were encountered while processing the POMs:
[FATAL] Non-resolvable parent POM for org.apache.tomee.itests:ejb:8.0.11-SNAPSHOT: Could not find artifact org.apache.tomee:itests:pom:8.0.11-SNAPSHOT and 'parent.relativePath' points at wrong local POM @ line 24, column 11

	at hudson.maven.MavenModuleSetBuild$PomParser.invoke(MavenModuleSetBuild.java:1391)
	at hudson.maven.MavenModuleSetBuild$PomParser.invoke(MavenModuleSetBuild.java:1124)
	at hudson.FilePath$FileCallableWrapper.call(FilePath.java:3329)
	at hudson.remoting.UserRequest.perform(UserRequest.java:211)
	at hudson.remoting.UserRequest.perform(UserRequest.java:54)
	at hudson.remoting.Request$2.run(Request.java:376)
	at hudson.remoting.InterceptingExecutorService.lambda$wrap$0(InterceptingExecutorService.java:78)
	at java.util.concurrent.FutureTask.run(FutureTask.java:266)
	at java.util.concurrent.ThreadPoolExecutor.runWorker(ThreadPoolExecutor.java:1149)
	at java.util.concurrent.ThreadPoolExecutor$Worker.run(ThreadPoolExecutor.java:624)
	at java.lang.Thread.run(Thread.java:748)
	Suppressed: hudson.remoting.Channel$CallSiteStackTrace: Remote call to builds34
		at hudson.remoting.Channel.attachCallSiteStackTrace(Channel.java:1797)
		at hudson.remoting.UserRequest$ExceptionResponse.retrieve(UserRequest.java:356)
		at hudson.remoting.Channel.call(Channel.java:1001)
		at hudson.FilePath.act(FilePath.java:1165)
		at hudson.FilePath.act(FilePath.java:1154)
		at hudson.maven.MavenModuleSetBuild$MavenModuleSetBuildExecution.parsePoms(MavenModuleSetBuild.java:985)
		at hudson.maven.MavenModuleSetBuild$MavenModuleSetBuildExecution.doRun(MavenModuleSetBuild.java:689)
		at hudson.model.AbstractBuild$AbstractBuildExecution.run(AbstractBuild.java:514)
		at hudson.model.Run.execute(Run.java:1888)
		at hudson.maven.MavenModuleSetBuild.run(MavenModuleSetBuild.java:543)
		at hudson.model.ResourceController.execute(ResourceController.java:99)
		at hudson.model.Executor.run(Executor.java:432)
Caused by: hudson.remoting.ProxyException: org.apache.maven.project.ProjectBuildingException: Some problems were encountered while processing the POMs:
[FATAL] Non-resolvable parent POM for org.apache.tomee.itests:ejb:8.0.11-SNAPSHOT: Could not find artifact org.apache.tomee:itests:pom:8.0.11-SNAPSHOT and 'parent.relativePath' points at wrong local POM @ line 24, column 11

	at org.apache.maven.project.DefaultProjectBuilder.build(DefaultProjectBuilder.java:397)
	at hudson.maven.MavenEmbedder.buildProjects(MavenEmbedder.java:370)
	at hudson.maven.MavenEmbedder.readProjects(MavenEmbedder.java:340)
	at hudson.maven.MavenModuleSetBuild$PomParser.invoke(MavenModuleSetBuild.java:1330)
	... 10 more

Jenkins build is back to normal : TomEE » tomee-8.x-deploy #42

Posted by Apache Jenkins Server <je...@builds.apache.org>.
See <https://ci-builds.apache.org/job/Tomee/job/tomee-8.x-deploy/42/display/redirect>