You are viewing a plain text version of this content. The canonical link for it is here.
Posted to dev@geronimo.apache.org by ga...@apache.org on 2011/02/18 22:34:16 UTC
[BUILD] branches/2.2: Failed for Revision: 1072096
Geronimo Revision: 1072096 built with tests included
See the full build-1400.log file at http://people.apache.org/builds/geronimo/server/binaries/2.2/20110218/build-1400.log
Download the binaries from http://people.apache.org/builds/geronimo/server/binaries/2.2/20110218
[INFO] BUILD SUCCESSFUL
[INFO] ------------------------------------------------------------------------
[INFO] Total time: 30 minutes 27 seconds
[INFO] Finished at: Fri Feb 18 14:36:51 EST 2011
[INFO] Final Memory: 304M/955M
[INFO] ------------------------------------------------------------------------
TESTSUITE RESULTS (Failures only)
=================================
Assembly: tomcat
=================================
See full test results and logs at http://people.apache.org/builds/geronimo/server/binaries/2.2/20110218/logs-1400-tomcat/
[INFO] Running TestSuite
[INFO] Tests run: 40, Failures: 21, Errors: 0, Skipped: 0, Time elapsed: 211.422 sec <<< FAILURE!
[INFO] Running TestSuite
[INFO] Tests run: 12, Failures: 9, Errors: 0, Skipped: 0, Time elapsed: 77.703 sec <<< FAILURE!
--
[INFO] Running TestSuite
[INFO] Tests run: 36, Failures: 1, Errors: 0, Skipped: 0, Time elapsed: 69.878 sec <<< FAILURE!
Assembly: jetty
=================================
See full test results and logs at http://people.apache.org/builds/geronimo/server/binaries/2.2/20110218/logs-1400-jetty/
[INFO] Running TestSuite
[INFO] Tests run: 86, Failures: 13, Errors: 0, Skipped: 68, Time elapsed: 88.878 sec <<< FAILURE!
[INFO] Running TestSuite
[INFO] Tests run: 12, Failures: 9, Errors: 0, Skipped: 0, Time elapsed: 80.556 sec <<< FAILURE!
--
[INFO] Running TestSuite
[INFO] Tests run: 2, Failures: 2, Errors: 0, Skipped: 0, Time elapsed: 7.715 sec <<< FAILURE!
Samples: branches/2.2
=================================
Log: http://people.apache.org/builds/geronimo/server/binaries/2.2/20110218/samples-1400.log
Build status: OK