You are viewing a plain text version of this content. The canonical link for it is here.
Posted to dev@avro.apache.org by Apache Jenkins Server <je...@builds.apache.org> on 2015/10/07 23:44:58 UTC
Build failed in Jenkins: AVRO-python #568
See <https://builds.apache.org/job/AVRO-python/568/changes>
Changes:
[blue] AVRO-1715. Java: Close files opened by the Schema parser. Contributed by Pavel Safrata.
This also clarifies the InputStream parse method, which does not own the
stream that is passed in and does not close it. The tools have been
updated to correctly close streams passed to the parser.
------------------------------------------
[...truncated 1961 lines...]
A lang/c++/test/AvrogencppTests.cc
A lang/c++/test/SpecificTests.cc
A lang/c++/test/buffertest.cc
A lang/c++/test/testgentest.cc
A lang/c++/test/DataFileTests.cc
A lang/c++/test/JsonTests.cc
A lang/c++/test/testparser.cc
A lang/c++/test/LargeSchemaTests.cc
A lang/c++/test/StreamTests.cc
A lang/c++/test/precompile.cc
A lang/c++/test/unittest.cc
A lang/c++/m4
AU lang/c++/m4/README
A lang/c++/m4/m4_ax_boost_filesystem.m4
AU lang/c++/m4/m4_ax_boost_system.m4
AU lang/c++/m4/m4_ax_boost_thread.m4
AU lang/c++/m4/m4_ax_boost_base.m4
AU lang/c++/m4/m4_ax_boost_regex.m4
A lang/c++/m4/m4_ax_boost_asio.m4
A lang/py
A lang/py/build.xml
A lang/py/test
A lang/py/test/test_script.py
AU lang/py/test/word_count_task.py
A lang/py/test/av_bench.py
AU lang/py/test/test_tether_task_runner.py
A lang/py/test/sample_http_server.py
A lang/py/test/test_io.py
A lang/py/test/test_datafile.py
A lang/py/test/test_datafile_interop.py
A lang/py/test/test_ipc.py
AU lang/py/test/test_tether_task.py
AU lang/py/test/mock_tether_parent.py
A lang/py/test/sample_http_client.py
A lang/py/test/txsample_http_server.py
A lang/py/test/txsample_http_client.py
AU lang/py/test/set_avro_test_path.py
AU lang/py/test/test_tether_word_count.py
A lang/py/test/test_schema.py
A lang/py/test/test_protocol.py
A lang/py/test/gen_interop_data.py
AU lang/py/ivy.xml
A lang/py/lib
A lang/py/lib/pyAntTasks-1.3-LICENSE.txt
A lang/py/lib/simplejson
A lang/py/lib/simplejson/LICENSE.txt
A lang/py/lib/simplejson/scanner.py
A lang/py/lib/simplejson/tool.py
A lang/py/lib/simplejson/__init__.py
A lang/py/lib/simplejson/encoder.py
A lang/py/lib/simplejson/_speedups.c
A lang/py/lib/simplejson/decoder.py
A lang/py/lib/pyAntTasks-1.3.jar
AU lang/py/ivysettings.xml
A lang/py/scripts
A lang/py/scripts/avro
AU lang/py/setup.py
A lang/py/src
A lang/py/src/avro
A lang/py/src/avro/datafile.py
A lang/py/src/avro/ipc.py
A lang/py/src/avro/tool.py
A lang/py/src/avro/__init__.py
A lang/py/src/avro/schema.py
A lang/py/src/avro/protocol.py
A lang/py/src/avro/tether
AU lang/py/src/avro/tether/tether_task.py
AU lang/py/src/avro/tether/util.py
AU lang/py/src/avro/tether/__init__.py
AU lang/py/src/avro/tether/tether_task_runner.py
A lang/py/src/avro/io.py
A lang/py/src/avro/txipc.py
A share
A share/VERSION.txt
A share/schemas
A share/schemas/org
A share/schemas/org/apache
A share/schemas/org/apache/avro
A share/schemas/org/apache/avro/mapred
A share/schemas/org/apache/avro/mapred/tether
A share/schemas/org/apache/avro/mapred/tether/InputProtocol.avpr
A share/schemas/org/apache/avro/mapred/tether/OutputProtocol.avpr
A share/schemas/org/apache/avro/data
A share/schemas/org/apache/avro/data/Json.avsc
A share/schemas/org/apache/avro/ipc
A share/schemas/org/apache/avro/ipc/HandshakeRequest.avsc
A share/schemas/org/apache/avro/ipc/HandshakeResponse.avsc
A share/docker
A share/docker/Dockerfile
A share/editors
A share/editors/avro-idl.vim
A share/editors/README.txt
A share/rat-excludes.txt
A share/test
A share/test/interop
A share/test/interop/bin
AU share/test/interop/bin/test_rpc_interop.sh
A share/test/interop/rpc
A share/test/interop/rpc/hello
A share/test/interop/rpc/hello/world
AU share/test/interop/rpc/hello/world/request.avro
AU share/test/interop/rpc/hello/world/response.avro
A share/test/interop/rpc/add
A share/test/interop/rpc/add/onePlusOne
AU share/test/interop/rpc/add/onePlusOne/response.avro
AU share/test/interop/rpc/add/onePlusOne/request.avro
A share/test/interop/rpc/echo
A share/test/interop/rpc/echo/foo
AU share/test/interop/rpc/echo/foo/response.avro
AU share/test/interop/rpc/echo/foo/request.avro
A share/test/schemas
A share/test/schemas/stringables.avdl
A share/test/schemas/echo.avdl
A share/test/schemas/namespace.avpr
A share/test/schemas/http.avdl
A share/test/schemas/FooBarSpecificRecord.avsc
A share/test/schemas/mail.avpr
A share/test/schemas/reserved.avsc
A share/test/schemas/specialtypes.avdl
A share/test/schemas/weather.avsc
A share/test/schemas/interop.avsc
A share/test/schemas/contexts.avdl
A share/test/schemas/BulkData.avpr
A share/test/schemas/social.avdl
A share/test/schemas/simple.avpr
A share/test/data
AU share/test/data/weather.avro
A share/test/data/weather.json
AU share/test/data/test.avro12
AU share/test/data/weather-snappy.avro
AU share/test/data/schema-tests.txt
AU share/test/data/syncInMeta.avro
AU share/test/data/weather-sorted.avro
A .gitignore
A doc
A doc/build.xml
A doc/examples
A doc/examples/user.avsc
A doc/examples/java-example
A doc/examples/java-example/src
A doc/examples/java-example/src/main
A doc/examples/java-example/src/main/java
A doc/examples/java-example/src/main/java/example
AU doc/examples/java-example/src/main/java/example/SpecificMain.java
AU doc/examples/java-example/src/main/java/example/GenericMain.java
AU doc/examples/java-example/pom.xml
AU doc/examples/example.py
A doc/examples/mr-example
A doc/examples/mr-example/src
A doc/examples/mr-example/src/main
A doc/examples/mr-example/src/main/java
A doc/examples/mr-example/src/main/java/example
AU doc/examples/mr-example/src/main/java/example/AvroWordCount.java
AU doc/examples/mr-example/src/main/java/example/MapReduceColorCount.java
AU doc/examples/mr-example/src/main/java/example/MapredColorCount.java
AU doc/examples/mr-example/src/main/java/example/MapReduceAvroWordCount.java
AU doc/examples/mr-example/src/main/java/example/GenerateData.java
AU doc/examples/mr-example/pom.xml
A doc/forrest.properties
A doc/src
A doc/src/skinconf.xml
A doc/src/content
A doc/src/content/htmldocs
AU doc/src/content/htmldocs/canonical-completeness.html
A doc/src/content/xdocs
AU doc/src/content/xdocs/mr.xml
A doc/src/content/xdocs/sasl.xml
A doc/src/content/xdocs/site.xml
A doc/src/content/xdocs/index.xml
A doc/src/content/xdocs/idl.xml
A doc/src/content/xdocs/tabs.xml
AU doc/src/content/xdocs/gettingstartedjava.xml
AU doc/src/content/xdocs/gettingstartedpython.xml
A doc/src/content/xdocs/spec.xml
A doc/src/resources
A doc/src/resources/images
A doc/src/resources/images/favicon.ico
AU doc/src/resources/images/apache_feather.gif
AU doc/src/resources/images/avro-logo.png
AU doc/src/cli.xconf
A CHANGES.txt
AU build.sh
A pom.xml
U .
At revision 1707400
[py] $ /home/jenkins/tools/ant/latest/bin/ant -file build.xml test
Buildfile: <https://builds.apache.org/job/AVRO-python/ws/trunk/lang/py/build.xml>
init:
[mkdir] Created dir: <https://builds.apache.org/job/AVRO-python/ws/trunk/lang/py/build>
ivy-download:
[get] Getting: http://repo2.maven.org/maven2/org/apache/ivy/ivy/2.2.0/ivy-2.2.0.jar
[get] To: <https://builds.apache.org/job/AVRO-python/ws/trunk/lang/py/lib/ivy-2.2.0.jar>
build:
[copy] Copying 12 files to <https://builds.apache.org/job/AVRO-python/ws/trunk/lang/py/build/src>
[copy] Copying 19 files to <https://builds.apache.org/job/AVRO-python/ws/trunk/lang/py/build/test>
[copy] Copying 10 files to <https://builds.apache.org/job/AVRO-python/ws/trunk/lang/py/build/lib>
[copy] Copying 2 files to <https://builds.apache.org/job/AVRO-python/ws/trunk/lang/py/build/src/avro/tether>
[copy] Copying 1 file to <https://builds.apache.org/job/AVRO-python/ws/trunk/lang/py/build/src/avro>
[copy] Copying 1 file to <https://builds.apache.org/job/AVRO-python/ws/trunk/lang/py/build>
[copy] Copying 1 file to <https://builds.apache.org/job/AVRO-python/ws/trunk/lang/py/build/scripts>
[copy] Copying 1 file to <https://builds.apache.org/job/AVRO-python/ws/trunk/lang/py/build/test>
[ivy:retrieve] :: Ivy 2.2.0 - 20100923230623 :: http://ant.apache.org/ivy/ ::
[ivy:retrieve] :: loading settings :: file = <https://builds.apache.org/job/AVRO-python/ws/trunk/lang/py/ivysettings.xml>
[ivy:retrieve] :: resolving dependencies :: org.apache.avro#python;working@proserpina.apache.org
[ivy:retrieve] confs: [default]
[ivy:retrieve] :: resolution report :: resolve 1247ms :: artifacts dl 1ms
---------------------------------------------------------------------
| | modules || artifacts |
| conf | number| search|dwnlded|evicted|| number|dwnlded|
---------------------------------------------------------------------
| default | 1 | 0 | 0 | 0 || 0 | 0 |
---------------------------------------------------------------------
[ivy:retrieve]
[ivy:retrieve] :: problems summary ::
[ivy:retrieve] :::: WARNINGS
[ivy:retrieve] module not found: org.apache.avro#avro-tools;1.9.0-SNAPSHOT
[ivy:retrieve] ==== central: tried
[ivy:retrieve] http://repo1.maven.org/maven2/org/apache/avro/avro-tools/1.9.0-SNAPSHOT/avro-tools-1.9.0-SNAPSHOT.pom
[ivy:retrieve] -- artifact org.apache.avro#avro-tools;1.9.0-SNAPSHOT!avro-tools.jar:
[ivy:retrieve] http://repo1.maven.org/maven2/org/apache/avro/avro-tools/1.9.0-SNAPSHOT/avro-tools-1.9.0-SNAPSHOT.jar
[ivy:retrieve] ==== apache-snapshots: tried
[ivy:retrieve] https://repository.apache.org/content/groups/snapshots/org/apache/avro/avro-tools/1.9.0-SNAPSHOT/avro-tools-1.9.0-SNAPSHOT.pom
[ivy:retrieve] -- artifact org.apache.avro#avro-tools;1.9.0-SNAPSHOT!avro-tools.jar:
[ivy:retrieve] https://repository.apache.org/content/groups/snapshots/org/apache/avro/avro-tools/1.9.0-SNAPSHOT/avro-tools-1.9.0-SNAPSHOT.jar
[ivy:retrieve] ==== local-maven2: tried
[ivy:retrieve] /home/jenkins/.m2/repository/org/apache/avro/avro-tools/1.9.0-SNAPSHOT/avro-tools-1.9.0-SNAPSHOT.xml
[ivy:retrieve] -- artifact org.apache.avro#avro-tools;1.9.0-SNAPSHOT!avro-tools.jar:
[ivy:retrieve] /home/jenkins/.m2/repository/org/apache/avro/avro-tools/1.9.0-SNAPSHOT/avro-tools-1.9.0-SNAPSHOT.jar
[ivy:retrieve] ::::::::::::::::::::::::::::::::::::::::::::::
[ivy:retrieve] :: UNRESOLVED DEPENDENCIES ::
[ivy:retrieve] ::::::::::::::::::::::::::::::::::::::::::::::
[ivy:retrieve] :: org.apache.avro#avro-tools;1.9.0-SNAPSHOT: not found
[ivy:retrieve] ::::::::::::::::::::::::::::::::::::::::::::::
[ivy:retrieve] :::: ERRORS
[ivy:retrieve] Server access Error: java.lang.RuntimeException: Could not generate DH keypair url=https://repository.apache.org/content/groups/snapshots/org/apache/avro/avro-tools/1.9.0-SNAPSHOT/maven-metadata.xml
[ivy:retrieve] Server access Error: java.lang.RuntimeException: Could not generate DH keypair url=https://repository.apache.org/content/groups/snapshots/org/apache/avro/avro-tools/1.9.0-SNAPSHOT/avro-tools-1.9.0-SNAPSHOT.pom
[ivy:retrieve] Server access Error: java.lang.RuntimeException: Could not generate DH keypair url=https://repository.apache.org/content/groups/snapshots/org/apache/avro/avro-tools/1.9.0-SNAPSHOT/avro-tools-1.9.0-SNAPSHOT.jar
[ivy:retrieve]
[ivy:retrieve] :: USE VERBOSE OR DEBUG MESSAGE LEVEL FOR MORE DETAILS
BUILD FAILED
<https://builds.apache.org/job/AVRO-python/ws/trunk/lang/py/build.xml>:146: impossible to resolve dependencies:
resolve failed - see output for details
Total time: 2 seconds
Build step 'Invoke Ant' marked build as failure
Jenkins build is back to normal : AVRO-python #572
Posted by Apache Jenkins Server <je...@builds.apache.org>.
See <https://builds.apache.org/job/AVRO-python/572/changes>
Build failed in Jenkins: AVRO-python #571
Posted by Apache Jenkins Server <je...@builds.apache.org>.
See <https://builds.apache.org/job/AVRO-python/571/changes>
Changes:
[blue] AVRO-1733: C#: Add LICENSE and NOTICE to binary distribution.
------------------------------------------
Started by an SCM change
[EnvInject] - Loading node environment variables.
Building remotely on ubuntu-6 (docker Ubuntu ubuntu) in workspace <https://builds.apache.org/job/AVRO-python/ws/>
Reverting <https://builds.apache.org/job/AVRO-python/ws/trunk> to depth infinity with ignoreExternals: false
Updating https://svn.apache.org/repos/asf/avro/trunk at revision '2015-10-19T22:29:07.380 +0000'
U CHANGES.txt
U lang/csharp/README
A lang/csharp/NOTICE
A lang/csharp/LICENSE
U lang/csharp/build.sh
At revision 1709487
[py] $ /home/jenkins/tools/ant/latest/bin/ant -file build.xml test
Buildfile: <https://builds.apache.org/job/AVRO-python/ws/trunk/lang/py/build.xml>
init:
ivy-download:
build:
[copy] Copying 1 file to <https://builds.apache.org/job/AVRO-python/ws/trunk/lang/py/build/src/avro>
[copy] Copying 1 file to <https://builds.apache.org/job/AVRO-python/ws/trunk/lang/py/build>
[copy] Copying 1 file to <https://builds.apache.org/job/AVRO-python/ws/trunk/lang/py/build/scripts>
[copy] Copying 1 file to <https://builds.apache.org/job/AVRO-python/ws/trunk/lang/py/build/test>
[ivy:retrieve] :: Ivy 2.2.0 - 20100923230623 :: http://ant.apache.org/ivy/ ::
[ivy:retrieve] :: loading settings :: file = <https://builds.apache.org/job/AVRO-python/ws/trunk/lang/py/ivysettings.xml>
[ivy:retrieve] :: resolving dependencies :: org.apache.avro#python;working@priapus.apache.org
[ivy:retrieve] confs: [default]
[ivy:retrieve] :: resolution report :: resolve 1162ms :: artifacts dl 0ms
---------------------------------------------------------------------
| | modules || artifacts |
| conf | number| search|dwnlded|evicted|| number|dwnlded|
---------------------------------------------------------------------
| default | 1 | 0 | 0 | 0 || 0 | 0 |
---------------------------------------------------------------------
[ivy:retrieve]
[ivy:retrieve] :: problems summary ::
[ivy:retrieve] :::: WARNINGS
[ivy:retrieve] module not found: org.apache.avro#avro-tools;1.9.0-SNAPSHOT
[ivy:retrieve] ==== central: tried
[ivy:retrieve] http://repo1.maven.org/maven2/org/apache/avro/avro-tools/1.9.0-SNAPSHOT/avro-tools-1.9.0-SNAPSHOT.pom
[ivy:retrieve] -- artifact org.apache.avro#avro-tools;1.9.0-SNAPSHOT!avro-tools.jar:
[ivy:retrieve] http://repo1.maven.org/maven2/org/apache/avro/avro-tools/1.9.0-SNAPSHOT/avro-tools-1.9.0-SNAPSHOT.jar
[ivy:retrieve] ==== apache-snapshots: tried
[ivy:retrieve] https://repository.apache.org/content/groups/snapshots/org/apache/avro/avro-tools/1.9.0-SNAPSHOT/avro-tools-1.9.0-SNAPSHOT.pom
[ivy:retrieve] -- artifact org.apache.avro#avro-tools;1.9.0-SNAPSHOT!avro-tools.jar:
[ivy:retrieve] https://repository.apache.org/content/groups/snapshots/org/apache/avro/avro-tools/1.9.0-SNAPSHOT/avro-tools-1.9.0-SNAPSHOT.jar
[ivy:retrieve] ==== local-maven2: tried
[ivy:retrieve] /home/jenkins/.m2/repository/org/apache/avro/avro-tools/1.9.0-SNAPSHOT/avro-tools-1.9.0-SNAPSHOT.xml
[ivy:retrieve] -- artifact org.apache.avro#avro-tools;1.9.0-SNAPSHOT!avro-tools.jar:
[ivy:retrieve] /home/jenkins/.m2/repository/org/apache/avro/avro-tools/1.9.0-SNAPSHOT/avro-tools-1.9.0-SNAPSHOT.jar
[ivy:retrieve] ::::::::::::::::::::::::::::::::::::::::::::::
[ivy:retrieve] :: UNRESOLVED DEPENDENCIES ::
[ivy:retrieve] ::::::::::::::::::::::::::::::::::::::::::::::
[ivy:retrieve] :: org.apache.avro#avro-tools;1.9.0-SNAPSHOT: not found
[ivy:retrieve] ::::::::::::::::::::::::::::::::::::::::::::::
[ivy:retrieve] :::: ERRORS
[ivy:retrieve] Server access Error: java.lang.RuntimeException: Could not generate DH keypair url=https://repository.apache.org/content/groups/snapshots/org/apache/avro/avro-tools/1.9.0-SNAPSHOT/maven-metadata.xml
[ivy:retrieve] Server access Error: java.lang.RuntimeException: Could not generate DH keypair url=https://repository.apache.org/content/groups/snapshots/org/apache/avro/avro-tools/1.9.0-SNAPSHOT/avro-tools-1.9.0-SNAPSHOT.pom
[ivy:retrieve] Server access Error: java.lang.RuntimeException: Could not generate DH keypair url=https://repository.apache.org/content/groups/snapshots/org/apache/avro/avro-tools/1.9.0-SNAPSHOT/avro-tools-1.9.0-SNAPSHOT.jar
[ivy:retrieve]
[ivy:retrieve] :: USE VERBOSE OR DEBUG MESSAGE LEVEL FOR MORE DETAILS
BUILD FAILED
<https://builds.apache.org/job/AVRO-python/ws/trunk/lang/py/build.xml>:146: impossible to resolve dependencies:
resolve failed - see output for details
Total time: 2 seconds
Build step 'Invoke Ant' marked build as failure
Build failed in Jenkins: AVRO-python #570
Posted by Apache Jenkins Server <je...@builds.apache.org>.
See <https://builds.apache.org/job/AVRO-python/570/changes>
Changes:
[blue] AVRO-1732: C++: Add LICENSE and NOTICE to binary distribution.
[blue] AVRO-1729: Ruby: Add LICENSE and NOTICE to ruby gems.
------------------------------------------
Started by an SCM change
[EnvInject] - Loading node environment variables.
Building remotely on ubuntu-6 (docker Ubuntu ubuntu) in workspace <https://builds.apache.org/job/AVRO-python/ws/>
Reverting <https://builds.apache.org/job/AVRO-python/ws/trunk> to depth infinity with ignoreExternals: false
Updating https://svn.apache.org/repos/asf/avro/trunk at revision '2015-10-19T21:29:10.081 +0000'
A lang/ruby/NOTICE
A lang/ruby/LICENSE
U lang/ruby/Rakefile
U lang/ruby/Manifest
A lang/c++/NOTICE
A lang/c++/LICENSE
U lang/c++/README
U lang/c++/build.sh
U CHANGES.txt
At revision 1709483
[py] $ /home/jenkins/tools/ant/latest/bin/ant -file build.xml test
Buildfile: <https://builds.apache.org/job/AVRO-python/ws/trunk/lang/py/build.xml>
init:
ivy-download:
build:
[copy] Copying 1 file to <https://builds.apache.org/job/AVRO-python/ws/trunk/lang/py/build/src/avro>
[copy] Copying 1 file to <https://builds.apache.org/job/AVRO-python/ws/trunk/lang/py/build>
[copy] Copying 1 file to <https://builds.apache.org/job/AVRO-python/ws/trunk/lang/py/build/scripts>
[copy] Copying 1 file to <https://builds.apache.org/job/AVRO-python/ws/trunk/lang/py/build/test>
[ivy:retrieve] :: Ivy 2.2.0 - 20100923230623 :: http://ant.apache.org/ivy/ ::
[ivy:retrieve] :: loading settings :: file = <https://builds.apache.org/job/AVRO-python/ws/trunk/lang/py/ivysettings.xml>
[ivy:retrieve] :: resolving dependencies :: org.apache.avro#python;working@priapus.apache.org
[ivy:retrieve] confs: [default]
[ivy:retrieve] :: resolution report :: resolve 3065ms :: artifacts dl 0ms
---------------------------------------------------------------------
| | modules || artifacts |
| conf | number| search|dwnlded|evicted|| number|dwnlded|
---------------------------------------------------------------------
| default | 1 | 0 | 0 | 0 || 0 | 0 |
---------------------------------------------------------------------
[ivy:retrieve]
[ivy:retrieve] :: problems summary ::
[ivy:retrieve] :::: WARNINGS
[ivy:retrieve] module not found: org.apache.avro#avro-tools;1.9.0-SNAPSHOT
[ivy:retrieve] ==== central: tried
[ivy:retrieve] http://repo1.maven.org/maven2/org/apache/avro/avro-tools/1.9.0-SNAPSHOT/avro-tools-1.9.0-SNAPSHOT.pom
[ivy:retrieve] -- artifact org.apache.avro#avro-tools;1.9.0-SNAPSHOT!avro-tools.jar:
[ivy:retrieve] http://repo1.maven.org/maven2/org/apache/avro/avro-tools/1.9.0-SNAPSHOT/avro-tools-1.9.0-SNAPSHOT.jar
[ivy:retrieve] ==== apache-snapshots: tried
[ivy:retrieve] https://repository.apache.org/content/groups/snapshots/org/apache/avro/avro-tools/1.9.0-SNAPSHOT/avro-tools-1.9.0-SNAPSHOT.pom
[ivy:retrieve] -- artifact org.apache.avro#avro-tools;1.9.0-SNAPSHOT!avro-tools.jar:
[ivy:retrieve] https://repository.apache.org/content/groups/snapshots/org/apache/avro/avro-tools/1.9.0-SNAPSHOT/avro-tools-1.9.0-SNAPSHOT.jar
[ivy:retrieve] ==== local-maven2: tried
[ivy:retrieve] /home/jenkins/.m2/repository/org/apache/avro/avro-tools/1.9.0-SNAPSHOT/avro-tools-1.9.0-SNAPSHOT.xml
[ivy:retrieve] -- artifact org.apache.avro#avro-tools;1.9.0-SNAPSHOT!avro-tools.jar:
[ivy:retrieve] /home/jenkins/.m2/repository/org/apache/avro/avro-tools/1.9.0-SNAPSHOT/avro-tools-1.9.0-SNAPSHOT.jar
[ivy:retrieve] ::::::::::::::::::::::::::::::::::::::::::::::
[ivy:retrieve] :: UNRESOLVED DEPENDENCIES ::
[ivy:retrieve] ::::::::::::::::::::::::::::::::::::::::::::::
[ivy:retrieve] :: org.apache.avro#avro-tools;1.9.0-SNAPSHOT: not found
[ivy:retrieve] ::::::::::::::::::::::::::::::::::::::::::::::
[ivy:retrieve] :::: ERRORS
[ivy:retrieve] Server access Error: java.lang.RuntimeException: Could not generate DH keypair url=https://repository.apache.org/content/groups/snapshots/org/apache/avro/avro-tools/1.9.0-SNAPSHOT/maven-metadata.xml
[ivy:retrieve] Server access Error: java.lang.RuntimeException: Could not generate DH keypair url=https://repository.apache.org/content/groups/snapshots/org/apache/avro/avro-tools/1.9.0-SNAPSHOT/avro-tools-1.9.0-SNAPSHOT.pom
[ivy:retrieve] Server access Error: java.lang.RuntimeException: Could not generate DH keypair url=https://repository.apache.org/content/groups/snapshots/org/apache/avro/avro-tools/1.9.0-SNAPSHOT/avro-tools-1.9.0-SNAPSHOT.jar
[ivy:retrieve]
[ivy:retrieve] :: USE VERBOSE OR DEBUG MESSAGE LEVEL FOR MORE DETAILS
BUILD FAILED
<https://builds.apache.org/job/AVRO-python/ws/trunk/lang/py/build.xml>:146: impossible to resolve dependencies:
resolve failed - see output for details
Total time: 4 seconds
Build step 'Invoke Ant' marked build as failure
Build failed in Jenkins: AVRO-python #569
Posted by Apache Jenkins Server <je...@builds.apache.org>.
See <https://builds.apache.org/job/AVRO-python/569/>
------------------------------------------
[...truncated 1962 lines...]
A lang/py/src/avro/protocol.py
A lang/py/src/avro/tether
AU lang/py/src/avro/tether/tether_task_runner.py
AU lang/py/src/avro/tether/tether_task.py
AU lang/py/src/avro/tether/util.py
AU lang/py/src/avro/tether/__init__.py
A lang/py/src/avro/io.py
A lang/py/src/avro/txipc.py
A lang/py/src/avro/datafile.py
A lang/py/build.xml
A lang/py/test
A lang/py/test/txsample_http_client.py
AU lang/py/test/set_avro_test_path.py
AU lang/py/test/test_tether_word_count.py
A lang/py/test/test_schema.py
A lang/py/test/test_protocol.py
A lang/py/test/gen_interop_data.py
A lang/py/test/test_script.py
A lang/py/test/av_bench.py
AU lang/py/test/test_tether_task_runner.py
AU lang/py/test/word_count_task.py
A lang/py/test/test_io.py
A lang/py/test/sample_http_server.py
A lang/py/test/test_datafile.py
A lang/py/test/test_datafile_interop.py
A lang/py/test/test_ipc.py
AU lang/py/test/test_tether_task.py
AU lang/py/test/mock_tether_parent.py
A lang/py/test/sample_http_client.py
A lang/py/test/txsample_http_server.py
A lang/py3
A lang/py3/avro
AU lang/py3/avro/ipc.py
A lang/py3/avro/tests
AU lang/py3/avro/tests/av_bench.py
AU lang/py3/avro/tests/run_tests.py
AU lang/py3/avro/tests/sample_http_server.py
AU lang/py3/avro/tests/test_io.py
AU lang/py3/avro/tests/test_datafile.py
AU lang/py3/avro/tests/test_datafile_interop.py
AU lang/py3/avro/tests/test_ipc.py
AU lang/py3/avro/tests/txsample_http_client.py
AU lang/py3/avro/tests/sample_http_client.py
AU lang/py3/avro/tests/test_schema.py
AU lang/py3/avro/tests/test_protocol.py
AU lang/py3/avro/tests/gen_interop_data.py
AU lang/py3/avro/tests/txsample_http_server.py
A lang/py3/avro/tests/test_enum.py
AU lang/py3/avro/tests/test_script.py
AU lang/py3/avro/tool.py
AU lang/py3/avro/__init__.py
AU lang/py3/avro/schema.py
AU lang/py3/avro/protocol.py
AU lang/py3/avro/io.py
AU lang/py3/avro/txipc.py
AU lang/py3/avro/datafile.py
A lang/py3/scripts
A lang/py3/scripts/avro
AU lang/py3/setup.py
A lang/js
A lang/js/lib
AU lang/js/lib/validator.js
AU lang/js/build.sh
A lang/js/Gruntfile.js
AU lang/js/README
A lang/js/test
AU lang/js/test/validator.js
A lang/js/package.json
A share
A share/rat-excludes.txt
A share/test
A share/test/data
A share/test/data/weather.json
AU share/test/data/test.avro12
AU share/test/data/weather-snappy.avro
AU share/test/data/schema-tests.txt
AU share/test/data/syncInMeta.avro
AU share/test/data/weather-sorted.avro
AU share/test/data/weather.avro
A share/test/interop
A share/test/interop/bin
AU share/test/interop/bin/test_rpc_interop.sh
A share/test/interop/rpc
A share/test/interop/rpc/add
A share/test/interop/rpc/add/onePlusOne
AU share/test/interop/rpc/add/onePlusOne/response.avro
AU share/test/interop/rpc/add/onePlusOne/request.avro
A share/test/interop/rpc/echo
A share/test/interop/rpc/echo/foo
AU share/test/interop/rpc/echo/foo/request.avro
AU share/test/interop/rpc/echo/foo/response.avro
A share/test/interop/rpc/hello
A share/test/interop/rpc/hello/world
AU share/test/interop/rpc/hello/world/response.avro
AU share/test/interop/rpc/hello/world/request.avro
A share/test/schemas
A share/test/schemas/FooBarSpecificRecord.avsc
A share/test/schemas/mail.avpr
A share/test/schemas/reserved.avsc
A share/test/schemas/specialtypes.avdl
A share/test/schemas/weather.avsc
A share/test/schemas/interop.avsc
A share/test/schemas/contexts.avdl
A share/test/schemas/BulkData.avpr
A share/test/schemas/social.avdl
A share/test/schemas/simple.avpr
A share/test/schemas/stringables.avdl
A share/test/schemas/echo.avdl
A share/test/schemas/namespace.avpr
A share/test/schemas/http.avdl
A share/VERSION.txt
A share/schemas
A share/schemas/org
A share/schemas/org/apache
A share/schemas/org/apache/avro
A share/schemas/org/apache/avro/mapred
A share/schemas/org/apache/avro/mapred/tether
A share/schemas/org/apache/avro/mapred/tether/InputProtocol.avpr
A share/schemas/org/apache/avro/mapred/tether/OutputProtocol.avpr
A share/schemas/org/apache/avro/data
A share/schemas/org/apache/avro/data/Json.avsc
A share/schemas/org/apache/avro/ipc
A share/schemas/org/apache/avro/ipc/HandshakeRequest.avsc
A share/schemas/org/apache/avro/ipc/HandshakeResponse.avsc
A share/docker
A share/docker/Dockerfile
A share/editors
A share/editors/avro-idl.vim
A share/editors/README.txt
A .gitignore
A doc
A doc/src
AU doc/src/cli.xconf
A doc/src/skinconf.xml
A doc/src/content
A doc/src/content/htmldocs
AU doc/src/content/htmldocs/canonical-completeness.html
A doc/src/content/xdocs
AU doc/src/content/xdocs/gettingstartedjava.xml
AU doc/src/content/xdocs/gettingstartedpython.xml
A doc/src/content/xdocs/spec.xml
AU doc/src/content/xdocs/mr.xml
A doc/src/content/xdocs/sasl.xml
A doc/src/content/xdocs/site.xml
A doc/src/content/xdocs/index.xml
A doc/src/content/xdocs/idl.xml
A doc/src/content/xdocs/tabs.xml
A doc/src/resources
A doc/src/resources/images
AU doc/src/resources/images/avro-logo.png
A doc/src/resources/images/favicon.ico
AU doc/src/resources/images/apache_feather.gif
A doc/build.xml
A doc/examples
AU doc/examples/example.py
A doc/examples/mr-example
A doc/examples/mr-example/src
A doc/examples/mr-example/src/main
A doc/examples/mr-example/src/main/java
A doc/examples/mr-example/src/main/java/example
AU doc/examples/mr-example/src/main/java/example/AvroWordCount.java
AU doc/examples/mr-example/src/main/java/example/MapReduceColorCount.java
AU doc/examples/mr-example/src/main/java/example/MapredColorCount.java
AU doc/examples/mr-example/src/main/java/example/MapReduceAvroWordCount.java
AU doc/examples/mr-example/src/main/java/example/GenerateData.java
AU doc/examples/mr-example/pom.xml
A doc/examples/user.avsc
A doc/examples/java-example
AU doc/examples/java-example/pom.xml
A doc/examples/java-example/src
A doc/examples/java-example/src/main
A doc/examples/java-example/src/main/java
A doc/examples/java-example/src/main/java/example
AU doc/examples/java-example/src/main/java/example/GenericMain.java
AU doc/examples/java-example/src/main/java/example/SpecificMain.java
A doc/forrest.properties
A CHANGES.txt
AU build.sh
A pom.xml
AU README.txt
A BUILD.txt
A DIST_README.txt
U .
At revision 1708027
no change for https://svn.apache.org/repos/asf/avro/trunk since the previous build
[py] $ /home/jenkins/tools/ant/latest/bin/ant -file build.xml test
Buildfile: <https://builds.apache.org/job/AVRO-python/ws/trunk/lang/py/build.xml>
init:
[mkdir] Created dir: <https://builds.apache.org/job/AVRO-python/ws/trunk/lang/py/build>
ivy-download:
[get] Getting: http://repo2.maven.org/maven2/org/apache/ivy/ivy/2.2.0/ivy-2.2.0.jar
[get] To: <https://builds.apache.org/job/AVRO-python/ws/trunk/lang/py/lib/ivy-2.2.0.jar>
build:
[copy] Copying 12 files to <https://builds.apache.org/job/AVRO-python/ws/trunk/lang/py/build/src>
[copy] Copying 19 files to <https://builds.apache.org/job/AVRO-python/ws/trunk/lang/py/build/test>
[copy] Copying 10 files to <https://builds.apache.org/job/AVRO-python/ws/trunk/lang/py/build/lib>
[copy] Copying 2 files to <https://builds.apache.org/job/AVRO-python/ws/trunk/lang/py/build/src/avro/tether>
[copy] Copying 1 file to <https://builds.apache.org/job/AVRO-python/ws/trunk/lang/py/build/src/avro>
[copy] Copying 1 file to <https://builds.apache.org/job/AVRO-python/ws/trunk/lang/py/build>
[copy] Copying 1 file to <https://builds.apache.org/job/AVRO-python/ws/trunk/lang/py/build/scripts>
[copy] Copying 1 file to <https://builds.apache.org/job/AVRO-python/ws/trunk/lang/py/build/test>
[ivy:retrieve] :: Ivy 2.2.0 - 20100923230623 :: http://ant.apache.org/ivy/ ::
[ivy:retrieve] :: loading settings :: file = <https://builds.apache.org/job/AVRO-python/ws/trunk/lang/py/ivysettings.xml>
[ivy:retrieve] :: resolving dependencies :: org.apache.avro#python;working@priapus.apache.org
[ivy:retrieve] confs: [default]
[ivy:retrieve] :: resolution report :: resolve 1264ms :: artifacts dl 0ms
---------------------------------------------------------------------
| | modules || artifacts |
| conf | number| search|dwnlded|evicted|| number|dwnlded|
---------------------------------------------------------------------
| default | 1 | 0 | 0 | 0 || 0 | 0 |
---------------------------------------------------------------------
[ivy:retrieve]
[ivy:retrieve] :: problems summary ::
[ivy:retrieve] :::: WARNINGS
[ivy:retrieve] module not found: org.apache.avro#avro-tools;1.9.0-SNAPSHOT
[ivy:retrieve] ==== central: tried
[ivy:retrieve] http://repo1.maven.org/maven2/org/apache/avro/avro-tools/1.9.0-SNAPSHOT/avro-tools-1.9.0-SNAPSHOT.pom
[ivy:retrieve] -- artifact org.apache.avro#avro-tools;1.9.0-SNAPSHOT!avro-tools.jar:
[ivy:retrieve] http://repo1.maven.org/maven2/org/apache/avro/avro-tools/1.9.0-SNAPSHOT/avro-tools-1.9.0-SNAPSHOT.jar
[ivy:retrieve] ==== apache-snapshots: tried
[ivy:retrieve] https://repository.apache.org/content/groups/snapshots/org/apache/avro/avro-tools/1.9.0-SNAPSHOT/avro-tools-1.9.0-SNAPSHOT.pom
[ivy:retrieve] -- artifact org.apache.avro#avro-tools;1.9.0-SNAPSHOT!avro-tools.jar:
[ivy:retrieve] https://repository.apache.org/content/groups/snapshots/org/apache/avro/avro-tools/1.9.0-SNAPSHOT/avro-tools-1.9.0-SNAPSHOT.jar
[ivy:retrieve] ==== local-maven2: tried
[ivy:retrieve] /home/jenkins/.m2/repository/org/apache/avro/avro-tools/1.9.0-SNAPSHOT/avro-tools-1.9.0-SNAPSHOT.xml
[ivy:retrieve] -- artifact org.apache.avro#avro-tools;1.9.0-SNAPSHOT!avro-tools.jar:
[ivy:retrieve] /home/jenkins/.m2/repository/org/apache/avro/avro-tools/1.9.0-SNAPSHOT/avro-tools-1.9.0-SNAPSHOT.jar
[ivy:retrieve] ::::::::::::::::::::::::::::::::::::::::::::::
[ivy:retrieve] :: UNRESOLVED DEPENDENCIES ::
[ivy:retrieve] ::::::::::::::::::::::::::::::::::::::::::::::
[ivy:retrieve] :: org.apache.avro#avro-tools;1.9.0-SNAPSHOT: not found
[ivy:retrieve] ::::::::::::::::::::::::::::::::::::::::::::::
[ivy:retrieve] :::: ERRORS
[ivy:retrieve] Server access Error: java.lang.RuntimeException: Could not generate DH keypair url=https://repository.apache.org/content/groups/snapshots/org/apache/avro/avro-tools/1.9.0-SNAPSHOT/maven-metadata.xml
[ivy:retrieve] Server access Error: java.lang.RuntimeException: Could not generate DH keypair url=https://repository.apache.org/content/groups/snapshots/org/apache/avro/avro-tools/1.9.0-SNAPSHOT/avro-tools-1.9.0-SNAPSHOT.pom
[ivy:retrieve] Server access Error: java.lang.RuntimeException: Could not generate DH keypair url=https://repository.apache.org/content/groups/snapshots/org/apache/avro/avro-tools/1.9.0-SNAPSHOT/avro-tools-1.9.0-SNAPSHOT.jar
[ivy:retrieve]
[ivy:retrieve] :: USE VERBOSE OR DEBUG MESSAGE LEVEL FOR MORE DETAILS
BUILD FAILED
<https://builds.apache.org/job/AVRO-python/ws/trunk/lang/py/build.xml>:146: impossible to resolve dependencies:
resolve failed - see output for details
Total time: 3 seconds
Build step 'Invoke Ant' marked build as failure